[INFO] Scanning for projects...
[INFO]                                                                         
[INFO] ------------------------------------------------------------------------
[INFO] Building Apache Commons Codec 1.10
[INFO] ------------------------------------------------------------------------
[INFO] 
[INFO] --- maven-enforcer-plugin:1.3.1:enforce (enforce-maven-3) @ commons-codec ---
[INFO] 
[INFO] --- maven-antrun-plugin:1.7:run (javadoc.resources) @ commons-codec ---
[INFO] Executing tasks

main:
[INFO] Executed tasks
[INFO] 
[INFO] --- maven-remote-resources-plugin:1.5:process (default) @ commons-codec ---
[INFO] 
[INFO] --- buildnumber-maven-plugin:1.3:create (default) @ commons-codec ---
[INFO] Executing: /bin/sh -c cd /home/perham/Study/LittleDarwin/Cases/commons-codec-1.10-src && svn --non-interactive info
[INFO] Working directory: /home/perham/Study/LittleDarwin/Cases/commons-codec-1.10-src
[INFO] Storing buildNumber: ?????? at timestamp: 1438492979256
[INFO] Executing: /bin/sh -c cd /home/perham/Study/LittleDarwin/Cases/commons-codec-1.10-src && svn --non-interactive info
[INFO] Working directory: /home/perham/Study/LittleDarwin/Cases/commons-codec-1.10-src
[INFO] Storing buildScmBranch: UNKNOWN_BRANCH
[INFO] 
[INFO] --- maven-resources-plugin:2.7:resources (default-resources) @ commons-codec ---
[INFO] Using 'UTF-8' encoding to copy filtered resources.
[INFO] Copying 128 resources
[INFO] Copying 2 resources to META-INF
[INFO] 
[INFO] --- maven-compiler-plugin:3.2:compile (default-compile) @ commons-codec ---
[INFO] Changes detected - recompiling the module!
[INFO] Compiling 60 source files to /home/perham/Study/LittleDarwin/Cases/commons-codec-1.10-src/target/classes
[INFO] /home/perham/Study/LittleDarwin/Cases/commons-codec-1.10-src/src/main/java/org/apache/commons/codec/digest/Sha2Crypt.java: Some input files use or override a deprecated API.
[INFO] /home/perham/Study/LittleDarwin/Cases/commons-codec-1.10-src/src/main/java/org/apache/commons/codec/digest/Sha2Crypt.java: Recompile with -Xlint:deprecation for details.
[INFO] 
[INFO] --- maven-bundle-plugin:2.5.3:manifest (bundle-manifest) @ commons-codec ---
[INFO] 
[INFO] --- maven-resources-plugin:2.7:testResources (default-testResources) @ commons-codec ---
[INFO] Using 'UTF-8' encoding to copy filtered resources.
[INFO] skip non existing resourceDirectory /home/perham/Study/LittleDarwin/Cases/commons-codec-1.10-src/src/test/resources
[INFO] Copying 2 resources to META-INF
[INFO] 
[INFO] --- maven-compiler-plugin:3.2:testCompile (default-testCompile) @ commons-codec ---
[INFO] Nothing to compile - all classes are up to date
[INFO] 
[INFO] --- maven-surefire-plugin:2.17:test (default-test) @ commons-codec ---
[INFO] Surefire report directory: /home/perham/Study/LittleDarwin/Cases/commons-codec-1.10-src/target/surefire-reports

-------------------------------------------------------
 T E S T S
-------------------------------------------------------
Running org.apache.commons.codec.digest.B64Test
Tests run: 2, Failures: 0, Errors: 0, Skipped: 0, Time elapsed: 0.031 sec - in org.apache.commons.codec.digest.B64Test
Running org.apache.commons.codec.digest.DigestUtilsTest
Tests run: 17, Failures: 0, Errors: 0, Skipped: 0, Time elapsed: 0.673 sec - in org.apache.commons.codec.digest.DigestUtilsTest
Running org.apache.commons.codec.digest.Sha512CryptTest
Tests run: 8, Failures: 0, Errors: 0, Skipped: 0, Time elapsed: 0.479 sec - in org.apache.commons.codec.digest.Sha512CryptTest
Running org.apache.commons.codec.digest.Apr1CryptTest
Tests run: 8, Failures: 0, Errors: 0, Skipped: 0, Time elapsed: 0.09 sec - in org.apache.commons.codec.digest.Apr1CryptTest
Running org.apache.commons.codec.digest.HmacUtilsTest
Tests run: 24, Failures: 0, Errors: 0, Skipped: 0, Time elapsed: 0.039 sec - in org.apache.commons.codec.digest.HmacUtilsTest
Running org.apache.commons.codec.digest.Sha2CryptTest
Tests run: 1, Failures: 0, Errors: 0, Skipped: 0, Time elapsed: 0 sec - in org.apache.commons.codec.digest.Sha2CryptTest
Running org.apache.commons.codec.digest.CryptTest
Tests run: 4, Failures: 0, Errors: 0, Skipped: 0, Time elapsed: 0.108 sec - in org.apache.commons.codec.digest.CryptTest
Running org.apache.commons.codec.digest.Sha256CryptTest
Tests run: 7, Failures: 0, Errors: 0, Skipped: 0, Time elapsed: 0.109 sec - in org.apache.commons.codec.digest.Sha256CryptTest
Running org.apache.commons.codec.digest.Md5CryptTest
Tests run: 7, Failures: 0, Errors: 0, Skipped: 0, Time elapsed: 0.016 sec - in org.apache.commons.codec.digest.Md5CryptTest
Running org.apache.commons.codec.digest.UnixCryptTest
Tests run: 9, Failures: 0, Errors: 0, Skipped: 0, Time elapsed: 0.01 sec - in org.apache.commons.codec.digest.UnixCryptTest
Running org.apache.commons.codec.CharsetsTest
Tests run: 7, Failures: 0, Errors: 0, Skipped: 0, Time elapsed: 0.001 sec - in org.apache.commons.codec.CharsetsTest
Running org.apache.commons.codec.binary.Base32Test
Tests run: 8, Failures: 0, Errors: 0, Skipped: 0, Time elapsed: 0.005 sec - in org.apache.commons.codec.binary.Base32Test
Running org.apache.commons.codec.binary.Base64OutputStreamTest
Tests run: 7, Failures: 2, Errors: 0, Skipped: 0, Time elapsed: 0.011 sec <<< FAILURE! - in org.apache.commons.codec.binary.Base64OutputStreamTest
testBase64OutputStreamByteByByte(org.apache.commons.codec.binary.Base64OutputStreamTest)  Time elapsed: 0.007 sec  <<< FAILURE!
java.lang.AssertionError: Streaming byte-by-byte base64 encode
	at org.junit.Assert.fail(Assert.java:88)
	at org.junit.Assert.assertTrue(Assert.java:41)
	at org.apache.commons.codec.binary.Base64OutputStreamTest.testByteByByte(Base64OutputStreamTest.java:249)
	at org.apache.commons.codec.binary.Base64OutputStreamTest.testBase64OutputStreamByteByByte(Base64OutputStreamTest.java:144)

testBase64OutputStreamByChunk(org.apache.commons.codec.binary.Base64OutputStreamTest)  Time elapsed: 0 sec  <<< FAILURE!
java.lang.AssertionError: Streaming chunked base64 encode
	at org.junit.Assert.fail(Assert.java:88)
	at org.junit.Assert.assertTrue(Assert.java:41)
	at org.apache.commons.codec.binary.Base64OutputStreamTest.testByChunk(Base64OutputStreamTest.java:197)
	at org.apache.commons.codec.binary.Base64OutputStreamTest.testBase64OutputStreamByChunk(Base64OutputStreamTest.java:106)

Running org.apache.commons.codec.binary.Base64Codec13Test
Tests run: 8, Failures: 4, Errors: 0, Skipped: 0, Time elapsed: 0.015 sec <<< FAILURE! - in org.apache.commons.codec.binary.Base64Codec13Test
testEncoder(org.apache.commons.codec.binary.Base64Codec13Test)  Time elapsed: 0 sec  <<< FAILURE!
java.lang.AssertionError: Encoder test-1
	at org.junit.Assert.fail(Assert.java:88)
	at org.junit.Assert.assertTrue(Assert.java:41)
	at org.apache.commons.codec.binary.Base64Codec13Test.testEncoder(Base64Codec13Test.java:372)

testBinaryEncoder(org.apache.commons.codec.binary.Base64Codec13Test)  Time elapsed: 0 sec  <<< FAILURE!
java.lang.AssertionError: BinaryEncoder test-1
	at org.junit.Assert.fail(Assert.java:88)
	at org.junit.Assert.assertTrue(Assert.java:41)
	at org.apache.commons.codec.binary.Base64Codec13Test.testBinaryEncoder(Base64Codec13Test.java:410)

testStaticEncodeChunked(org.apache.commons.codec.binary.Base64Codec13Test)  Time elapsed: 0.001 sec  <<< FAILURE!
java.lang.AssertionError: static Base64.encodeBase64Chunked() test-1
	at org.junit.Assert.fail(Assert.java:88)
	at org.junit.Assert.assertTrue(Assert.java:41)
	at org.apache.commons.codec.binary.Base64Codec13Test.testStaticEncodeChunked(Base64Codec13Test.java:483)

testStaticEncode(org.apache.commons.codec.binary.Base64Codec13Test)  Time elapsed: 0 sec  <<< FAILURE!
java.lang.AssertionError: static Base64.encodeBase64() test-1
	at org.junit.Assert.fail(Assert.java:88)
	at org.junit.Assert.assertTrue(Assert.java:41)
	at org.apache.commons.codec.binary.Base64Codec13Test.testStaticEncode(Base64Codec13Test.java:447)

Running org.apache.commons.codec.binary.Base64InputStreamTest
Tests run: 19, Failures: 3, Errors: 0, Skipped: 0, Time elapsed: 0.011 sec <<< FAILURE! - in org.apache.commons.codec.binary.Base64InputStreamTest
testBase64InputStreamByChunk(org.apache.commons.codec.binary.Base64InputStreamTest)  Time elapsed: 0 sec  <<< FAILURE!
java.lang.AssertionError: Streaming base64 encode
	at org.junit.Assert.fail(Assert.java:88)
	at org.junit.Assert.assertTrue(Assert.java:41)
	at org.apache.commons.codec.binary.Base64InputStreamTest.testByChunk(Base64InputStreamTest.java:308)
	at org.apache.commons.codec.binary.Base64InputStreamTest.testBase64InputStreamByChunk(Base64InputStreamTest.java:216)

testCodec130(org.apache.commons.codec.binary.Base64InputStreamTest)  Time elapsed: 0.001 sec  <<< FAILURE!
org.junit.ComparisonFailure: expected:<[ello World]> but was:<[����ਐ���]>
	at org.junit.Assert.assertEquals(Assert.java:115)
	at org.junit.Assert.assertEquals(Assert.java:144)
	at org.apache.commons.codec.binary.Base64InputStreamTest.testCodec130(Base64InputStreamTest.java:73)

testBase64InputStreamByteByByte(org.apache.commons.codec.binary.Base64InputStreamTest)  Time elapsed: 0 sec  <<< FAILURE!
java.lang.AssertionError: Streaming base64 encode
	at org.junit.Assert.fail(Assert.java:88)
	at org.junit.Assert.assertTrue(Assert.java:41)
	at org.apache.commons.codec.binary.Base64InputStreamTest.testByteByByte(Base64InputStreamTest.java:364)
	at org.apache.commons.codec.binary.Base64InputStreamTest.testBase64InputStreamByteByByte(Base64InputStreamTest.java:254)

Running org.apache.commons.codec.binary.Base32InputStreamTest
Tests run: 16, Failures: 0, Errors: 0, Skipped: 0, Time elapsed: 0.144 sec - in org.apache.commons.codec.binary.Base32InputStreamTest
Running org.apache.commons.codec.binary.Base32OutputStreamTest
Tests run: 6, Failures: 0, Errors: 0, Skipped: 0, Time elapsed: 0.108 sec - in org.apache.commons.codec.binary.Base32OutputStreamTest
Running org.apache.commons.codec.binary.BinaryCodecTest
Tests run: 13, Failures: 0, Errors: 0, Skipped: 0, Time elapsed: 0.012 sec - in org.apache.commons.codec.binary.BinaryCodecTest
Running org.apache.commons.codec.binary.BaseNCodecTest
Tests run: 7, Failures: 0, Errors: 0, Skipped: 0, Time elapsed: 0.003 sec - in org.apache.commons.codec.binary.BaseNCodecTest
Running org.apache.commons.codec.binary.StringUtilsTest
Tests run: 17, Failures: 0, Errors: 0, Skipped: 0, Time elapsed: 0.03 sec - in org.apache.commons.codec.binary.StringUtilsTest
Running org.apache.commons.codec.binary.Base64Test
Tests run: 53, Failures: 26, Errors: 0, Skipped: 1, Time elapsed: 0.05 sec <<< FAILURE! - in org.apache.commons.codec.binary.Base64Test
testTriplets(org.apache.commons.codec.binary.Base64Test)  Time elapsed: 0 sec  <<< FAILURE!
org.junit.ComparisonFailure: expected:<[AAAB]> but was:<[////]>
	at org.junit.Assert.assertEquals(Assert.java:115)
	at org.junit.Assert.assertEquals(Assert.java:144)
	at org.apache.commons.codec.binary.Base64Test.testTriplets(Base64Test.java:941)

testConstructor_Int_ByteArray_Boolean_UrlSafe(org.apache.commons.codec.binary.Base64Test)  Time elapsed: 0.001 sec  <<< FAILURE!
org.junit.ComparisonFailure: new Base64(64, \t, true) expected:<[C3wz1PrRi0d4_WFkSMKKtdvax5TTpNnRtwhiQRg9eUMmPTFHQXNc1ck4cIIopslD	O_EkA64OWpjbUmewEXYhjI28CI-3GgsIuCNA7iclcNKfQHmoyY7tHp2ioz03AGWC	V-WtTwWiWpD9yqnOKjLKAKPO9Bbg_F9RuriDjtUBaSDE_7iUsqH6z9YLB7PS_dnj	dQOSMYBk0zDWJchQVa3HJSwD2E9UDQV6EKTGBp_801QaArXRQNlydBxjzrgdvL21	d0b5RFWDxPrgQvVe81M8QA_SfXLjswmNn57O9wG6qUaiIvvjfjd44YWjiHqssw5v	rkoi1keCBrIhk23ZfATwozI4n-N0mEOTC4puK0rkuivFwUPZA3awpOx0hVB2m2tY	_QdqSiTiUoN5k37mAAeaUHWBcDLcLfCWIGeWKlN6zCCEH_0ttlmEphN7kmOL9O9B	vXVhCJr5ANa_uYt3yYHUtLXmIRrlyQxZWb-I8CqFrSCmSdY-2UPCPd2kzaBDbWJH	K3rP-5_IjrOfLhlPbIx9pYP4CG7cSZpy1P9uwLOdpP30O8cOfP_6GuDhbC4DkqdL	SezmQZHZ8jHRlyXu7KuZmynQkdrraqw0C7jbQ2ptpiFefpiALzO5__DexzGrYZVX	Ap50Er8WGCU_3iyw9Xht2l_c7S_S00GNXfxmGhB0MqcR-GzovaxbllsTvUvAWolH	mHqh7lYSCr1KgdKtDc2x69JxZohlOWLlYxBrpBkgN7i43b3w9lmWKz1q9I1SdxtD	-2KTExMAJ2131QX8HrySaMqKs59-B1_ZZcuWv-Vpa2Zgc4wAX4yn1xZmAR3wxTQh	8YVejni9ZgN-nRqEC4dAK4DTd82EGqgUU64jjkxAXy9XdFGmP2t5giwyKy8yyx1C	BtEoLqosfXnoU-qInEnl9DPgAYVkdZUJaZITuNWCvTf2Miu8kgyvbL6Hw0N1gTr8	ahWdTKvjqIg8qK03SdNQ_IRlqyv3uOelnOlB9AoOJVOXZFQRi0CKaIVLjjhRIG3k	lxduOE3aBA5PqJar1ilyQnq688KN-uhGnJ9QvkCXLDDbIACJV5uHGCIz9dRxwpjU	8pPstezL7NpM6yoL6DkZM4YodcXO7AchHTAbCk-jEN2jupu-NdeKpjNX_dx47b-U	4Bi-sflbRDTv8XzfHm3_-if5gXmsNj0Wuhv70mmItaHNtZMTGQvPv6e81kCCggAI	UkK2_XFQdghZfOqh3TlKkGadoM_WoTE3bwQa9FgmEoHnmYivXblPnaRJjfDyqBR6	AFoA4mdbXDlTLxWcbyiz6ReQR5ac-VUn1yrdAftennjMFf6BUAMGdp_dWo2vpKVW	I90noim7mAqVVohrcSyARK]A	> but was:<[9IPNKwUvdLiIAp6ctz12SiQmOGstWyYvSPeevufDhrzaws65voykKjbIj33YWTa9	xA7c_FHypWclrZhQ7onfc3JE93BJ5fT4R9zAEdjbjy1hv4ZYNnET4WJeXMLJ_5p-	qBpTsPpepW8DNVYy1c02_1wyC-kgA6CvRUd9cSr_lt88AEdsTV4GMCn1-EwuAiYd	ivxuzn-cLM8q2jewqlI52tP9J7Cs8vqG71s6-WAELKvm_UovvyaOi-OdMUfjQ0JL	iLkHu6p9OwUgvQqiDKzEv_Augo0dTPZzYGEyCP5GVrle3QQdgciIHnpdd4VUTPGR	UbXeKbh--U3fbJIng_sQXM3IYByMZ7xt9HWS1LUcRdQ7Prwn_IlQWxOMeq-KZJSo	AviWtdserXyHbIEa__hmr4p_j80k0g9q35hq1ayGM9984ALTSaZ8WeyFbZx1CxC_	Qoqf92UH_ylBRnSJNn4sS0oa3uUbNvOnpkB4D9V7Ut9atinCJrw-wiJcMl-9kp25	1IUxBGA4cUxh0eaxk3ODWnwI95EktmWOKwCSP0xjWwIMxDjygwAG5R8fk9H9bVi1	thMavm4nDc4vaNoSE1RnZNYwbiUVlVPM9EclvJWTWd6igWeA0MxHAA8iOM5Vnmqp	_WGM7UDq59rBIdNQCoeTJaAkEtAuLL5zogOa5e-MzVjvB5MYQlOlaaTtQrRApXa5	Z4VfEanu9UK2fi1T8jJPFC2PmXebxp0bnO-VW-bgyEdIIkIQCaZq1MKWC3KuiOS9	BJ1t7O0A2JKJKvoE4UNulzV2TGCC-KAnmjRqQBqXlJmgjHQAoHNZKOma_uIQOsvf	DnqicYdDmfyCYuV89HjA1H8tiDJ85VfsrFHdcbPAoNCpi65awJSHfdPO1NDONOK-	-S7Y0VXUgoYYrBV4Y7YbC8wg_nqcimr3lm3tRyp-QsgKzdREbfNRk0F5PLyLfsUE	lepjs1QdV3fEV1LJtiywA3ubVNQJRxhbYxa_C_Xy2qxpm6vvdL92l3q1ccev35Ic	aOiSx7Im-_GxV2lVKdaOvYVGDD1zBRe6Y2CwQb9p088l3_93qGR5593NCiuPPWcs	DWwUShM1EyW0FNX1F8bnzHnYijoyE_jf4s_l9bBd7yJdRWRCyih2WcypAiOIEkBs	H-dCTgalu8sRDoMh4ZIBBdgHfoZUycLqReQFLZZ4Sl4zSmzt5vQxQFhEKb9-ff_4	rb1KAo6wifengxVfIsa2b5ljXzAqXs7JkPvmC6fa7X4ZZndRokaxYlu3cg8OV-uG	_6YAHZilo8at0OpkkNdNFuhwuGlkBqrZKNUj_gSiYYc06gF_r_z6iWAjpXJRW1qq	3CLZXdZFZ_VrqXeVjtOAu2]A	>
	at org.junit.Assert.assertEquals(Assert.java:115)
	at org.apache.commons.codec.binary.Base64Test.testConstructor_Int_ByteArray_Boolean_UrlSafe(Base64Test.java:264)

testSingletonsChunked(org.apache.commons.codec.binary.Base64Test)  Time elapsed: 0.001 sec  <<< FAILURE!
org.junit.ComparisonFailure: expected:<[AQ]==
> but was:<[/w]==
>
	at org.junit.Assert.assertEquals(Assert.java:115)
	at org.junit.Assert.assertEquals(Assert.java:144)
	at org.apache.commons.codec.binary.Base64Test.testSingletonsChunked(Base64Test.java:832)

testPairs(org.apache.commons.codec.binary.Base64Test)  Time elapsed: 0 sec  <<< FAILURE!
java.lang.AssertionError: null
	at org.junit.Assert.fail(Assert.java:86)
	at org.junit.Assert.assertTrue(Assert.java:41)
	at org.junit.Assert.assertTrue(Assert.java:52)
	at org.apache.commons.codec.binary.Base64Test.testPairs(Base64Test.java:550)

testUUID(org.apache.commons.codec.binary.Base64Test)  Time elapsed: 0.001 sec  <<< FAILURE!
java.lang.AssertionError: standard encode uuid
	at org.junit.Assert.fail(Assert.java:88)
	at org.junit.Assert.assertTrue(Assert.java:41)
	at org.apache.commons.codec.binary.Base64Test.testUUID(Base64Test.java:1180)

testEncodeDecodeSmall(org.apache.commons.codec.binary.Base64Test)  Time elapsed: 0.001 sec  <<< FAILURE!
java.lang.AssertionError: -25 equals 25
	at org.junit.Assert.fail(Assert.java:88)
	at org.junit.Assert.assertTrue(Assert.java:41)
	at org.apache.commons.codec.binary.Base64Test.testEncodeDecodeSmall(Base64Test.java:365)

testObjectDecodeWithValidParameter(org.apache.commons.codec.binary.Base64Test)  Time elapsed: 0 sec  <<< FAILURE!
org.junit.ComparisonFailure: dest string does not equal original expected:<[Hello World!]> but was:<[�����ਐ����]>
	at org.junit.Assert.assertEquals(Assert.java:115)
	at org.apache.commons.codec.binary.Base64Test.testObjectDecodeWithValidParameter(Base64Test.java:511)

testCodeInteger1(org.apache.commons.codec.binary.Base64Test)  Time elapsed: 0.003 sec  <<< FAILURE!
org.junit.ComparisonFailure: expected:<[li7dzDacuo67Jg7mtqEm2TRuOMU]=> but was:<[adEjM8lkRXFF2fEaSV7aJsuSxzs]=>
	at org.junit.Assert.assertEquals(Assert.java:115)
	at org.junit.Assert.assertEquals(Assert.java:144)
	at org.apache.commons.codec.binary.Base64Test.testCodeInteger1(Base64Test.java:149)

testCodeInteger2(org.apache.commons.codec.binary.Base64Test)  Time elapsed: 0.001 sec  <<< FAILURE!
org.junit.ComparisonFailure: expected:<[9B5ypLY9pMOmtxCeTDHgwdNFeGs]=> but was:<[C+GOW0nDWzxaSO9is84gPiy7h5U]=>
	at org.junit.Assert.assertEquals(Assert.java:115)
	at org.junit.Assert.assertEquals(Assert.java:144)
	at org.apache.commons.codec.binary.Base64Test.testCodeInteger2(Base64Test.java:158)

testCodeInteger3(org.apache.commons.codec.binary.Base64Test)  Time elapsed: 0.001 sec  <<< FAILURE!
org.junit.ComparisonFailure: expected:<[FKIhdgaG5LGKiEtF1vHy4f3y700zaD6QwDS3IrNVGzNp2rY+1LFWTK6D44AyiC1n8uWz1itkYMZF0/aKDK0Yj]g==> but was:<[613fifl6G052d7S7KQ4OHgIOELLNl8FwP8tJ3Uyr5MyXJUnCK06qs1F9HH/Od9KZDRpNKdScnzm7LAl281Loc]g==>
	at org.junit.Assert.assertEquals(Assert.java:115)
	at org.junit.Assert.assertEquals(Assert.java:144)
	at org.apache.commons.codec.binary.Base64Test.testCodeInteger3(Base64Test.java:169)

testCodeInteger4(org.apache.commons.codec.binary.Base64Test)  Time elapsed: 0.001 sec  <<< FAILURE!
org.junit.ComparisonFailure: expected:<[ctA8YGxrtngg/zKVvqEOefnwmViFztcnPBYPlJsvh6yKI4iDm68fnp4Mi3RrJ6bZAygFrUIQLxLjV+OJtgJAEto0xAs+Mehuq1DkSFEpP3oDzCTOsrOiS1DwQe4oIb7zVk/9l7aPtJMHW0LVlMdwZNFNNJoqMcT2ZfCPrfvYvQ0]=> but was:<[jS/En5OVSYfgAM1rQV7yhgYQZqd7MSjZw+nxa2TReFN23Hd9ZFDhYWH0dIuV2Fkn/Nf7Ur3w0O0dqBx3Sf3A7SXMO/TCzheSVK8ct67XwIX9M9syTUxetK8QvhHY3kENqbADaElxS2z5pL0raziQmy6zy2XWzjsKmg9xUgQoQvM]=>
	at org.junit.Assert.assertEquals(Assert.java:115)
	at org.junit.Assert.assertEquals(Assert.java:144)
	at org.apache.commons.codec.binary.Base64Test.testCodeInteger4(Base64Test.java:186)

testObjectEncode(org.apache.commons.codec.binary.Base64Test)  Time elapsed: 0 sec  <<< FAILURE!
org.junit.ComparisonFailure: expected:<[SGVsbG8gV29ybGQ]=> but was:<[t5qUk5DgqJCOk5w]=>
	at org.junit.Assert.assertEquals(Assert.java:115)
	at org.junit.Assert.assertEquals(Assert.java:144)
	at org.apache.commons.codec.binary.Base64Test.testObjectEncode(Base64Test.java:542)

testUrlSafe(org.apache.commons.codec.binary.Base64Test)  Time elapsed: 0 sec  <<< FAILURE!
java.lang.AssertionError: url-safe i=1
	at org.junit.Assert.fail(Assert.java:88)
	at org.junit.Assert.assertTrue(Assert.java:41)
	at org.apache.commons.codec.binary.Base64Test.testUrlSafe(Base64Test.java:1085)

testEncodeDecodeRandom(org.apache.commons.codec.binary.Base64Test)  Time elapsed: 0.003 sec  <<< FAILURE!
java.lang.AssertionError: null
	at org.junit.Assert.fail(Assert.java:86)
	at org.junit.Assert.assertTrue(Assert.java:41)
	at org.junit.Assert.assertTrue(Assert.java:52)
	at org.apache.commons.codec.binary.Base64Test.testEncodeDecodeRandom(Base64Test.java:352)

testDecodeWithWhitespace(org.apache.commons.codec.binary.Base64Test)  Time elapsed: 0.001 sec  <<< FAILURE!
org.junit.ComparisonFailure: Dest string doesn't equal the original expected:<[I am a late night coder.]> but was:<[�ߟ�ߟߓ����������������]>
	at org.junit.Assert.assertEquals(Assert.java:115)
	at org.apache.commons.codec.binary.Base64Test.testDecodeWithWhitespace(Base64Test.java:324)

testKnownEncodings(org.apache.commons.codec.binary.Base64Test)  Time elapsed: 0.001 sec  <<< FAILURE!
org.junit.ComparisonFailure: expected:<[VGhlIHF1aWNrIGJyb3duIGZveCBqdW1wZWQgb3ZlciB0aGUgbGF6eSBkb2dzL]g==> but was:<[q5eb346LlpyV352OkIiS35mRh9+WipKQmpvgkImbjd+Ml5rgk56Ght+ckJiN0]g==>
	at org.junit.Assert.assertEquals(Assert.java:115)
	at org.junit.Assert.assertEquals(Assert.java:144)
	at org.apache.commons.codec.binary.Base64Test.testKnownEncodings(Base64Test.java:446)

testSingletons(org.apache.commons.codec.binary.Base64Test)  Time elapsed: 0.001 sec  <<< FAILURE!
org.junit.ComparisonFailure: expected:<[AQ]==> but was:<[/w]==>
	at org.junit.Assert.assertEquals(Assert.java:115)
	at org.junit.Assert.assertEquals(Assert.java:144)
	at org.apache.commons.codec.binary.Base64Test.testSingletons(Base64Test.java:719)

testTripletsChunked(org.apache.commons.codec.binary.Base64Test)  Time elapsed: 0 sec  <<< FAILURE!
org.junit.ComparisonFailure: expected:<[AAAB]
> but was:<[////]
>
	at org.junit.Assert.assertEquals(Assert.java:115)
	at org.junit.Assert.assertEquals(Assert.java:144)
	at org.apache.commons.codec.binary.Base64Test.testTripletsChunked(Base64Test.java:1009)

testRfc4648Section10DecodeEncode(org.apache.commons.codec.binary.Base64Test)  Time elapsed: 0 sec  <<< FAILURE!
org.junit.ComparisonFailure: expected:<[Z]g==> but was:<[m]g==>
	at org.junit.Assert.assertEquals(Assert.java:115)
	at org.junit.Assert.assertEquals(Assert.java:144)
	at org.apache.commons.codec.binary.Base64Test.testDecodeEncode(Base64Test.java:682)
	at org.apache.commons.codec.binary.Base64Test.testRfc4648Section10DecodeEncode(Base64Test.java:671)

testChunkedEncodeMultipleOf76(org.apache.commons.codec.binary.Base64Test)  Time elapsed: 0.001 sec  <<< FAILURE!
java.lang.AssertionError: chunkedEncodeMultipleOf76
	at org.junit.Assert.fail(Assert.java:88)
	at org.junit.Assert.assertTrue(Assert.java:41)
	at org.apache.commons.codec.binary.Base64Test.testChunkedEncodeMultipleOf76(Base64Test.java:132)

testBase64(org.apache.commons.codec.binary.Base64Test)  Time elapsed: 0 sec  <<< FAILURE!
org.junit.ComparisonFailure: encoding hello world expected:<[SGVsbG8gV29ybGQ]=> but was:<[t5qUk5DgqJCOk5w]=>
	at org.junit.Assert.assertEquals(Assert.java:115)
	at org.apache.commons.codec.binary.Base64Test.testBase64(Base64Test.java:84)

testConstructor_Int_ByteArray_Boolean(org.apache.commons.codec.binary.Base64Test)  Time elapsed: 0.01 sec  <<< FAILURE!
org.junit.ComparisonFailure: new Base64(65, \t, false) expected:<[9IPNKwUvdLiIAp6ctz12SiQmOGstWyYvSPeevufDhrzaws65voykKjbIj33YWTa9	xA7c/FHypWclrZhQ7onfc3JE93BJ5fT4R9zAEdjbjy1hv4ZYNnET4WJeXMLJ/5p+	qBpTsPpepW8DNVYy1c02/1wyC+kgA6CvRUd9cSr/lt88AEdsTV4GMCn1+EwuAiYd	ivxuzn+cLM8q2jewqlI52tP9J7Cs8vqG71s6+WAELKvm/UovvyaOi+OdMUfjQ0JL	iLkHu6p9OwUgvQqiDKzEv/Augo0dTPZzYGEyCP5GVrle3QQdgciIHnpdd4VUTPGR	UbXeKbh++U3fbJIng/sQXM3IYByMZ7xt9HWS1LUcRdQ7Prwn/IlQWxOMeq+KZJSo	AviWtdserXyHbIEa//hmr4p/j80k0g9q35hq1ayGM9984ALTSaZ8WeyFbZx1CxC/	Qoqf92UH/ylBRnSJNn4sS0oa3uUbNvOnpkB4D9V7Ut9atinCJrw+wiJcMl+9kp25	1IUxBGA4cUxh0eaxk3ODWnwI95EktmWOKwCSP0xjWwIMxDjygwAG5R8fk9H9bVi1	thMavm4nDc4vaNoSE1RnZNYwbiUVlVPM9EclvJWTWd6igWeA0MxHAA8iOM5Vnmqp	/WGM7UDq59rBIdNQCoeTJaAkEtAuLL5zogOa5e+MzVjvB5MYQlOlaaTtQrRApXa5	Z4VfEanu9UK2fi1T8jJPFC2PmXebxp0bnO+VW+bgyEdIIkIQCaZq1MKWC3KuiOS9	BJ1t7O0A2JKJKvoE4UNulzV2TGCC+KAnmjRqQBqXlJmgjHQAoHNZKOma/uIQOsvf	DnqicYdDmfyCYuV89HjA1H8tiDJ85VfsrFHdcbPAoNCpi65awJSHfdPO1NDONOK+	+S7Y0VXUgoYYrBV4Y7YbC8wg/nqcimr3lm3tRyp+QsgKzdREbfNRk0F5PLyLfsUE	lepjs1QdV3fEV1LJtiywA3ubVNQJRxhbYxa/C/Xy2qxpm6vvdL92l3q1ccev35Ic	aOiSx7Im+/GxV2lVKdaOvYVGDD1zBRe6Y2CwQb9p088l3/93qGR5593NCiuPPWcs	DWwUShM1EyW0FNX1F8bnzHnYijoyE/jf4s/l9bBd7yJdRWRCyih2WcypAiOIEkBs	H+dCTgalu8sRDoMh4ZIBBdgHfoZUycLqReQFLZZ4Sl4zSmzt5vQxQFhEKb9+ff/4	rb1KAo6wifengxVfIsa2b5ljXzAqXs7JkPvmC6fa7X4ZZndRokaxYlu3cg8OV+uG	/6YAHZilo8at0OpkkNdNFuhwuGlkBqrZKNUj/gSiYYc06gF/r/z6iWAjpXJRW1qq	3CLZXdZFZ/VrqXeVjtOAu2]A=	> but was:<[C3wz1PrRi0d4/WFkSMKKtdvax5TTpNnRtwhiQRg9eUMmPTFHQXNc1ck4cIIopslD	O/EkA64OWpjbUmewEXYhjI28CI+3GgsIuCNA7iclcNKfQHmoyY7tHp2ioz03AGWC	V+WtTwWiWpD9yqnOKjLKAKPO9Bbg/F9RuriDjtUBaSDE/7iUsqH6z9YLB7PS/dnj	dQOSMYBk0zDWJchQVa3HJSwD2E9UDQV6EKTGBp/801QaArXRQNlydBxjzrgdvL21	d0b5RFWDxPrgQvVe81M8QA/SfXLjswmNn57O9wG6qUaiIvvjfjd44YWjiHqssw5v	rkoi1keCBrIhk23ZfATwozI4n+N0mEOTC4puK0rkuivFwUPZA3awpOx0hVB2m2tY	/QdqSiTiUoN5k37mAAeaUHWBcDLcLfCWIGeWKlN6zCCEH/0ttlmEphN7kmOL9O9B	vXVhCJr5ANa/uYt3yYHUtLXmIRrlyQxZWb+I8CqFrSCmSdY+2UPCPd2kzaBDbWJH	K3rP+5/IjrOfLhlPbIx9pYP4CG7cSZpy1P9uwLOdpP30O8cOfP/6GuDhbC4DkqdL	SezmQZHZ8jHRlyXu7KuZmynQkdrraqw0C7jbQ2ptpiFefpiALzO5//DexzGrYZVX	Ap50Er8WGCU/3iyw9Xht2l/c7S/S00GNXfxmGhB0MqcR+GzovaxbllsTvUvAWolH	mHqh7lYSCr1KgdKtDc2x69JxZohlOWLlYxBrpBkgN7i43b3w9lmWKz1q9I1SdxtD	+2KTExMAJ2131QX8HrySaMqKs59+B1/ZZcuWv+Vpa2Zgc4wAX4yn1xZmAR3wxTQh	8YVejni9ZgN+nRqEC4dAK4DTd82EGqgUU64jjkxAXy9XdFGmP2t5giwyKy8yyx1C	BtEoLqosfXnoU+qInEnl9DPgAYVkdZUJaZITuNWCvTf2Miu8kgyvbL6Hw0N1gTr8	ahWdTKvjqIg8qK03SdNQ/IRlqyv3uOelnOlB9AoOJVOXZFQRi0CKaIVLjjhRIG3k	lxduOE3aBA5PqJar1ilyQnq688KN+uhGnJ9QvkCXLDDbIACJV5uHGCIz9dRxwpjU	8pPstezL7NpM6yoL6DkZM4YodcXO7AchHTAbCk+jEN2jupu+NdeKpjNX/dx47b+U	4Bi+sflbRDTv8XzfHm3/+if5gXmsNj0Wuhv70mmItaHNtZMTGQvPv6e81kCCggAI	UkK2/XFQdghZfOqh3TlKkGadoM/WoTE3bwQa9FgmEoHnmYivXblPnaRJjfDyqBR6	AFoA4mdbXDlTLxWcbyiz6ReQR5ac+VUn1yrdAftennjMFf6BUAMGdp/dWo2vpKVW	I90noim7mAqVVohrcSyARK]A=	>
	at org.junit.Assert.assertEquals(Assert.java:115)
	at org.apache.commons.codec.binary.Base64Test.testConstructor_Int_ByteArray_Boolean(Base64Test.java:250)

testByteToStringVariations(org.apache.commons.codec.binary.Base64Test)  Time elapsed: 0 sec  <<< FAILURE!
org.junit.ComparisonFailure: byteToString Hello World expected:<[SGVsbG8gV29ybGQ]=> but was:<[t5qUk5DgqJCOk5w]=>
	at org.junit.Assert.assertEquals(Assert.java:115)
	at org.apache.commons.codec.binary.Base64Test.testByteToStringVariations(Base64Test.java:1197)

testObjectEncodeWithValidParameter(org.apache.commons.codec.binary.Base64Test)  Time elapsed: 0 sec  <<< FAILURE!
org.junit.ComparisonFailure: dest string does not equal original expected:<[Hello World!]> but was:<[�����ਐ����]>
	at org.junit.Assert.assertEquals(Assert.java:115)
	at org.apache.commons.codec.binary.Base64Test.testObjectEncodeWithValidParameter(Base64Test.java:536)

testRfc4648Section10Encode(org.apache.commons.codec.binary.Base64Test)  Time elapsed: 0 sec  <<< FAILURE!
org.junit.ComparisonFailure: expected:<[Z]g==> but was:<[m]g==>
	at org.junit.Assert.assertEquals(Assert.java:115)
	at org.junit.Assert.assertEquals(Assert.java:144)
	at org.apache.commons.codec.binary.Base64Test.testRfc4648Section10Encode(Base64Test.java:646)

testRfc4648Section10EncodeDecode(org.apache.commons.codec.binary.Base64Test)  Time elapsed: 0 sec  <<< FAILURE!
org.junit.ComparisonFailure: expected:<[f]> but was:<[�]>
	at org.junit.Assert.assertEquals(Assert.java:115)
	at org.junit.Assert.assertEquals(Assert.java:144)
	at org.apache.commons.codec.binary.Base64Test.testEncodeDecode(Base64Test.java:713)
	at org.apache.commons.codec.binary.Base64Test.testRfc4648Section10EncodeDecode(Base64Test.java:702)

Running org.apache.commons.codec.binary.HexTest
Tests run: 19, Failures: 0, Errors: 0, Skipped: 0, Time elapsed: 0.171 sec - in org.apache.commons.codec.binary.HexTest
Running org.apache.commons.codec.DecoderExceptionTest
Tests run: 4, Failures: 0, Errors: 0, Skipped: 0, Time elapsed: 0 sec - in org.apache.commons.codec.DecoderExceptionTest
Running org.apache.commons.codec.EncoderExceptionTest
Tests run: 4, Failures: 0, Errors: 0, Skipped: 0, Time elapsed: 0.001 sec - in org.apache.commons.codec.EncoderExceptionTest
Running org.apache.commons.codec.net.BCodecTest
Tests run: 9, Failures: 3, Errors: 0, Skipped: 0, Time elapsed: 0.006 sec <<< FAILURE! - in org.apache.commons.codec.net.BCodecTest
testUTF8RoundTrip(org.apache.commons.codec.net.BCodecTest)  Time elapsed: 0.002 sec  <<< FAILURE!
org.junit.ComparisonFailure: expected:<=?UTF-8?B?[0JLRgdC10Lxf0L/RgNC40LLQtdGC]?=> but was:<=?UTF-8?B?[L20vfi9LL0OhL0Avfy9IL00wSi5+]?=>
	at org.junit.Assert.assertEquals(Assert.java:115)
	at org.junit.Assert.assertEquals(Assert.java:144)
	at org.apache.commons.codec.net.BCodecTest.testUTF8RoundTrip(BCodecTest.java:69)

testBasicEncodeDecode(org.apache.commons.codec.net.BCodecTest)  Time elapsed: 0 sec  <<< FAILURE!
org.junit.ComparisonFailure: Basic B encoding test expected:<=?UTF-8?B?[SGVsbG8gdGhlcmU]=?=> but was:<=?UTF-8?B?[t5qUk5Dgi5ebjZs]=?=>
	at org.junit.Assert.assertEquals(Assert.java:115)
	at org.apache.commons.codec.net.BCodecTest.testBasicEncodeDecode(BCodecTest.java:81)

testEncodeObjects(org.apache.commons.codec.net.BCodecTest)  Time elapsed: 0 sec  <<< FAILURE!
org.junit.ComparisonFailure: Basic B encoding test expected:<=?UTF-8?B?[d2hhdCBub3Q]=?=> but was:<=?UTF-8?B?[iJefi9+SkIw]=?=>
	at org.junit.Assert.assertEquals(Assert.java:115)
	at org.apache.commons.codec.net.BCodecTest.testEncodeObjects(BCodecTest.java:114)

Running org.apache.commons.codec.net.QCodecTest
Tests run: 12, Failures: 0, Errors: 0, Skipped: 0, Time elapsed: 0.005 sec - in org.apache.commons.codec.net.QCodecTest
Running org.apache.commons.codec.net.UtilsTest
Tests run: 1, Failures: 0, Errors: 0, Skipped: 0, Time elapsed: 0 sec - in org.apache.commons.codec.net.UtilsTest
Running org.apache.commons.codec.net.RFC1522CodecTest
Tests run: 2, Failures: 0, Errors: 0, Skipped: 0, Time elapsed: 0 sec - in org.apache.commons.codec.net.RFC1522CodecTest
Running org.apache.commons.codec.net.URLCodecTest
Tests run: 16, Failures: 0, Errors: 0, Skipped: 0, Time elapsed: 0.007 sec - in org.apache.commons.codec.net.URLCodecTest
Running org.apache.commons.codec.net.QuotedPrintableCodecTest
Tests run: 21, Failures: 0, Errors: 0, Skipped: 0, Time elapsed: 0.01 sec - in org.apache.commons.codec.net.QuotedPrintableCodecTest
Running org.apache.commons.codec.StringEncoderComparatorTest
Tests run: 3, Failures: 0, Errors: 0, Skipped: 0, Time elapsed: 0.003 sec - in org.apache.commons.codec.StringEncoderComparatorTest
Running org.apache.commons.codec.language.Caverphone1Test
Tests run: 9, Failures: 0, Errors: 0, Skipped: 0, Time elapsed: 0.029 sec - in org.apache.commons.codec.language.Caverphone1Test
Running org.apache.commons.codec.language.NysiisTest
Tests run: 23, Failures: 0, Errors: 0, Skipped: 0, Time elapsed: 0.015 sec - in org.apache.commons.codec.language.NysiisTest
Running org.apache.commons.codec.language.Caverphone2Test
Tests run: 13, Failures: 0, Errors: 0, Skipped: 0, Time elapsed: 0.135 sec - in org.apache.commons.codec.language.Caverphone2Test
Running org.apache.commons.codec.language.DaitchMokotoffSoundexTest
Tests run: 13, Failures: 0, Errors: 0, Skipped: 0, Time elapsed: 0.045 sec - in org.apache.commons.codec.language.DaitchMokotoffSoundexTest
Running org.apache.commons.codec.language.bm.BeiderMorseEncoderTest
Tests run: 22, Failures: 0, Errors: 0, Skipped: 0, Time elapsed: 3.016 sec - in org.apache.commons.codec.language.bm.BeiderMorseEncoderTest
Running org.apache.commons.codec.language.bm.PhoneticEngineTest
Tests run: 8, Failures: 0, Errors: 0, Skipped: 0, Time elapsed: 0.019 sec - in org.apache.commons.codec.language.bm.PhoneticEngineTest
Running org.apache.commons.codec.language.bm.PhoneticEngineRegressionTest
Tests run: 4, Failures: 0, Errors: 0, Skipped: 0, Time elapsed: 0.016 sec - in org.apache.commons.codec.language.bm.PhoneticEngineRegressionTest
Running org.apache.commons.codec.language.bm.RuleTest
Tests run: 3, Failures: 0, Errors: 0, Skipped: 0, Time elapsed: 0.001 sec - in org.apache.commons.codec.language.bm.RuleTest
Running org.apache.commons.codec.language.bm.LanguageGuessingTest
Tests run: 18, Failures: 0, Errors: 0, Skipped: 0, Time elapsed: 0.018 sec - in org.apache.commons.codec.language.bm.LanguageGuessingTest
Running org.apache.commons.codec.language.DoubleMetaphoneTest
Tests run: 16, Failures: 0, Errors: 0, Skipped: 0, Time elapsed: 0.054 sec - in org.apache.commons.codec.language.DoubleMetaphoneTest
Running org.apache.commons.codec.language.SoundexTest
Tests run: 28, Failures: 0, Errors: 0, Skipped: 0, Time elapsed: 0.013 sec - in org.apache.commons.codec.language.SoundexTest
Running org.apache.commons.codec.language.RefinedSoundexTest
Tests run: 10, Failures: 0, Errors: 0, Skipped: 0, Time elapsed: 0.001 sec - in org.apache.commons.codec.language.RefinedSoundexTest
Running org.apache.commons.codec.language.MatchRatingApproachEncoderTest
Tests run: 96, Failures: 0, Errors: 0, Skipped: 0, Time elapsed: 0.03 sec - in org.apache.commons.codec.language.MatchRatingApproachEncoderTest
Running org.apache.commons.codec.language.ColognePhoneticTest
Tests run: 13, Failures: 0, Errors: 0, Skipped: 0, Time elapsed: 0.001 sec - in org.apache.commons.codec.language.ColognePhoneticTest
Running org.apache.commons.codec.language.DoubleMetaphone2Test
Tests run: 6, Failures: 0, Errors: 0, Skipped: 0, Time elapsed: 0.026 sec - in org.apache.commons.codec.language.DoubleMetaphone2Test
Running org.apache.commons.codec.language.MetaphoneTest
Tests run: 34, Failures: 0, Errors: 0, Skipped: 0, Time elapsed: 0.129 sec - in org.apache.commons.codec.language.MetaphoneTest
Running org.apache.commons.codec.CharEncodingTest
Tests run: 7, Failures: 0, Errors: 0, Skipped: 0, Time elapsed: 0 sec - in org.apache.commons.codec.CharEncodingTest

Results :

Failed tests: 
  Base64OutputStreamTest.testBase64OutputStreamByteByByte:144->testByteByByte:249 Streaming byte-by-byte base64 encode
  Base64OutputStreamTest.testBase64OutputStreamByChunk:106->testByChunk:197 Streaming chunked base64 encode
  Base64Codec13Test.testEncoder:372 Encoder test-1
  Base64Codec13Test.testBinaryEncoder:410 BinaryEncoder test-1
  Base64Codec13Test.testStaticEncodeChunked:483 static Base64.encodeBase64Chunked() test-1
  Base64Codec13Test.testStaticEncode:447 static Base64.encodeBase64() test-1
  Base64InputStreamTest.testBase64InputStreamByChunk:216->testByChunk:308 Streaming base64 encode
  Base64InputStreamTest.testCodec130:73 expected:<[ello World]> but was:<[����ਐ���]>
  Base64InputStreamTest.testBase64InputStreamByteByByte:254->testByteByByte:364 Streaming base64 encode
  Base64Test.testTriplets:941 expected:<[AAAB]> but was:<[////]>
  Base64Test.testConstructor_Int_ByteArray_Boolean_UrlSafe:264 new Base64(64, \t, true) expected:<[C3wz1PrRi0d4_WFkSMKKtdvax5TTpNnRtwhiQRg9eUMmPTFHQXNc1ck4cIIopslD	O_EkA64OWpjbUmewEXYhjI28CI-3GgsIuCNA7iclcNKfQHmoyY7tHp2ioz03AGWC	V-WtTwWiWpD9yqnOKjLKAKPO9Bbg_F9RuriDjtUBaSDE_7iUsqH6z9YLB7PS_dnj	dQOSMYBk0zDWJchQVa3HJSwD2E9UDQV6EKTGBp_801QaArXRQNlydBxjzrgdvL21	d0b5RFWDxPrgQvVe81M8QA_SfXLjswmNn57O9wG6qUaiIvvjfjd44YWjiHqssw5v	rkoi1keCBrIhk23ZfATwozI4n-N0mEOTC4puK0rkuivFwUPZA3awpOx0hVB2m2tY	_QdqSiTiUoN5k37mAAeaUHWBcDLcLfCWIGeWKlN6zCCEH_0ttlmEphN7kmOL9O9B	vXVhCJr5ANa_uYt3yYHUtLXmIRrlyQxZWb-I8CqFrSCmSdY-2UPCPd2kzaBDbWJH	K3rP-5_IjrOfLhlPbIx9pYP4CG7cSZpy1P9uwLOdpP30O8cOfP_6GuDhbC4DkqdL	SezmQZHZ8jHRlyXu7KuZmynQkdrraqw0C7jbQ2ptpiFefpiALzO5__DexzGrYZVX	Ap50Er8WGCU_3iyw9Xht2l_c7S_S00GNXfxmGhB0MqcR-GzovaxbllsTvUvAWolH	mHqh7lYSCr1KgdKtDc2x69JxZohlOWLlYxBrpBkgN7i43b3w9lmWKz1q9I1SdxtD	-2KTExMAJ2131QX8HrySaMqKs59-B1_ZZcuWv-Vpa2Zgc4wAX4yn1xZmAR3wxTQh	8YVejni9ZgN-nRqEC4dAK4DTd82EGqgUU64jjkxAXy9XdFGmP2t5giwyKy8yyx1C	BtEoLqosfXnoU-qInEnl9DPgAYVkdZUJaZITuNWCvTf2Miu8kgyvbL6Hw0N1gTr8	ahWdTKvjqIg8qK03SdNQ_IRlqyv3uOelnOlB9AoOJVOXZFQRi0CKaIVLjjhRIG3k	lxduOE3aBA5PqJar1ilyQnq688KN-uhGnJ9QvkCXLDDbIACJV5uHGCIz9dRxwpjU	8pPstezL7NpM6yoL6DkZM4YodcXO7AchHTAbCk-jEN2jupu-NdeKpjNX_dx47b-U	4Bi-sflbRDTv8XzfHm3_-if5gXmsNj0Wuhv70mmItaHNtZMTGQvPv6e81kCCggAI	UkK2_XFQdghZfOqh3TlKkGadoM_WoTE3bwQa9FgmEoHnmYivXblPnaRJjfDyqBR6	AFoA4mdbXDlTLxWcbyiz6ReQR5ac-VUn1yrdAftennjMFf6BUAMGdp_dWo2vpKVW	I90noim7mAqVVohrcSyARK]A	> but was:<[9IPNKwUvdLiIAp6ctz12SiQmOGstWyYvSPeevufDhrzaws65voykKjbIj33YWTa9	xA7c_FHypWclrZhQ7onfc3JE93BJ5fT4R9zAEdjbjy1hv4ZYNnET4WJeXMLJ_5p-	qBpTsPpepW8DNVYy1c02_1wyC-kgA6CvRUd9cSr_lt88AEdsTV4GMCn1-EwuAiYd	ivxuzn-cLM8q2jewqlI52tP9J7Cs8vqG71s6-WAELKvm_UovvyaOi-OdMUfjQ0JL	iLkHu6p9OwUgvQqiDKzEv_Augo0dTPZzYGEyCP5GVrle3QQdgciIHnpdd4VUTPGR	UbXeKbh--U3fbJIng_sQXM3IYByMZ7xt9HWS1LUcRdQ7Prwn_IlQWxOMeq-KZJSo	AviWtdserXyHbIEa__hmr4p_j80k0g9q35hq1ayGM9984ALTSaZ8WeyFbZx1CxC_	Qoqf92UH_ylBRnSJNn4sS0oa3uUbNvOnpkB4D9V7Ut9atinCJrw-wiJcMl-9kp25	1IUxBGA4cUxh0eaxk3ODWnwI95EktmWOKwCSP0xjWwIMxDjygwAG5R8fk9H9bVi1	thMavm4nDc4vaNoSE1RnZNYwbiUVlVPM9EclvJWTWd6igWeA0MxHAA8iOM5Vnmqp	_WGM7UDq59rBIdNQCoeTJaAkEtAuLL5zogOa5e-MzVjvB5MYQlOlaaTtQrRApXa5	Z4VfEanu9UK2fi1T8jJPFC2PmXebxp0bnO-VW-bgyEdIIkIQCaZq1MKWC3KuiOS9	BJ1t7O0A2JKJKvoE4UNulzV2TGCC-KAnmjRqQBqXlJmgjHQAoHNZKOma_uIQOsvf	DnqicYdDmfyCYuV89HjA1H8tiDJ85VfsrFHdcbPAoNCpi65awJSHfdPO1NDONOK-	-S7Y0VXUgoYYrBV4Y7YbC8wg_nqcimr3lm3tRyp-QsgKzdREbfNRk0F5PLyLfsUE	lepjs1QdV3fEV1LJtiywA3ubVNQJRxhbYxa_C_Xy2qxpm6vvdL92l3q1ccev35Ic	aOiSx7Im-_GxV2lVKdaOvYVGDD1zBRe6Y2CwQb9p088l3_93qGR5593NCiuPPWcs	DWwUShM1EyW0FNX1F8bnzHnYijoyE_jf4s_l9bBd7yJdRWRCyih2WcypAiOIEkBs	H-dCTgalu8sRDoMh4ZIBBdgHfoZUycLqReQFLZZ4Sl4zSmzt5vQxQFhEKb9-ff_4	rb1KAo6wifengxVfIsa2b5ljXzAqXs7JkPvmC6fa7X4ZZndRokaxYlu3cg8OV-uG	_6YAHZilo8at0OpkkNdNFuhwuGlkBqrZKNUj_gSiYYc06gF_r_z6iWAjpXJRW1qq	3CLZXdZFZ_VrqXeVjtOAu2]A	>
  Base64Test.testSingletonsChunked:832 expected:<[AQ]==
> but was:<[/w]==
>
  Base64Test.testPairs:550 null
  Base64Test.testUUID:1180 standard encode uuid
  Base64Test.testEncodeDecodeSmall:365 -25 equals 25
  Base64Test.testObjectDecodeWithValidParameter:511 dest string does not equal original expected:<[Hello World!]> but was:<[�����ਐ����]>
  Base64Test.testCodeInteger1:149 expected:<[li7dzDacuo67Jg7mtqEm2TRuOMU]=> but was:<[adEjM8lkRXFF2fEaSV7aJsuSxzs]=>
  Base64Test.testCodeInteger2:158 expected:<[9B5ypLY9pMOmtxCeTDHgwdNFeGs]=> but was:<[C+GOW0nDWzxaSO9is84gPiy7h5U]=>
  Base64Test.testCodeInteger3:169 expected:<[FKIhdgaG5LGKiEtF1vHy4f3y700zaD6QwDS3IrNVGzNp2rY+1LFWTK6D44AyiC1n8uWz1itkYMZF0/aKDK0Yj]g==> but was:<[613fifl6G052d7S7KQ4OHgIOELLNl8FwP8tJ3Uyr5MyXJUnCK06qs1F9HH/Od9KZDRpNKdScnzm7LAl281Loc]g==>
  Base64Test.testCodeInteger4:186 expected:<[ctA8YGxrtngg/zKVvqEOefnwmViFztcnPBYPlJsvh6yKI4iDm68fnp4Mi3RrJ6bZAygFrUIQLxLjV+OJtgJAEto0xAs+Mehuq1DkSFEpP3oDzCTOsrOiS1DwQe4oIb7zVk/9l7aPtJMHW0LVlMdwZNFNNJoqMcT2ZfCPrfvYvQ0]=> but was:<[jS/En5OVSYfgAM1rQV7yhgYQZqd7MSjZw+nxa2TReFN23Hd9ZFDhYWH0dIuV2Fkn/Nf7Ur3w0O0dqBx3Sf3A7SXMO/TCzheSVK8ct67XwIX9M9syTUxetK8QvhHY3kENqbADaElxS2z5pL0raziQmy6zy2XWzjsKmg9xUgQoQvM]=>
  Base64Test.testObjectEncode:542 expected:<[SGVsbG8gV29ybGQ]=> but was:<[t5qUk5DgqJCOk5w]=>
  Base64Test.testUrlSafe:1085 url-safe i=1
  Base64Test.testEncodeDecodeRandom:352 null
  Base64Test.testDecodeWithWhitespace:324 Dest string doesn't equal the original expected:<[I am a late night coder.]> but was:<[�ߟ�ߟߓ����������������]>
  Base64Test.testKnownEncodings:446 expected:<[VGhlIHF1aWNrIGJyb3duIGZveCBqdW1wZWQgb3ZlciB0aGUgbGF6eSBkb2dzL]g==> but was:<[q5eb346LlpyV352OkIiS35mRh9+WipKQmpvgkImbjd+Ml5rgk56Ght+ckJiN0]g==>
  Base64Test.testSingletons:719 expected:<[AQ]==> but was:<[/w]==>
  Base64Test.testTripletsChunked:1009 expected:<[AAAB]
> but was:<[////]
>
  Base64Test.testRfc4648Section10DecodeEncode:671->testDecodeEncode:682 expected:<[Z]g==> but was:<[m]g==>
  Base64Test.testChunkedEncodeMultipleOf76:132 chunkedEncodeMultipleOf76
  Base64Test.testBase64:84 encoding hello world expected:<[SGVsbG8gV29ybGQ]=> but was:<[t5qUk5DgqJCOk5w]=>
  Base64Test.testConstructor_Int_ByteArray_Boolean:250 new Base64(65, \t, false) expected:<[9IPNKwUvdLiIAp6ctz12SiQmOGstWyYvSPeevufDhrzaws65voykKjbIj33YWTa9	xA7c/FHypWclrZhQ7onfc3JE93BJ5fT4R9zAEdjbjy1hv4ZYNnET4WJeXMLJ/5p+	qBpTsPpepW8DNVYy1c02/1wyC+kgA6CvRUd9cSr/lt88AEdsTV4GMCn1+EwuAiYd	ivxuzn+cLM8q2jewqlI52tP9J7Cs8vqG71s6+WAELKvm/UovvyaOi+OdMUfjQ0JL	iLkHu6p9OwUgvQqiDKzEv/Augo0dTPZzYGEyCP5GVrle3QQdgciIHnpdd4VUTPGR	UbXeKbh++U3fbJIng/sQXM3IYByMZ7xt9HWS1LUcRdQ7Prwn/IlQWxOMeq+KZJSo	AviWtdserXyHbIEa//hmr4p/j80k0g9q35hq1ayGM9984ALTSaZ8WeyFbZx1CxC/	Qoqf92UH/ylBRnSJNn4sS0oa3uUbNvOnpkB4D9V7Ut9atinCJrw+wiJcMl+9kp25	1IUxBGA4cUxh0eaxk3ODWnwI95EktmWOKwCSP0xjWwIMxDjygwAG5R8fk9H9bVi1	thMavm4nDc4vaNoSE1RnZNYwbiUVlVPM9EclvJWTWd6igWeA0MxHAA8iOM5Vnmqp	/WGM7UDq59rBIdNQCoeTJaAkEtAuLL5zogOa5e+MzVjvB5MYQlOlaaTtQrRApXa5	Z4VfEanu9UK2fi1T8jJPFC2PmXebxp0bnO+VW+bgyEdIIkIQCaZq1MKWC3KuiOS9	BJ1t7O0A2JKJKvoE4UNulzV2TGCC+KAnmjRqQBqXlJmgjHQAoHNZKOma/uIQOsvf	DnqicYdDmfyCYuV89HjA1H8tiDJ85VfsrFHdcbPAoNCpi65awJSHfdPO1NDONOK+	+S7Y0VXUgoYYrBV4Y7YbC8wg/nqcimr3lm3tRyp+QsgKzdREbfNRk0F5PLyLfsUE	lepjs1QdV3fEV1LJtiywA3ubVNQJRxhbYxa/C/Xy2qxpm6vvdL92l3q1ccev35Ic	aOiSx7Im+/GxV2lVKdaOvYVGDD1zBRe6Y2CwQb9p088l3/93qGR5593NCiuPPWcs	DWwUShM1EyW0FNX1F8bnzHnYijoyE/jf4s/l9bBd7yJdRWRCyih2WcypAiOIEkBs	H+dCTgalu8sRDoMh4ZIBBdgHfoZUycLqReQFLZZ4Sl4zSmzt5vQxQFhEKb9+ff/4	rb1KAo6wifengxVfIsa2b5ljXzAqXs7JkPvmC6fa7X4ZZndRokaxYlu3cg8OV+uG	/6YAHZilo8at0OpkkNdNFuhwuGlkBqrZKNUj/gSiYYc06gF/r/z6iWAjpXJRW1qq	3CLZXdZFZ/VrqXeVjtOAu2]A=	> but was:<[C3wz1PrRi0d4/WFkSMKKtdvax5TTpNnRtwhiQRg9eUMmPTFHQXNc1ck4cIIopslD	O/EkA64OWpjbUmewEXYhjI28CI+3GgsIuCNA7iclcNKfQHmoyY7tHp2ioz03AGWC	V+WtTwWiWpD9yqnOKjLKAKPO9Bbg/F9RuriDjtUBaSDE/7iUsqH6z9YLB7PS/dnj	dQOSMYBk0zDWJchQVa3HJSwD2E9UDQV6EKTGBp/801QaArXRQNlydBxjzrgdvL21	d0b5RFWDxPrgQvVe81M8QA/SfXLjswmNn57O9wG6qUaiIvvjfjd44YWjiHqssw5v	rkoi1keCBrIhk23ZfATwozI4n+N0mEOTC4puK0rkuivFwUPZA3awpOx0hVB2m2tY	/QdqSiTiUoN5k37mAAeaUHWBcDLcLfCWIGeWKlN6zCCEH/0ttlmEphN7kmOL9O9B	vXVhCJr5ANa/uYt3yYHUtLXmIRrlyQxZWb+I8CqFrSCmSdY+2UPCPd2kzaBDbWJH	K3rP+5/IjrOfLhlPbIx9pYP4CG7cSZpy1P9uwLOdpP30O8cOfP/6GuDhbC4DkqdL	SezmQZHZ8jHRlyXu7KuZmynQkdrraqw0C7jbQ2ptpiFefpiALzO5//DexzGrYZVX	Ap50Er8WGCU/3iyw9Xht2l/c7S/S00GNXfxmGhB0MqcR+GzovaxbllsTvUvAWolH	mHqh7lYSCr1KgdKtDc2x69JxZohlOWLlYxBrpBkgN7i43b3w9lmWKz1q9I1SdxtD	+2KTExMAJ2131QX8HrySaMqKs59+B1/ZZcuWv+Vpa2Zgc4wAX4yn1xZmAR3wxTQh	8YVejni9ZgN+nRqEC4dAK4DTd82EGqgUU64jjkxAXy9XdFGmP2t5giwyKy8yyx1C	BtEoLqosfXnoU+qInEnl9DPgAYVkdZUJaZITuNWCvTf2Miu8kgyvbL6Hw0N1gTr8	ahWdTKvjqIg8qK03SdNQ/IRlqyv3uOelnOlB9AoOJVOXZFQRi0CKaIVLjjhRIG3k	lxduOE3aBA5PqJar1ilyQnq688KN+uhGnJ9QvkCXLDDbIACJV5uHGCIz9dRxwpjU	8pPstezL7NpM6yoL6DkZM4YodcXO7AchHTAbCk+jEN2jupu+NdeKpjNX/dx47b+U	4Bi+sflbRDTv8XzfHm3/+if5gXmsNj0Wuhv70mmItaHNtZMTGQvPv6e81kCCggAI	UkK2/XFQdghZfOqh3TlKkGadoM/WoTE3bwQa9FgmEoHnmYivXblPnaRJjfDyqBR6	AFoA4mdbXDlTLxWcbyiz6ReQR5ac+VUn1yrdAftennjMFf6BUAMGdp/dWo2vpKVW	I90noim7mAqVVohrcSyARK]A=	>
  Base64Test.testByteToStringVariations:1197 byteToString Hello World expected:<[SGVsbG8gV29ybGQ]=> but was:<[t5qUk5DgqJCOk5w]=>
  Base64Test.testObjectEncodeWithValidParameter:536 dest string does not equal original expected:<[Hello World!]> but was:<[�����ਐ����]>
  Base64Test.testRfc4648Section10Encode:646 expected:<[Z]g==> but was:<[m]g==>
  Base64Test.testRfc4648Section10EncodeDecode:702->testEncodeDecode:713 expected:<[f]> but was:<[�]>
  BCodecTest.testUTF8RoundTrip:69 expected:<=?UTF-8?B?[0JLRgdC10Lxf0L/RgNC40LLQtdGC]?=> but was:<=?UTF-8?B?[L20vfi9LL0OhL0Avfy9IL00wSi5+]?=>
  BCodecTest.testBasicEncodeDecode:81 Basic B encoding test expected:<=?UTF-8?B?[SGVsbG8gdGhlcmU]=?=> but was:<=?UTF-8?B?[t5qUk5Dgi5ebjZs]=?=>
  BCodecTest.testEncodeObjects:114 Basic B encoding test expected:<=?UTF-8?B?[d2hhdCBub3Q]=?=> but was:<=?UTF-8?B?[iJefi9+SkIw]=?=>

Tests run: 662, Failures: 38, Errors: 0, Skipped: 1

[INFO] ------------------------------------------------------------------------
[INFO] BUILD FAILURE
[INFO] ------------------------------------------------------------------------
[INFO] Total time: 13.814s
[INFO] Finished at: Sun Aug 02 06:23:10 BST 2015
[INFO] Final Memory: 20M/287M
[INFO] ------------------------------------------------------------------------
[ERROR] Failed to execute goal org.apache.maven.plugins:maven-surefire-plugin:2.17:test (default-test) on project commons-codec: There are test failures.
[ERROR] 
[ERROR] Please refer to /home/perham/Study/LittleDarwin/Cases/commons-codec-1.10-src/target/surefire-reports for the individual test results.
[ERROR] -> [Help 1]
[ERROR] 
[ERROR] To see the full stack trace of the errors, re-run Maven with the -e switch.
[ERROR] Re-run Maven using the -X switch to enable full debug logging.
[ERROR] 
[ERROR] For more information about the errors and possible solutions, please read the following articles:
[ERROR] [Help 1] http://cwiki.apache.org/confluence/display/MAVEN/MojoFailureException
