[INFO] Scanning for projects...
[INFO]                                                                         
[INFO] ------------------------------------------------------------------------
[INFO] Building Apache Commons Codec 1.10
[INFO] ------------------------------------------------------------------------
[INFO] 
[INFO] --- maven-enforcer-plugin:1.3.1:enforce (enforce-maven-3) @ commons-codec ---
[INFO] 
[INFO] --- maven-antrun-plugin:1.7:run (javadoc.resources) @ commons-codec ---
[INFO] Executing tasks

main:
[INFO] Executed tasks
[INFO] 
[INFO] --- maven-remote-resources-plugin:1.5:process (default) @ commons-codec ---
[INFO] 
[INFO] --- buildnumber-maven-plugin:1.3:create (default) @ commons-codec ---
[INFO] Executing: /bin/sh -c cd /home/perham/Study/LittleDarwin/Cases/commons-codec-1.10-src && svn --non-interactive info
[INFO] Working directory: /home/perham/Study/LittleDarwin/Cases/commons-codec-1.10-src
[INFO] Storing buildNumber: ?????? at timestamp: 1438494567624
[INFO] Executing: /bin/sh -c cd /home/perham/Study/LittleDarwin/Cases/commons-codec-1.10-src && svn --non-interactive info
[INFO] Working directory: /home/perham/Study/LittleDarwin/Cases/commons-codec-1.10-src
[INFO] Storing buildScmBranch: UNKNOWN_BRANCH
[INFO] 
[INFO] --- maven-resources-plugin:2.7:resources (default-resources) @ commons-codec ---
[INFO] Using 'UTF-8' encoding to copy filtered resources.
[INFO] Copying 128 resources
[INFO] Copying 2 resources to META-INF
[INFO] 
[INFO] --- maven-compiler-plugin:3.2:compile (default-compile) @ commons-codec ---
[INFO] Changes detected - recompiling the module!
[INFO] Compiling 60 source files to /home/perham/Study/LittleDarwin/Cases/commons-codec-1.10-src/target/classes
[INFO] /home/perham/Study/LittleDarwin/Cases/commons-codec-1.10-src/src/main/java/org/apache/commons/codec/digest/Sha2Crypt.java: Some input files use or override a deprecated API.
[INFO] /home/perham/Study/LittleDarwin/Cases/commons-codec-1.10-src/src/main/java/org/apache/commons/codec/digest/Sha2Crypt.java: Recompile with -Xlint:deprecation for details.
[INFO] 
[INFO] --- maven-bundle-plugin:2.5.3:manifest (bundle-manifest) @ commons-codec ---
[INFO] 
[INFO] --- maven-resources-plugin:2.7:testResources (default-testResources) @ commons-codec ---
[INFO] Using 'UTF-8' encoding to copy filtered resources.
[INFO] skip non existing resourceDirectory /home/perham/Study/LittleDarwin/Cases/commons-codec-1.10-src/src/test/resources
[INFO] Copying 2 resources to META-INF
[INFO] 
[INFO] --- maven-compiler-plugin:3.2:testCompile (default-testCompile) @ commons-codec ---
[INFO] Nothing to compile - all classes are up to date
[INFO] 
[INFO] --- maven-surefire-plugin:2.17:test (default-test) @ commons-codec ---
[INFO] Surefire report directory: /home/perham/Study/LittleDarwin/Cases/commons-codec-1.10-src/target/surefire-reports

-------------------------------------------------------
 T E S T S
-------------------------------------------------------
Running org.apache.commons.codec.digest.B64Test
Tests run: 2, Failures: 0, Errors: 0, Skipped: 0, Time elapsed: 0.022 sec - in org.apache.commons.codec.digest.B64Test
Running org.apache.commons.codec.digest.DigestUtilsTest
Tests run: 17, Failures: 0, Errors: 0, Skipped: 0, Time elapsed: 0.653 sec - in org.apache.commons.codec.digest.DigestUtilsTest
Running org.apache.commons.codec.digest.Sha512CryptTest
Tests run: 8, Failures: 0, Errors: 0, Skipped: 0, Time elapsed: 0.495 sec - in org.apache.commons.codec.digest.Sha512CryptTest
Running org.apache.commons.codec.digest.Apr1CryptTest
Tests run: 8, Failures: 0, Errors: 0, Skipped: 0, Time elapsed: 0.067 sec - in org.apache.commons.codec.digest.Apr1CryptTest
Running org.apache.commons.codec.digest.HmacUtilsTest
Tests run: 24, Failures: 0, Errors: 0, Skipped: 0, Time elapsed: 0.048 sec - in org.apache.commons.codec.digest.HmacUtilsTest
Running org.apache.commons.codec.digest.Sha2CryptTest
Tests run: 1, Failures: 0, Errors: 0, Skipped: 0, Time elapsed: 0 sec - in org.apache.commons.codec.digest.Sha2CryptTest
Running org.apache.commons.codec.digest.CryptTest
Tests run: 4, Failures: 0, Errors: 0, Skipped: 0, Time elapsed: 0.076 sec - in org.apache.commons.codec.digest.CryptTest
Running org.apache.commons.codec.digest.Sha256CryptTest
Tests run: 7, Failures: 0, Errors: 0, Skipped: 0, Time elapsed: 0.1 sec - in org.apache.commons.codec.digest.Sha256CryptTest
Running org.apache.commons.codec.digest.Md5CryptTest
Tests run: 7, Failures: 0, Errors: 0, Skipped: 0, Time elapsed: 0.015 sec - in org.apache.commons.codec.digest.Md5CryptTest
Running org.apache.commons.codec.digest.UnixCryptTest
Tests run: 9, Failures: 0, Errors: 0, Skipped: 0, Time elapsed: 0.007 sec - in org.apache.commons.codec.digest.UnixCryptTest
Running org.apache.commons.codec.CharsetsTest
Tests run: 7, Failures: 0, Errors: 0, Skipped: 0, Time elapsed: 0.001 sec - in org.apache.commons.codec.CharsetsTest
Running org.apache.commons.codec.binary.Base32Test
Tests run: 8, Failures: 0, Errors: 0, Skipped: 0, Time elapsed: 0.004 sec - in org.apache.commons.codec.binary.Base32Test
Running org.apache.commons.codec.binary.Base64OutputStreamTest
Tests run: 7, Failures: 0, Errors: 2, Skipped: 0, Time elapsed: 0.011 sec <<< FAILURE! - in org.apache.commons.codec.binary.Base64OutputStreamTest
testBase64OutputStreamByteByByte(org.apache.commons.codec.binary.Base64OutputStreamTest)  Time elapsed: 0.008 sec  <<< ERROR!
java.lang.ArrayIndexOutOfBoundsException: 1825983
	at org.apache.commons.codec.binary.Base64.encode(Base64.java:51)
	at org.apache.commons.codec.binary.BaseNCodecOutputStream.close(BaseNCodecOutputStream.java:145)
	at org.apache.commons.codec.binary.Base64OutputStreamTest.testByteByByte(Base64OutputStreamTest.java:247)
	at org.apache.commons.codec.binary.Base64OutputStreamTest.testBase64OutputStreamByteByByte(Base64OutputStreamTest.java:144)

testBase64OutputStreamByChunk(org.apache.commons.codec.binary.Base64OutputStreamTest)  Time elapsed: 0 sec  <<< ERROR!
java.lang.ArrayIndexOutOfBoundsException: 1825983
	at org.apache.commons.codec.binary.Base64.encode(Base64.java:51)
	at org.apache.commons.codec.binary.BaseNCodecOutputStream.close(BaseNCodecOutputStream.java:145)
	at org.apache.commons.codec.binary.Base64OutputStreamTest.testByChunk(Base64OutputStreamTest.java:195)
	at org.apache.commons.codec.binary.Base64OutputStreamTest.testBase64OutputStreamByChunk(Base64OutputStreamTest.java:106)

Running org.apache.commons.codec.binary.Base64Codec13Test
Tests run: 8, Failures: 4, Errors: 0, Skipped: 0, Time elapsed: 0.014 sec <<< FAILURE! - in org.apache.commons.codec.binary.Base64Codec13Test
testEncoder(org.apache.commons.codec.binary.Base64Codec13Test)  Time elapsed: 0.001 sec  <<< FAILURE!
java.lang.AssertionError: Encoder test-2
	at org.junit.Assert.fail(Assert.java:88)
	at org.junit.Assert.assertTrue(Assert.java:41)
	at org.apache.commons.codec.binary.Base64Codec13Test.testEncoder(Base64Codec13Test.java:372)

testBinaryEncoder(org.apache.commons.codec.binary.Base64Codec13Test)  Time elapsed: 0 sec  <<< FAILURE!
java.lang.AssertionError: BinaryEncoder test-2
	at org.junit.Assert.fail(Assert.java:88)
	at org.junit.Assert.assertTrue(Assert.java:41)
	at org.apache.commons.codec.binary.Base64Codec13Test.testBinaryEncoder(Base64Codec13Test.java:410)

testStaticEncodeChunked(org.apache.commons.codec.binary.Base64Codec13Test)  Time elapsed: 0 sec  <<< FAILURE!
java.lang.AssertionError: static Base64.encodeBase64Chunked() test-2
	at org.junit.Assert.fail(Assert.java:88)
	at org.junit.Assert.assertTrue(Assert.java:41)
	at org.apache.commons.codec.binary.Base64Codec13Test.testStaticEncodeChunked(Base64Codec13Test.java:483)

testStaticEncode(org.apache.commons.codec.binary.Base64Codec13Test)  Time elapsed: 0 sec  <<< FAILURE!
java.lang.AssertionError: static Base64.encodeBase64() test-2
	at org.junit.Assert.fail(Assert.java:88)
	at org.junit.Assert.assertTrue(Assert.java:41)
	at org.apache.commons.codec.binary.Base64Codec13Test.testStaticEncode(Base64Codec13Test.java:447)

Running org.apache.commons.codec.binary.Base64InputStreamTest
Tests run: 19, Failures: 0, Errors: 3, Skipped: 0, Time elapsed: 0.01 sec <<< FAILURE! - in org.apache.commons.codec.binary.Base64InputStreamTest
testBase64InputStreamByChunk(org.apache.commons.codec.binary.Base64InputStreamTest)  Time elapsed: 0 sec  <<< ERROR!
java.lang.ArrayIndexOutOfBoundsException: 1825983
	at org.apache.commons.codec.binary.Base64.encode(Base64.java:51)
	at org.apache.commons.codec.binary.BaseNCodecInputStream.read(BaseNCodecInputStream.java:160)
	at org.apache.commons.codec.binary.Base64TestData.fill(Base64TestData.java:178)
	at org.apache.commons.codec.binary.Base64TestData.streamToBytes(Base64TestData.java:154)
	at org.apache.commons.codec.binary.Base64TestData.streamToBytes(Base64TestData.java:144)
	at org.apache.commons.codec.binary.Base64InputStreamTest.testByChunk(Base64InputStreamTest.java:304)
	at org.apache.commons.codec.binary.Base64InputStreamTest.testBase64InputStreamByChunk(Base64InputStreamTest.java:216)

testCodec130(org.apache.commons.codec.binary.Base64InputStreamTest)  Time elapsed: 0 sec  <<< ERROR!
java.lang.ArrayIndexOutOfBoundsException: 1825983
	at org.apache.commons.codec.binary.Base64.encode(Base64.java:51)
	at org.apache.commons.codec.binary.BaseNCodecOutputStream.close(BaseNCodecOutputStream.java:145)
	at org.apache.commons.codec.binary.Base64InputStreamTest.testCodec130(Base64InputStreamTest.java:63)

testBase64InputStreamByteByByte(org.apache.commons.codec.binary.Base64InputStreamTest)  Time elapsed: 0 sec  <<< ERROR!
java.lang.ArrayIndexOutOfBoundsException: 1825983
	at org.apache.commons.codec.binary.Base64.encode(Base64.java:51)
	at org.apache.commons.codec.binary.BaseNCodecInputStream.read(BaseNCodecInputStream.java:160)
	at org.apache.commons.codec.binary.BaseNCodecInputStream.read(BaseNCodecInputStream.java:97)
	at org.apache.commons.codec.binary.Base64InputStreamTest.testByteByByte(Base64InputStreamTest.java:359)
	at org.apache.commons.codec.binary.Base64InputStreamTest.testBase64InputStreamByteByByte(Base64InputStreamTest.java:254)

Running org.apache.commons.codec.binary.Base32InputStreamTest
Tests run: 16, Failures: 0, Errors: 0, Skipped: 0, Time elapsed: 0.151 sec - in org.apache.commons.codec.binary.Base32InputStreamTest
Running org.apache.commons.codec.binary.Base32OutputStreamTest
Tests run: 6, Failures: 0, Errors: 0, Skipped: 0, Time elapsed: 0.107 sec - in org.apache.commons.codec.binary.Base32OutputStreamTest
Running org.apache.commons.codec.binary.BinaryCodecTest
Tests run: 13, Failures: 0, Errors: 0, Skipped: 0, Time elapsed: 0.011 sec - in org.apache.commons.codec.binary.BinaryCodecTest
Running org.apache.commons.codec.binary.BaseNCodecTest
Tests run: 7, Failures: 0, Errors: 0, Skipped: 0, Time elapsed: 0.001 sec - in org.apache.commons.codec.binary.BaseNCodecTest
Running org.apache.commons.codec.binary.StringUtilsTest
Tests run: 17, Failures: 0, Errors: 0, Skipped: 0, Time elapsed: 0.023 sec - in org.apache.commons.codec.binary.StringUtilsTest
Running org.apache.commons.codec.binary.Base64Test
Tests run: 53, Failures: 6, Errors: 11, Skipped: 1, Time elapsed: 0.048 sec <<< FAILURE! - in org.apache.commons.codec.binary.Base64Test
testConstructor_Int_ByteArray_Boolean_UrlSafe(org.apache.commons.codec.binary.Base64Test)  Time elapsed: 0 sec  <<< ERROR!
java.lang.ArrayIndexOutOfBoundsException: -729025
	at org.apache.commons.codec.binary.Base64.encode(Base64.java:51)
	at org.apache.commons.codec.binary.BaseNCodec.encode(BaseNCodec.java:431)
	at org.apache.commons.codec.binary.Base64Test.testConstructor_Int_ByteArray_Boolean_UrlSafe(Base64Test.java:257)

testPairs(org.apache.commons.codec.binary.Base64Test)  Time elapsed: 0.001 sec  <<< FAILURE!
org.junit.ComparisonFailure: expected:<[A]AA=> but was:<[/]AA=>
	at org.junit.Assert.assertEquals(Assert.java:115)
	at org.junit.Assert.assertEquals(Assert.java:144)
	at org.apache.commons.codec.binary.Base64Test.testPairs(Base64Test.java:547)

testEncodeDecodeSmall(org.apache.commons.codec.binary.Base64Test)  Time elapsed: 0 sec  <<< FAILURE!
java.lang.AssertionError: 71,-37 equals -1,-37
	at org.junit.Assert.fail(Assert.java:88)
	at org.junit.Assert.assertTrue(Assert.java:41)
	at org.apache.commons.codec.binary.Base64Test.testEncodeDecodeSmall(Base64Test.java:365)

testCodeInteger1(org.apache.commons.codec.binary.Base64Test)  Time elapsed: 0.002 sec  <<< ERROR!
java.lang.ArrayIndexOutOfBoundsException: 859071
	at org.apache.commons.codec.binary.Base64.encode(Base64.java:51)
	at org.apache.commons.codec.binary.BaseNCodec.encode(BaseNCodec.java:431)
	at org.apache.commons.codec.binary.Base64.encodeBase64(Base64.java:117)
	at org.apache.commons.codec.binary.Base64.encodeBase64(Base64.java:112)
	at org.apache.commons.codec.binary.Base64.encodeBase64(Base64.java:111)
	at org.apache.commons.codec.binary.Base64.encodeInteger(Base64.java:122)
	at org.apache.commons.codec.binary.Base64Test.testCodeInteger1(Base64Test.java:149)

testCodeInteger2(org.apache.commons.codec.binary.Base64Test)  Time elapsed: 0.001 sec  <<< ERROR!
java.lang.ArrayIndexOutOfBoundsException: -732801
	at org.apache.commons.codec.binary.Base64.encode(Base64.java:51)
	at org.apache.commons.codec.binary.BaseNCodec.encode(BaseNCodec.java:431)
	at org.apache.commons.codec.binary.Base64.encodeBase64(Base64.java:117)
	at org.apache.commons.codec.binary.Base64.encodeBase64(Base64.java:112)
	at org.apache.commons.codec.binary.Base64.encodeBase64(Base64.java:111)
	at org.apache.commons.codec.binary.Base64.encodeInteger(Base64.java:122)
	at org.apache.commons.codec.binary.Base64Test.testCodeInteger2(Base64Test.java:158)

testCodeInteger4(org.apache.commons.codec.binary.Base64Test)  Time elapsed: 0.001 sec  <<< ERROR!
java.lang.ArrayIndexOutOfBoundsException: -68033
	at org.apache.commons.codec.binary.Base64.encode(Base64.java:51)
	at org.apache.commons.codec.binary.BaseNCodec.encode(BaseNCodec.java:431)
	at org.apache.commons.codec.binary.Base64.encodeBase64(Base64.java:117)
	at org.apache.commons.codec.binary.Base64.encodeBase64(Base64.java:112)
	at org.apache.commons.codec.binary.Base64.encodeBase64(Base64.java:111)
	at org.apache.commons.codec.binary.Base64.encodeInteger(Base64.java:122)
	at org.apache.commons.codec.binary.Base64Test.testCodeInteger4(Base64Test.java:186)

testObjectEncode(org.apache.commons.codec.binary.Base64Test)  Time elapsed: 0.001 sec  <<< ERROR!
java.lang.ArrayIndexOutOfBoundsException: 1825983
	at org.apache.commons.codec.binary.Base64.encode(Base64.java:51)
	at org.apache.commons.codec.binary.BaseNCodec.encode(BaseNCodec.java:431)
	at org.apache.commons.codec.binary.Base64Test.testObjectEncode(Base64Test.java:542)

testUrlSafe(org.apache.commons.codec.binary.Base64Test)  Time elapsed: 0 sec  <<< FAILURE!
java.lang.AssertionError: url-safe i=2
	at org.junit.Assert.fail(Assert.java:88)
	at org.junit.Assert.assertTrue(Assert.java:41)
	at org.apache.commons.codec.binary.Base64Test.testUrlSafe(Base64Test.java:1085)

testEncodeDecodeRandom(org.apache.commons.codec.binary.Base64Test)  Time elapsed: 0.008 sec  <<< ERROR!
java.lang.ArrayIndexOutOfBoundsException: 1185343
	at org.apache.commons.codec.binary.Base64.encode(Base64.java:51)
	at org.apache.commons.codec.binary.BaseNCodec.encode(BaseNCodec.java:431)
	at org.apache.commons.codec.binary.Base64.encodeBase64(Base64.java:117)
	at org.apache.commons.codec.binary.Base64.encodeBase64(Base64.java:112)
	at org.apache.commons.codec.binary.Base64.encodeBase64(Base64.java:111)
	at org.apache.commons.codec.binary.Base64.encodeBase64(Base64.java:106)
	at org.apache.commons.codec.binary.Base64Test.testEncodeDecodeRandom(Base64Test.java:349)

testKnownEncodings(org.apache.commons.codec.binary.Base64Test)  Time elapsed: 0.001 sec  <<< ERROR!
java.lang.ArrayIndexOutOfBoundsException: 1612607
	at org.apache.commons.codec.binary.Base64.encode(Base64.java:51)
	at org.apache.commons.codec.binary.BaseNCodec.encode(BaseNCodec.java:431)
	at org.apache.commons.codec.binary.Base64.encodeBase64(Base64.java:117)
	at org.apache.commons.codec.binary.Base64.encodeBase64(Base64.java:112)
	at org.apache.commons.codec.binary.Base64.encodeBase64(Base64.java:111)
	at org.apache.commons.codec.binary.Base64.encodeBase64Chunked(Base64.java:110)
	at org.apache.commons.codec.binary.Base64Test.testKnownEncodings(Base64Test.java:448)

testRfc4648Section10DecodeEncode(org.apache.commons.codec.binary.Base64Test)  Time elapsed: 0.001 sec  <<< FAILURE!
org.junit.ComparisonFailure: expected:<[Z]m8=> but was:<[/]m8=>
	at org.junit.Assert.assertEquals(Assert.java:115)
	at org.junit.Assert.assertEquals(Assert.java:144)
	at org.apache.commons.codec.binary.Base64Test.testDecodeEncode(Base64Test.java:682)
	at org.apache.commons.codec.binary.Base64Test.testRfc4648Section10DecodeEncode(Base64Test.java:672)

testChunkedEncodeMultipleOf76(org.apache.commons.codec.binary.Base64Test)  Time elapsed: 0 sec  <<< ERROR!
java.lang.ArrayIndexOutOfBoundsException: null

testBase64(org.apache.commons.codec.binary.Base64Test)  Time elapsed: 0 sec  <<< ERROR!
java.lang.ArrayIndexOutOfBoundsException: null

testConstructor_Int_ByteArray_Boolean(org.apache.commons.codec.binary.Base64Test)  Time elapsed: 0 sec  <<< ERROR!
java.lang.ArrayIndexOutOfBoundsException: null

testByteToStringVariations(org.apache.commons.codec.binary.Base64Test)  Time elapsed: 0 sec  <<< ERROR!
java.lang.ArrayIndexOutOfBoundsException: null

testRfc4648Section10Encode(org.apache.commons.codec.binary.Base64Test)  Time elapsed: 0.001 sec  <<< FAILURE!
org.junit.ComparisonFailure: expected:<[Z]m8=> but was:<[/]m8=>
	at org.junit.Assert.assertEquals(Assert.java:115)
	at org.junit.Assert.assertEquals(Assert.java:144)
	at org.apache.commons.codec.binary.Base64Test.testRfc4648Section10Encode(Base64Test.java:647)

testRfc4648Section10EncodeDecode(org.apache.commons.codec.binary.Base64Test)  Time elapsed: 0 sec  <<< FAILURE!
org.junit.ComparisonFailure: expected:<[f]o> but was:<[�]o>
	at org.junit.Assert.assertEquals(Assert.java:115)
	at org.junit.Assert.assertEquals(Assert.java:144)
	at org.apache.commons.codec.binary.Base64Test.testEncodeDecode(Base64Test.java:713)
	at org.apache.commons.codec.binary.Base64Test.testRfc4648Section10EncodeDecode(Base64Test.java:703)

Running org.apache.commons.codec.binary.HexTest
Tests run: 19, Failures: 0, Errors: 0, Skipped: 0, Time elapsed: 0.176 sec - in org.apache.commons.codec.binary.HexTest
Running org.apache.commons.codec.DecoderExceptionTest
Tests run: 4, Failures: 0, Errors: 0, Skipped: 0, Time elapsed: 0.001 sec - in org.apache.commons.codec.DecoderExceptionTest
Running org.apache.commons.codec.EncoderExceptionTest
Tests run: 4, Failures: 0, Errors: 0, Skipped: 0, Time elapsed: 0.001 sec - in org.apache.commons.codec.EncoderExceptionTest
Running org.apache.commons.codec.net.BCodecTest
Tests run: 9, Failures: 0, Errors: 3, Skipped: 0, Time elapsed: 0.006 sec <<< FAILURE! - in org.apache.commons.codec.net.BCodecTest
testUTF8RoundTrip(org.apache.commons.codec.net.BCodecTest)  Time elapsed: 0.001 sec  <<< ERROR!
java.lang.ArrayIndexOutOfBoundsException: null

testBasicEncodeDecode(org.apache.commons.codec.net.BCodecTest)  Time elapsed: 0 sec  <<< ERROR!
java.lang.ArrayIndexOutOfBoundsException: null

testEncodeObjects(org.apache.commons.codec.net.BCodecTest)  Time elapsed: 0 sec  <<< ERROR!
java.lang.ArrayIndexOutOfBoundsException: null

Running org.apache.commons.codec.net.QCodecTest
Tests run: 12, Failures: 0, Errors: 0, Skipped: 0, Time elapsed: 0.009 sec - in org.apache.commons.codec.net.QCodecTest
Running org.apache.commons.codec.net.UtilsTest
Tests run: 1, Failures: 0, Errors: 0, Skipped: 0, Time elapsed: 0 sec - in org.apache.commons.codec.net.UtilsTest
Running org.apache.commons.codec.net.RFC1522CodecTest
Tests run: 2, Failures: 0, Errors: 0, Skipped: 0, Time elapsed: 0 sec - in org.apache.commons.codec.net.RFC1522CodecTest
Running org.apache.commons.codec.net.URLCodecTest
Tests run: 16, Failures: 0, Errors: 0, Skipped: 0, Time elapsed: 0.003 sec - in org.apache.commons.codec.net.URLCodecTest
Running org.apache.commons.codec.net.QuotedPrintableCodecTest
Tests run: 21, Failures: 0, Errors: 0, Skipped: 0, Time elapsed: 0.011 sec - in org.apache.commons.codec.net.QuotedPrintableCodecTest
Running org.apache.commons.codec.StringEncoderComparatorTest
Tests run: 3, Failures: 0, Errors: 0, Skipped: 0, Time elapsed: 0.004 sec - in org.apache.commons.codec.StringEncoderComparatorTest
Running org.apache.commons.codec.language.Caverphone1Test
Tests run: 9, Failures: 0, Errors: 0, Skipped: 0, Time elapsed: 0.029 sec - in org.apache.commons.codec.language.Caverphone1Test
Running org.apache.commons.codec.language.NysiisTest
Tests run: 23, Failures: 0, Errors: 0, Skipped: 0, Time elapsed: 0.016 sec - in org.apache.commons.codec.language.NysiisTest
Running org.apache.commons.codec.language.Caverphone2Test
Tests run: 13, Failures: 0, Errors: 0, Skipped: 0, Time elapsed: 0.136 sec - in org.apache.commons.codec.language.Caverphone2Test
Running org.apache.commons.codec.language.DaitchMokotoffSoundexTest
Tests run: 13, Failures: 0, Errors: 0, Skipped: 0, Time elapsed: 0.053 sec - in org.apache.commons.codec.language.DaitchMokotoffSoundexTest
Running org.apache.commons.codec.language.bm.BeiderMorseEncoderTest
Tests run: 22, Failures: 0, Errors: 0, Skipped: 0, Time elapsed: 3.046 sec - in org.apache.commons.codec.language.bm.BeiderMorseEncoderTest
Running org.apache.commons.codec.language.bm.PhoneticEngineTest
Tests run: 8, Failures: 0, Errors: 0, Skipped: 0, Time elapsed: 0.019 sec - in org.apache.commons.codec.language.bm.PhoneticEngineTest
Running org.apache.commons.codec.language.bm.PhoneticEngineRegressionTest
Tests run: 4, Failures: 0, Errors: 0, Skipped: 0, Time elapsed: 0.016 sec - in org.apache.commons.codec.language.bm.PhoneticEngineRegressionTest
Running org.apache.commons.codec.language.bm.RuleTest
Tests run: 3, Failures: 0, Errors: 0, Skipped: 0, Time elapsed: 0.002 sec - in org.apache.commons.codec.language.bm.RuleTest
Running org.apache.commons.codec.language.bm.LanguageGuessingTest
Tests run: 18, Failures: 0, Errors: 0, Skipped: 0, Time elapsed: 0.011 sec - in org.apache.commons.codec.language.bm.LanguageGuessingTest
Running org.apache.commons.codec.language.DoubleMetaphoneTest
Tests run: 16, Failures: 0, Errors: 0, Skipped: 0, Time elapsed: 0.054 sec - in org.apache.commons.codec.language.DoubleMetaphoneTest
Running org.apache.commons.codec.language.SoundexTest
Tests run: 28, Failures: 0, Errors: 0, Skipped: 0, Time elapsed: 0.01 sec - in org.apache.commons.codec.language.SoundexTest
Running org.apache.commons.codec.language.RefinedSoundexTest
Tests run: 10, Failures: 0, Errors: 0, Skipped: 0, Time elapsed: 0.002 sec - in org.apache.commons.codec.language.RefinedSoundexTest
Running org.apache.commons.codec.language.MatchRatingApproachEncoderTest
Tests run: 96, Failures: 0, Errors: 0, Skipped: 0, Time elapsed: 0.032 sec - in org.apache.commons.codec.language.MatchRatingApproachEncoderTest
Running org.apache.commons.codec.language.ColognePhoneticTest
Tests run: 13, Failures: 0, Errors: 0, Skipped: 0, Time elapsed: 0.002 sec - in org.apache.commons.codec.language.ColognePhoneticTest
Running org.apache.commons.codec.language.DoubleMetaphone2Test
Tests run: 6, Failures: 0, Errors: 0, Skipped: 0, Time elapsed: 0.025 sec - in org.apache.commons.codec.language.DoubleMetaphone2Test
Running org.apache.commons.codec.language.MetaphoneTest
Tests run: 34, Failures: 0, Errors: 0, Skipped: 0, Time elapsed: 0.124 sec - in org.apache.commons.codec.language.MetaphoneTest
Running org.apache.commons.codec.CharEncodingTest
Tests run: 7, Failures: 0, Errors: 0, Skipped: 0, Time elapsed: 0.001 sec - in org.apache.commons.codec.CharEncodingTest

Results :

Failed tests: 
  Base64Codec13Test.testEncoder:372 Encoder test-2
  Base64Codec13Test.testBinaryEncoder:410 BinaryEncoder test-2
  Base64Codec13Test.testStaticEncodeChunked:483 static Base64.encodeBase64Chunked() test-2
  Base64Codec13Test.testStaticEncode:447 static Base64.encodeBase64() test-2
  Base64Test.testPairs:547 expected:<[A]AA=> but was:<[/]AA=>
  Base64Test.testEncodeDecodeSmall:365 71,-37 equals -1,-37
  Base64Test.testUrlSafe:1085 url-safe i=2
  Base64Test.testRfc4648Section10DecodeEncode:672->testDecodeEncode:682 expected:<[Z]m8=> but was:<[/]m8=>
  Base64Test.testRfc4648Section10Encode:647 expected:<[Z]m8=> but was:<[/]m8=>
  Base64Test.testRfc4648Section10EncodeDecode:703->testEncodeDecode:713 expected:<[f]o> but was:<[�]o>

Tests in error: 
  Base64OutputStreamTest.testBase64OutputStreamByteByByte:144->testByteByByte:247 » ArrayIndexOutOfBounds
  Base64OutputStreamTest.testBase64OutputStreamByChunk:106->testByChunk:195 » ArrayIndexOutOfBounds
  Base64InputStreamTest.testBase64InputStreamByChunk:216->testByChunk:304 » ArrayIndexOutOfBounds
  Base64InputStreamTest.testCodec130:63 » ArrayIndexOutOfBounds 1825983
  Base64InputStreamTest.testBase64InputStreamByteByByte:254->testByteByByte:359 » ArrayIndexOutOfBounds
  Base64Test.testConstructor_Int_ByteArray_Boolean_UrlSafe:257 » ArrayIndexOutOfBounds
  Base64Test.testCodeInteger1:149 » ArrayIndexOutOfBounds 859071
  Base64Test.testCodeInteger2:158 » ArrayIndexOutOfBounds -732801
  Base64Test.testCodeInteger4:186 » ArrayIndexOutOfBounds -68033
  Base64Test.testObjectEncode:542 » ArrayIndexOutOfBounds 1825983
  Base64Test.testEncodeDecodeRandom:349 » ArrayIndexOutOfBounds 1185343
  Base64Test.testKnownEncodings:448 » ArrayIndexOutOfBounds 1612607
  Base64Test.testChunkedEncodeMultipleOf76 » ArrayIndexOutOfBounds
  Base64Test.testBase64 » ArrayIndexOutOfBounds
  Base64Test.testConstructor_Int_ByteArray_Boolean » ArrayIndexOutOfBounds
  Base64Test.testByteToStringVariations » ArrayIndexOutOfBounds
  BCodecTest.testUTF8RoundTrip » ArrayIndexOutOfBounds
  BCodecTest.testBasicEncodeDecode » ArrayIndexOutOfBounds
  BCodecTest.testEncodeObjects » ArrayIndexOutOfBounds

Tests run: 662, Failures: 10, Errors: 19, Skipped: 1

[INFO] ------------------------------------------------------------------------
[INFO] BUILD FAILURE
[INFO] ------------------------------------------------------------------------
[INFO] Total time: 13.737s
[INFO] Finished at: Sun Aug 02 06:49:38 BST 2015
[INFO] Final Memory: 20M/287M
[INFO] ------------------------------------------------------------------------
[ERROR] Failed to execute goal org.apache.maven.plugins:maven-surefire-plugin:2.17:test (default-test) on project commons-codec: There are test failures.
[ERROR] 
[ERROR] Please refer to /home/perham/Study/LittleDarwin/Cases/commons-codec-1.10-src/target/surefire-reports for the individual test results.
[ERROR] -> [Help 1]
[ERROR] 
[ERROR] To see the full stack trace of the errors, re-run Maven with the -e switch.
[ERROR] Re-run Maven using the -X switch to enable full debug logging.
[ERROR] 
[ERROR] For more information about the errors and possible solutions, please read the following articles:
[ERROR] [Help 1] http://cwiki.apache.org/confluence/display/MAVEN/MojoFailureException
