[INFO] Scanning for projects...
[INFO]                                                                         
[INFO] ------------------------------------------------------------------------
[INFO] Building Apache Commons Codec 1.10
[INFO] ------------------------------------------------------------------------
[INFO] 
[INFO] --- maven-enforcer-plugin:1.3.1:enforce (enforce-maven-3) @ commons-codec ---
[INFO] 
[INFO] --- maven-antrun-plugin:1.7:run (javadoc.resources) @ commons-codec ---
[INFO] Executing tasks

main:
[INFO] Executed tasks
[INFO] 
[INFO] --- maven-remote-resources-plugin:1.5:process (default) @ commons-codec ---
[INFO] 
[INFO] --- buildnumber-maven-plugin:1.3:create (default) @ commons-codec ---
[INFO] Executing: /bin/sh -c cd /home/perham/Study/LittleDarwin/Cases/commons-codec-1.10-src && svn --non-interactive info
[INFO] Working directory: /home/perham/Study/LittleDarwin/Cases/commons-codec-1.10-src
[INFO] Storing buildNumber: ?????? at timestamp: 1438492115557
[INFO] Executing: /bin/sh -c cd /home/perham/Study/LittleDarwin/Cases/commons-codec-1.10-src && svn --non-interactive info
[INFO] Working directory: /home/perham/Study/LittleDarwin/Cases/commons-codec-1.10-src
[INFO] Storing buildScmBranch: UNKNOWN_BRANCH
[INFO] 
[INFO] --- maven-resources-plugin:2.7:resources (default-resources) @ commons-codec ---
[INFO] Using 'UTF-8' encoding to copy filtered resources.
[INFO] Copying 128 resources
[INFO] Copying 2 resources to META-INF
[INFO] 
[INFO] --- maven-compiler-plugin:3.2:compile (default-compile) @ commons-codec ---
[INFO] Changes detected - recompiling the module!
[INFO] Compiling 60 source files to /home/perham/Study/LittleDarwin/Cases/commons-codec-1.10-src/target/classes
[INFO] /home/perham/Study/LittleDarwin/Cases/commons-codec-1.10-src/src/main/java/org/apache/commons/codec/digest/Sha2Crypt.java: Some input files use or override a deprecated API.
[INFO] /home/perham/Study/LittleDarwin/Cases/commons-codec-1.10-src/src/main/java/org/apache/commons/codec/digest/Sha2Crypt.java: Recompile with -Xlint:deprecation for details.
[INFO] 
[INFO] --- maven-bundle-plugin:2.5.3:manifest (bundle-manifest) @ commons-codec ---
[INFO] 
[INFO] --- maven-resources-plugin:2.7:testResources (default-testResources) @ commons-codec ---
[INFO] Using 'UTF-8' encoding to copy filtered resources.
[INFO] skip non existing resourceDirectory /home/perham/Study/LittleDarwin/Cases/commons-codec-1.10-src/src/test/resources
[INFO] Copying 2 resources to META-INF
[INFO] 
[INFO] --- maven-compiler-plugin:3.2:testCompile (default-testCompile) @ commons-codec ---
[INFO] Nothing to compile - all classes are up to date
[INFO] 
[INFO] --- maven-surefire-plugin:2.17:test (default-test) @ commons-codec ---
[INFO] Surefire report directory: /home/perham/Study/LittleDarwin/Cases/commons-codec-1.10-src/target/surefire-reports

-------------------------------------------------------
 T E S T S
-------------------------------------------------------
Running org.apache.commons.codec.digest.B64Test
Tests run: 2, Failures: 0, Errors: 0, Skipped: 0, Time elapsed: 0.027 sec - in org.apache.commons.codec.digest.B64Test
Running org.apache.commons.codec.digest.DigestUtilsTest
Tests run: 17, Failures: 0, Errors: 0, Skipped: 0, Time elapsed: 0.671 sec - in org.apache.commons.codec.digest.DigestUtilsTest
Running org.apache.commons.codec.digest.Sha512CryptTest
Tests run: 8, Failures: 0, Errors: 0, Skipped: 0, Time elapsed: 0.489 sec - in org.apache.commons.codec.digest.Sha512CryptTest
Running org.apache.commons.codec.digest.Apr1CryptTest
Tests run: 8, Failures: 0, Errors: 0, Skipped: 0, Time elapsed: 0.052 sec - in org.apache.commons.codec.digest.Apr1CryptTest
Running org.apache.commons.codec.digest.HmacUtilsTest
Tests run: 24, Failures: 0, Errors: 0, Skipped: 0, Time elapsed: 0.035 sec - in org.apache.commons.codec.digest.HmacUtilsTest
Running org.apache.commons.codec.digest.Sha2CryptTest
Tests run: 1, Failures: 0, Errors: 0, Skipped: 0, Time elapsed: 0 sec - in org.apache.commons.codec.digest.Sha2CryptTest
Running org.apache.commons.codec.digest.CryptTest
Tests run: 4, Failures: 0, Errors: 0, Skipped: 0, Time elapsed: 0.059 sec - in org.apache.commons.codec.digest.CryptTest
Running org.apache.commons.codec.digest.Sha256CryptTest
Tests run: 7, Failures: 0, Errors: 0, Skipped: 0, Time elapsed: 0.107 sec - in org.apache.commons.codec.digest.Sha256CryptTest
Running org.apache.commons.codec.digest.Md5CryptTest
Tests run: 7, Failures: 0, Errors: 0, Skipped: 0, Time elapsed: 0.016 sec - in org.apache.commons.codec.digest.Md5CryptTest
Running org.apache.commons.codec.digest.UnixCryptTest
Tests run: 9, Failures: 0, Errors: 0, Skipped: 0, Time elapsed: 0.01 sec - in org.apache.commons.codec.digest.UnixCryptTest
Running org.apache.commons.codec.CharsetsTest
Tests run: 7, Failures: 0, Errors: 0, Skipped: 0, Time elapsed: 0.004 sec - in org.apache.commons.codec.CharsetsTest
Running org.apache.commons.codec.binary.Base32Test
Tests run: 8, Failures: 0, Errors: 8, Skipped: 0, Time elapsed: 0.012 sec <<< FAILURE! - in org.apache.commons.codec.binary.Base32Test
testBase32Samples(org.apache.commons.codec.binary.Base32Test)  Time elapsed: 0.007 sec  <<< ERROR!
java.lang.IllegalArgumentException: pad must not be in alphabet or whitespace
	at org.apache.commons.codec.binary.Base32.<init>(Base32.java:44)
	at org.apache.commons.codec.binary.Base32.<init>(Base32.java:25)
	at org.apache.commons.codec.binary.Base32.<init>(Base32.java:23)
	at org.apache.commons.codec.binary.Base32Test.testBase32Samples(Base32Test.java:74)

testBase32SamplesNonDefaultPadding(org.apache.commons.codec.binary.Base32Test)  Time elapsed: 0 sec  <<< ERROR!
java.lang.IllegalArgumentException: pad must not be in alphabet or whitespace
	at org.apache.commons.codec.binary.Base32.<init>(Base32.java:44)
	at org.apache.commons.codec.binary.Base32.<init>(Base32.java:26)
	at org.apache.commons.codec.binary.Base32.<init>(Base32.java:24)
	at org.apache.commons.codec.binary.Base32Test.testBase32SamplesNonDefaultPadding(Base32Test.java:148)

testRandomBytes(org.apache.commons.codec.binary.Base32Test)  Time elapsed: 0 sec  <<< ERROR!
java.lang.IllegalArgumentException: pad must not be in alphabet or whitespace
	at org.apache.commons.codec.binary.Base32.<init>(Base32.java:44)
	at org.apache.commons.codec.binary.Base32.<init>(Base32.java:25)
	at org.apache.commons.codec.binary.Base32.<init>(Base32.java:23)
	at org.apache.commons.codec.binary.Base32Test.testRandomBytes(Base32Test.java:119)

testRandomBytesHex(org.apache.commons.codec.binary.Base32Test)  Time elapsed: 0.001 sec  <<< ERROR!
java.lang.IllegalArgumentException: pad must not be in alphabet or whitespace
	at org.apache.commons.codec.binary.Base32.<init>(Base32.java:44)
	at org.apache.commons.codec.binary.Base32.<init>(Base32.java:25)
	at org.apache.commons.codec.binary.Base32Test.testRandomBytesHex(Base32Test.java:139)

testSingleCharEncoding(org.apache.commons.codec.binary.Base32Test)  Time elapsed: 0 sec  <<< ERROR!
java.lang.IllegalArgumentException: pad must not be in alphabet or whitespace
	at org.apache.commons.codec.binary.Base32.<init>(Base32.java:44)
	at org.apache.commons.codec.binary.Base32.<init>(Base32.java:25)
	at org.apache.commons.codec.binary.Base32.<init>(Base32.java:23)
	at org.apache.commons.codec.binary.Base32Test.testSingleCharEncoding(Base32Test.java:99)

testRandomBytesChunked(org.apache.commons.codec.binary.Base32Test)  Time elapsed: 0.001 sec  <<< ERROR!
java.lang.IllegalArgumentException: lineSeparator must not contain Base32 characters: [
]
	at org.apache.commons.codec.binary.Base32.<init>(Base32.java:37)
	at org.apache.commons.codec.binary.Base32.<init>(Base32.java:28)
	at org.apache.commons.codec.binary.Base32.<init>(Base32.java:27)
	at org.apache.commons.codec.binary.Base32Test.testRandomBytesChunked(Base32Test.java:129)

testBase32HexSamples(org.apache.commons.codec.binary.Base32Test)  Time elapsed: 0 sec  <<< ERROR!
java.lang.IllegalArgumentException: pad must not be in alphabet or whitespace
	at org.apache.commons.codec.binary.Base32.<init>(Base32.java:44)
	at org.apache.commons.codec.binary.Base32.<init>(Base32.java:25)
	at org.apache.commons.codec.binary.Base32Test.testBase32HexSamples(Base32Test.java:82)

testBase32Chunked(org.apache.commons.codec.binary.Base32Test)  Time elapsed: 0 sec  <<< ERROR!
java.lang.IllegalArgumentException: lineSeparator must not contain Base32 characters: [
]
	at org.apache.commons.codec.binary.Base32.<init>(Base32.java:37)
	at org.apache.commons.codec.binary.Base32.<init>(Base32.java:28)
	at org.apache.commons.codec.binary.Base32.<init>(Base32.java:27)
	at org.apache.commons.codec.binary.Base32Test.testBase32Chunked(Base32Test.java:90)

Running org.apache.commons.codec.binary.Base64OutputStreamTest
Tests run: 7, Failures: 0, Errors: 0, Skipped: 0, Time elapsed: 0.202 sec - in org.apache.commons.codec.binary.Base64OutputStreamTest
Running org.apache.commons.codec.binary.Base64Codec13Test
Tests run: 8, Failures: 0, Errors: 0, Skipped: 0, Time elapsed: 0.011 sec - in org.apache.commons.codec.binary.Base64Codec13Test
Running org.apache.commons.codec.binary.Base64InputStreamTest
Tests run: 19, Failures: 0, Errors: 0, Skipped: 0, Time elapsed: 0.127 sec - in org.apache.commons.codec.binary.Base64InputStreamTest
Running org.apache.commons.codec.binary.Base32InputStreamTest
Tests run: 16, Failures: 0, Errors: 15, Skipped: 0, Time elapsed: 0.017 sec <<< FAILURE! - in org.apache.commons.codec.binary.Base32InputStreamTest
testBase32InputStreamByteByByte(org.apache.commons.codec.binary.Base32InputStreamTest)  Time elapsed: 0.001 sec  <<< ERROR!
java.lang.IllegalArgumentException: lineSeparator must not contain Base32 characters: [
]
	at org.apache.commons.codec.binary.Base32.<init>(Base32.java:37)
	at org.apache.commons.codec.binary.Base32.<init>(Base32.java:28)
	at org.apache.commons.codec.binary.Base32InputStream.<init>(Base32InputStream.java:82)
	at org.apache.commons.codec.binary.Base32InputStreamTest.testByteByByte(Base32InputStreamTest.java:342)
	at org.apache.commons.codec.binary.Base32InputStreamTest.testBase32InputStreamByteByByte(Base32InputStreamTest.java:245)

testSkipToEnd(org.apache.commons.codec.binary.Base32InputStreamTest)  Time elapsed: 0.001 sec  <<< ERROR!
java.lang.IllegalArgumentException: pad must not be in alphabet or whitespace
	at org.apache.commons.codec.binary.Base32.<init>(Base32.java:44)
	at org.apache.commons.codec.binary.Base32.<init>(Base32.java:25)
	at org.apache.commons.codec.binary.Base32InputStream.<init>(Base32InputStream.java:61)
	at org.apache.commons.codec.binary.Base32InputStream.<init>(Base32InputStream.java:48)
	at org.apache.commons.codec.binary.Base32InputStreamTest.testSkipToEnd(Base32InputStreamTest.java:536)

testSkipNone(org.apache.commons.codec.binary.Base32InputStreamTest)  Time elapsed: 0 sec  <<< ERROR!
java.lang.IllegalArgumentException: pad must not be in alphabet or whitespace
	at org.apache.commons.codec.binary.Base32.<init>(Base32.java:44)
	at org.apache.commons.codec.binary.Base32.<init>(Base32.java:25)
	at org.apache.commons.codec.binary.Base32InputStream.<init>(Base32InputStream.java:61)
	at org.apache.commons.codec.binary.Base32InputStream.<init>(Base32InputStream.java:48)
	at org.apache.commons.codec.binary.Base32InputStreamTest.testSkipNone(Base32InputStreamTest.java:485)

testRead0(org.apache.commons.codec.binary.Base32InputStreamTest)  Time elapsed: 0 sec  <<< ERROR!
java.lang.IllegalArgumentException: lineSeparator must not contain Base32 characters: [   ]
	at org.apache.commons.codec.binary.Base32.<init>(Base32.java:37)
	at org.apache.commons.codec.binary.Base32.<init>(Base32.java:28)
	at org.apache.commons.codec.binary.Base32InputStream.<init>(Base32InputStream.java:82)
	at org.apache.commons.codec.binary.Base32InputStreamTest.testRead0(Base32InputStreamTest.java:409)

testBase32EmptyInputStreamPemChuckSize(org.apache.commons.codec.binary.Base32InputStreamTest)  Time elapsed: 0.001 sec  <<< ERROR!
java.lang.IllegalArgumentException: lineSeparator must not contain Base32 characters: [
]
	at org.apache.commons.codec.binary.Base32.<init>(Base32.java:37)
	at org.apache.commons.codec.binary.Base32.<init>(Base32.java:28)
	at org.apache.commons.codec.binary.Base32InputStream.<init>(Base32InputStream.java:82)
	at org.apache.commons.codec.binary.Base32InputStreamTest.testByteByByte(Base32InputStreamTest.java:342)
	at org.apache.commons.codec.binary.Base32InputStreamTest.testBase32EmptyInputStream(Base32InputStreamTest.java:191)
	at org.apache.commons.codec.binary.Base32InputStreamTest.testBase32EmptyInputStreamPemChuckSize(Base32InputStreamTest.java:185)

testMarkSupported(org.apache.commons.codec.binary.Base32InputStreamTest)  Time elapsed: 0.001 sec  <<< ERROR!
java.lang.IllegalArgumentException: lineSeparator must not contain Base32 characters: [   ]
	at org.apache.commons.codec.binary.Base32.<init>(Base32.java:37)
	at org.apache.commons.codec.binary.Base32.<init>(Base32.java:28)
	at org.apache.commons.codec.binary.Base32InputStream.<init>(Base32InputStream.java:82)
	at org.apache.commons.codec.binary.Base32InputStreamTest.testMarkSupported(Base32InputStreamTest.java:392)

testReadOutOfBounds(org.apache.commons.codec.binary.Base32InputStreamTest)  Time elapsed: 0.001 sec  <<< ERROR!
java.lang.IllegalArgumentException: lineSeparator must not contain Base32 characters: [   ]
	at org.apache.commons.codec.binary.Base32.<init>(Base32.java:37)
	at org.apache.commons.codec.binary.Base32.<init>(Base32.java:28)
	at org.apache.commons.codec.binary.Base32InputStream.<init>(Base32InputStream.java:82)
	at org.apache.commons.codec.binary.Base32InputStreamTest.testReadOutOfBounds(Base32InputStreamTest.java:445)

testReadNull(org.apache.commons.codec.binary.Base32InputStreamTest)  Time elapsed: 0.001 sec  <<< ERROR!
java.lang.IllegalArgumentException: lineSeparator must not contain Base32 characters: [   ]
	at org.apache.commons.codec.binary.Base32.<init>(Base32.java:37)
	at org.apache.commons.codec.binary.Base32.<init>(Base32.java:28)
	at org.apache.commons.codec.binary.Base32InputStream.<init>(Base32InputStream.java:82)
	at org.apache.commons.codec.binary.Base32InputStreamTest.testReadNull(Base32InputStreamTest.java:425)

testCodec105(org.apache.commons.codec.binary.Base32InputStreamTest)  Time elapsed: 0 sec  <<< ERROR!
java.lang.IllegalArgumentException: pad must not be in alphabet or whitespace
	at org.apache.commons.codec.binary.Base32.<init>(Base32.java:44)
	at org.apache.commons.codec.binary.Base32.<init>(Base32.java:28)
	at org.apache.commons.codec.binary.Base32InputStream.<init>(Base32InputStream.java:82)
	at org.apache.commons.codec.binary.Base32InputStreamTest.testCodec105(Base32InputStreamTest.java:71)

testCodec130(org.apache.commons.codec.binary.Base32InputStreamTest)  Time elapsed: 0 sec  <<< ERROR!
java.lang.IllegalArgumentException: pad must not be in alphabet or whitespace
	at org.apache.commons.codec.binary.Base32.<init>(Base32.java:44)
	at org.apache.commons.codec.binary.Base32.<init>(Base32.java:25)
	at org.apache.commons.codec.binary.Base32OutputStream.<init>(Base32OutputStream.java:65)
	at org.apache.commons.codec.binary.Base32OutputStream.<init>(Base32OutputStream.java:52)
	at org.apache.commons.codec.binary.Base32InputStreamTest.testCodec130(Base32InputStreamTest.java:50)

testAvailable(org.apache.commons.codec.binary.Base32InputStreamTest)  Time elapsed: 0 sec  <<< ERROR!
java.lang.IllegalArgumentException: pad must not be in alphabet or whitespace
	at org.apache.commons.codec.binary.Base32.<init>(Base32.java:44)
	at org.apache.commons.codec.binary.Base32.<init>(Base32.java:25)
	at org.apache.commons.codec.binary.Base32InputStream.<init>(Base32InputStream.java:61)
	at org.apache.commons.codec.binary.Base32InputStream.<init>(Base32InputStream.java:48)
	at org.apache.commons.codec.binary.Base32InputStreamTest.testAvailable(Base32InputStreamTest.java:155)

testBase32EmptyInputStreamMimeChuckSize(org.apache.commons.codec.binary.Base32InputStreamTest)  Time elapsed: 0.001 sec  <<< ERROR!
java.lang.IllegalArgumentException: lineSeparator must not contain Base32 characters: [
]
	at org.apache.commons.codec.binary.Base32.<init>(Base32.java:37)
	at org.apache.commons.codec.binary.Base32.<init>(Base32.java:28)
	at org.apache.commons.codec.binary.Base32InputStream.<init>(Base32InputStream.java:82)
	at org.apache.commons.codec.binary.Base32InputStreamTest.testByteByByte(Base32InputStreamTest.java:342)
	at org.apache.commons.codec.binary.Base32InputStreamTest.testBase32EmptyInputStream(Base32InputStreamTest.java:191)
	at org.apache.commons.codec.binary.Base32InputStreamTest.testBase32EmptyInputStreamMimeChuckSize(Base32InputStreamTest.java:174)

testSkipPastEnd(org.apache.commons.codec.binary.Base32InputStreamTest)  Time elapsed: 0.001 sec  <<< ERROR!
java.lang.IllegalArgumentException: pad must not be in alphabet or whitespace
	at org.apache.commons.codec.binary.Base32.<init>(Base32.java:44)
	at org.apache.commons.codec.binary.Base32.<init>(Base32.java:25)
	at org.apache.commons.codec.binary.Base32InputStream.<init>(Base32InputStream.java:61)
	at org.apache.commons.codec.binary.Base32InputStream.<init>(Base32InputStream.java:48)
	at org.apache.commons.codec.binary.Base32InputStreamTest.testSkipPastEnd(Base32InputStreamTest.java:519)

testSkipBig(org.apache.commons.codec.binary.Base32InputStreamTest)  Time elapsed: 0 sec  <<< ERROR!
java.lang.IllegalArgumentException: pad must not be in alphabet or whitespace
	at org.apache.commons.codec.binary.Base32.<init>(Base32.java:44)
	at org.apache.commons.codec.binary.Base32.<init>(Base32.java:25)
	at org.apache.commons.codec.binary.Base32InputStream.<init>(Base32InputStream.java:61)
	at org.apache.commons.codec.binary.Base32InputStream.<init>(Base32InputStream.java:48)
	at org.apache.commons.codec.binary.Base32InputStreamTest.testSkipBig(Base32InputStreamTest.java:503)

testBase32InputStreamByChunk(org.apache.commons.codec.binary.Base32InputStreamTest)  Time elapsed: 0.001 sec  <<< ERROR!
java.lang.IllegalArgumentException: lineSeparator must not contain Base32 characters: [
]
	at org.apache.commons.codec.binary.Base32.<init>(Base32.java:37)
	at org.apache.commons.codec.binary.Base32.<init>(Base32.java:28)
	at org.apache.commons.codec.binary.Base32InputStream.<init>(Base32InputStream.java:82)
	at org.apache.commons.codec.binary.Base32InputStreamTest.testByChunk(Base32InputStreamTest.java:291)
	at org.apache.commons.codec.binary.Base32InputStreamTest.testBase32InputStreamByChunk(Base32InputStreamTest.java:206)

Running org.apache.commons.codec.binary.Base32OutputStreamTest
Tests run: 6, Failures: 0, Errors: 6, Skipped: 0, Time elapsed: 0.001 sec <<< FAILURE! - in org.apache.commons.codec.binary.Base32OutputStreamTest
testWriteOutOfBounds(org.apache.commons.codec.binary.Base32OutputStreamTest)  Time elapsed: 0 sec  <<< ERROR!
java.lang.IllegalArgumentException: pad must not be in alphabet or whitespace
	at org.apache.commons.codec.binary.Base32.<init>(Base32.java:44)
	at org.apache.commons.codec.binary.Base32.<init>(Base32.java:25)
	at org.apache.commons.codec.binary.Base32OutputStream.<init>(Base32OutputStream.java:65)
	at org.apache.commons.codec.binary.Base32OutputStream.<init>(Base32OutputStream.java:52)
	at org.apache.commons.codec.binary.Base32OutputStreamTest.testWriteOutOfBounds(Base32OutputStreamTest.java:287)

testBase32EmptyOutputStreamPemChunkSize(org.apache.commons.codec.binary.Base32OutputStreamTest)  Time elapsed: 0 sec  <<< ERROR!
java.lang.IllegalArgumentException: lineSeparator must not contain Base32 characters: [
]
	at org.apache.commons.codec.binary.Base32.<init>(Base32.java:37)
	at org.apache.commons.codec.binary.Base32.<init>(Base32.java:28)
	at org.apache.commons.codec.binary.Base32OutputStream.<init>(Base32OutputStream.java:86)
	at org.apache.commons.codec.binary.Base32OutputStreamTest.testByteByByte(Base32OutputStreamTest.java:232)
	at org.apache.commons.codec.binary.Base32OutputStreamTest.testBase32EmptyOutputStream(Base32OutputStreamTest.java:86)
	at org.apache.commons.codec.binary.Base32OutputStreamTest.testBase32EmptyOutputStreamPemChunkSize(Base32OutputStreamTest.java:80)

testWriteToNullCoverage(org.apache.commons.codec.binary.Base32OutputStreamTest)  Time elapsed: 0 sec  <<< ERROR!
java.lang.IllegalArgumentException: pad must not be in alphabet or whitespace
	at org.apache.commons.codec.binary.Base32.<init>(Base32.java:44)
	at org.apache.commons.codec.binary.Base32.<init>(Base32.java:25)
	at org.apache.commons.codec.binary.Base32OutputStream.<init>(Base32OutputStream.java:65)
	at org.apache.commons.codec.binary.Base32OutputStream.<init>(Base32OutputStream.java:52)
	at org.apache.commons.codec.binary.Base32OutputStreamTest.testWriteToNullCoverage(Base32OutputStreamTest.java:328)

testBase32EmptyOutputStreamMimeChunkSize(org.apache.commons.codec.binary.Base32OutputStreamTest)  Time elapsed: 0 sec  <<< ERROR!
java.lang.IllegalArgumentException: lineSeparator must not contain Base32 characters: [
]
	at org.apache.commons.codec.binary.Base32.<init>(Base32.java:37)
	at org.apache.commons.codec.binary.Base32.<init>(Base32.java:28)
	at org.apache.commons.codec.binary.Base32OutputStream.<init>(Base32OutputStream.java:86)
	at org.apache.commons.codec.binary.Base32OutputStreamTest.testByteByByte(Base32OutputStreamTest.java:232)
	at org.apache.commons.codec.binary.Base32OutputStreamTest.testBase32EmptyOutputStream(Base32OutputStreamTest.java:86)
	at org.apache.commons.codec.binary.Base32OutputStreamTest.testBase32EmptyOutputStreamMimeChunkSize(Base32OutputStreamTest.java:69)

testBase32OutputStreamByChunk(org.apache.commons.codec.binary.Base32OutputStreamTest)  Time elapsed: 0 sec  <<< ERROR!
java.lang.IllegalArgumentException: lineSeparator must not contain Base32 characters: [
]
	at org.apache.commons.codec.binary.Base32.<init>(Base32.java:37)
	at org.apache.commons.codec.binary.Base32.<init>(Base32.java:28)
	at org.apache.commons.codec.binary.Base32OutputStream.<init>(Base32OutputStream.java:86)
	at org.apache.commons.codec.binary.Base32OutputStreamTest.testByChunk(Base32OutputStreamTest.java:182)
	at org.apache.commons.codec.binary.Base32OutputStreamTest.testBase32OutputStreamByChunk(Base32OutputStreamTest.java:101)

testBase32OutputStreamByteByByte(org.apache.commons.codec.binary.Base32OutputStreamTest)  Time elapsed: 0 sec  <<< ERROR!
java.lang.IllegalArgumentException: lineSeparator must not contain Base32 characters: [
]
	at org.apache.commons.codec.binary.Base32.<init>(Base32.java:37)
	at org.apache.commons.codec.binary.Base32.<init>(Base32.java:28)
	at org.apache.commons.codec.binary.Base32OutputStream.<init>(Base32OutputStream.java:86)
	at org.apache.commons.codec.binary.Base32OutputStreamTest.testByteByByte(Base32OutputStreamTest.java:232)
	at org.apache.commons.codec.binary.Base32OutputStreamTest.testBase32OutputStreamByteByByte(Base32OutputStreamTest.java:136)

Running org.apache.commons.codec.binary.BinaryCodecTest
Tests run: 13, Failures: 0, Errors: 0, Skipped: 0, Time elapsed: 0.001 sec - in org.apache.commons.codec.binary.BinaryCodecTest
Running org.apache.commons.codec.binary.BaseNCodecTest
Tests run: 7, Failures: 0, Errors: 0, Skipped: 0, Time elapsed: 0 sec - in org.apache.commons.codec.binary.BaseNCodecTest
Running org.apache.commons.codec.binary.StringUtilsTest
Tests run: 17, Failures: 0, Errors: 0, Skipped: 0, Time elapsed: 0.016 sec - in org.apache.commons.codec.binary.StringUtilsTest
Running org.apache.commons.codec.binary.Base64Test
Tests run: 53, Failures: 0, Errors: 0, Skipped: 1, Time elapsed: 0.045 sec - in org.apache.commons.codec.binary.Base64Test
Running org.apache.commons.codec.binary.HexTest
Tests run: 19, Failures: 0, Errors: 0, Skipped: 0, Time elapsed: 0.181 sec - in org.apache.commons.codec.binary.HexTest
Running org.apache.commons.codec.DecoderExceptionTest
Tests run: 4, Failures: 0, Errors: 0, Skipped: 0, Time elapsed: 0 sec - in org.apache.commons.codec.DecoderExceptionTest
Running org.apache.commons.codec.EncoderExceptionTest
Tests run: 4, Failures: 0, Errors: 0, Skipped: 0, Time elapsed: 0 sec - in org.apache.commons.codec.EncoderExceptionTest
Running org.apache.commons.codec.net.BCodecTest
Tests run: 9, Failures: 0, Errors: 0, Skipped: 0, Time elapsed: 0.005 sec - in org.apache.commons.codec.net.BCodecTest
Running org.apache.commons.codec.net.QCodecTest
Tests run: 12, Failures: 0, Errors: 0, Skipped: 0, Time elapsed: 0.006 sec - in org.apache.commons.codec.net.QCodecTest
Running org.apache.commons.codec.net.UtilsTest
Tests run: 1, Failures: 0, Errors: 0, Skipped: 0, Time elapsed: 0 sec - in org.apache.commons.codec.net.UtilsTest
Running org.apache.commons.codec.net.RFC1522CodecTest
Tests run: 2, Failures: 0, Errors: 0, Skipped: 0, Time elapsed: 0.001 sec - in org.apache.commons.codec.net.RFC1522CodecTest
Running org.apache.commons.codec.net.URLCodecTest
Tests run: 16, Failures: 0, Errors: 0, Skipped: 0, Time elapsed: 0.008 sec - in org.apache.commons.codec.net.URLCodecTest
Running org.apache.commons.codec.net.QuotedPrintableCodecTest
Tests run: 21, Failures: 0, Errors: 0, Skipped: 0, Time elapsed: 0.01 sec - in org.apache.commons.codec.net.QuotedPrintableCodecTest
Running org.apache.commons.codec.StringEncoderComparatorTest
Tests run: 3, Failures: 0, Errors: 0, Skipped: 0, Time elapsed: 0.004 sec - in org.apache.commons.codec.StringEncoderComparatorTest
Running org.apache.commons.codec.language.Caverphone1Test
Tests run: 9, Failures: 0, Errors: 0, Skipped: 0, Time elapsed: 0.029 sec - in org.apache.commons.codec.language.Caverphone1Test
Running org.apache.commons.codec.language.NysiisTest
Tests run: 23, Failures: 0, Errors: 0, Skipped: 0, Time elapsed: 0.017 sec - in org.apache.commons.codec.language.NysiisTest
Running org.apache.commons.codec.language.Caverphone2Test
Tests run: 13, Failures: 0, Errors: 0, Skipped: 0, Time elapsed: 0.133 sec - in org.apache.commons.codec.language.Caverphone2Test
Running org.apache.commons.codec.language.DaitchMokotoffSoundexTest
Tests run: 13, Failures: 0, Errors: 0, Skipped: 0, Time elapsed: 0.045 sec - in org.apache.commons.codec.language.DaitchMokotoffSoundexTest
Running org.apache.commons.codec.language.bm.BeiderMorseEncoderTest
Tests run: 22, Failures: 0, Errors: 0, Skipped: 0, Time elapsed: 3.023 sec - in org.apache.commons.codec.language.bm.BeiderMorseEncoderTest
Running org.apache.commons.codec.language.bm.PhoneticEngineTest
Tests run: 8, Failures: 0, Errors: 0, Skipped: 0, Time elapsed: 0.014 sec - in org.apache.commons.codec.language.bm.PhoneticEngineTest
Running org.apache.commons.codec.language.bm.PhoneticEngineRegressionTest
Tests run: 4, Failures: 0, Errors: 0, Skipped: 0, Time elapsed: 0.014 sec - in org.apache.commons.codec.language.bm.PhoneticEngineRegressionTest
Running org.apache.commons.codec.language.bm.RuleTest
Tests run: 3, Failures: 0, Errors: 0, Skipped: 0, Time elapsed: 0.004 sec - in org.apache.commons.codec.language.bm.RuleTest
Running org.apache.commons.codec.language.bm.LanguageGuessingTest
Tests run: 18, Failures: 0, Errors: 0, Skipped: 0, Time elapsed: 0.011 sec - in org.apache.commons.codec.language.bm.LanguageGuessingTest
Running org.apache.commons.codec.language.DoubleMetaphoneTest
Tests run: 16, Failures: 0, Errors: 0, Skipped: 0, Time elapsed: 0.045 sec - in org.apache.commons.codec.language.DoubleMetaphoneTest
Running org.apache.commons.codec.language.SoundexTest
Tests run: 28, Failures: 0, Errors: 0, Skipped: 0, Time elapsed: 0.009 sec - in org.apache.commons.codec.language.SoundexTest
Running org.apache.commons.codec.language.RefinedSoundexTest
Tests run: 10, Failures: 0, Errors: 0, Skipped: 0, Time elapsed: 0.003 sec - in org.apache.commons.codec.language.RefinedSoundexTest
Running org.apache.commons.codec.language.MatchRatingApproachEncoderTest
Tests run: 96, Failures: 0, Errors: 0, Skipped: 0, Time elapsed: 0.034 sec - in org.apache.commons.codec.language.MatchRatingApproachEncoderTest
Running org.apache.commons.codec.language.ColognePhoneticTest
Tests run: 13, Failures: 0, Errors: 0, Skipped: 0, Time elapsed: 0.004 sec - in org.apache.commons.codec.language.ColognePhoneticTest
Running org.apache.commons.codec.language.DoubleMetaphone2Test
Tests run: 6, Failures: 0, Errors: 0, Skipped: 0, Time elapsed: 0.026 sec - in org.apache.commons.codec.language.DoubleMetaphone2Test
Running org.apache.commons.codec.language.MetaphoneTest
Tests run: 34, Failures: 0, Errors: 0, Skipped: 0, Time elapsed: 0.087 sec - in org.apache.commons.codec.language.MetaphoneTest
Running org.apache.commons.codec.CharEncodingTest
Tests run: 7, Failures: 0, Errors: 0, Skipped: 0, Time elapsed: 0 sec - in org.apache.commons.codec.CharEncodingTest

Results :

Tests in error: 
  Base32Test.testBase32Samples:74 » IllegalArgument pad must not be in alphabet ...
  Base32Test.testBase32SamplesNonDefaultPadding:148 » IllegalArgument pad must n...
  Base32Test.testRandomBytes:119 » IllegalArgument pad must not be in alphabet o...
  Base32Test.testRandomBytesHex:139 » IllegalArgument pad must not be in alphabe...
  Base32Test.testSingleCharEncoding:99 » IllegalArgument pad must not be in alph...
  Base32Test.testRandomBytesChunked:129 » IllegalArgument lineSeparator must not...
  Base32Test.testBase32HexSamples:82 » IllegalArgument pad must not be in alphab...
  Base32Test.testBase32Chunked:90 » IllegalArgument lineSeparator must not conta...
  Base32InputStreamTest.testBase32InputStreamByteByByte:245->testByteByByte:342 » IllegalArgument
  Base32InputStreamTest.testSkipToEnd:536 » IllegalArgument pad must not be in a...
  Base32InputStreamTest.testSkipNone:485 » IllegalArgument pad must not be in al...
  Base32InputStreamTest.testRead0:409 » IllegalArgument lineSeparator must not c...
  Base32InputStreamTest.testBase32EmptyInputStreamPemChuckSize:185->testBase32EmptyInputStream:191->testByteByByte:342 » IllegalArgument
  Base32InputStreamTest.testMarkSupported:392 » IllegalArgument lineSeparator mu...
  Base32InputStreamTest.testReadOutOfBounds:445 » IllegalArgument lineSeparator ...
  Base32InputStreamTest.testReadNull:425 » IllegalArgument lineSeparator must no...
  Base32InputStreamTest.testCodec105:71 » IllegalArgument pad must not be in alp...
  Base32InputStreamTest.testCodec130:50 » IllegalArgument pad must not be in alp...
  Base32InputStreamTest.testAvailable:155 » IllegalArgument pad must not be in a...
  Base32InputStreamTest.testBase32EmptyInputStreamMimeChuckSize:174->testBase32EmptyInputStream:191->testByteByByte:342 » IllegalArgument
  Base32InputStreamTest.testSkipPastEnd:519 » IllegalArgument pad must not be in...
  Base32InputStreamTest.testSkipBig:503 » IllegalArgument pad must not be in alp...
  Base32InputStreamTest.testBase32InputStreamByChunk:206->testByChunk:291 » IllegalArgument
  Base32OutputStreamTest.testWriteOutOfBounds:287 » IllegalArgument pad must not...
  Base32OutputStreamTest.testBase32EmptyOutputStreamPemChunkSize:80->testBase32EmptyOutputStream:86->testByteByByte:232 » IllegalArgument
  Base32OutputStreamTest.testWriteToNullCoverage:328 » IllegalArgument pad must ...
  Base32OutputStreamTest.testBase32EmptyOutputStreamMimeChunkSize:69->testBase32EmptyOutputStream:86->testByteByByte:232 » IllegalArgument
  Base32OutputStreamTest.testBase32OutputStreamByChunk:101->testByChunk:182 » IllegalArgument
  Base32OutputStreamTest.testBase32OutputStreamByteByByte:136->testByteByByte:232 » IllegalArgument

Tests run: 662, Failures: 0, Errors: 29, Skipped: 1

[INFO] ------------------------------------------------------------------------
[INFO] BUILD FAILURE
[INFO] ------------------------------------------------------------------------
[INFO] Total time: 13.575s
[INFO] Finished at: Sun Aug 02 06:08:46 BST 2015
[INFO] Final Memory: 20M/287M
[INFO] ------------------------------------------------------------------------
[ERROR] Failed to execute goal org.apache.maven.plugins:maven-surefire-plugin:2.17:test (default-test) on project commons-codec: There are test failures.
[ERROR] 
[ERROR] Please refer to /home/perham/Study/LittleDarwin/Cases/commons-codec-1.10-src/target/surefire-reports for the individual test results.
[ERROR] -> [Help 1]
[ERROR] 
[ERROR] To see the full stack trace of the errors, re-run Maven with the -e switch.
[ERROR] Re-run Maven using the -X switch to enable full debug logging.
[ERROR] 
[ERROR] For more information about the errors and possible solutions, please read the following articles:
[ERROR] [Help 1] http://cwiki.apache.org/confluence/display/MAVEN/MojoFailureException
