-------------------------------------------------------------------------------
Test set: org.apache.commons.cli.bug.BugCLI71Test
-------------------------------------------------------------------------------
Tests run: 4, Failures: 1, Errors: 2, Skipped: 0, Time elapsed: 0.001 sec <<< FAILURE! - in org.apache.commons.cli.bug.BugCLI71Test
testBasic(org.apache.commons.cli.bug.BugCLI71Test)  Time elapsed: 0 sec  <<< ERROR!
org.apache.commons.cli.MissingArgumentException: Missing argument for option: k
	at org.apache.commons.cli.Parser.processArgs(Parser.java:363)
	at org.apache.commons.cli.Parser.processOption(Parser.java:395)
	at org.apache.commons.cli.Parser.parse(Parser.java:210)
	at org.apache.commons.cli.Parser.parse(Parser.java:88)
	at org.apache.commons.cli.bug.BugCLI71Test.testBasic(BugCLI71Test.java:56)

testMistakenArgument(org.apache.commons.cli.bug.BugCLI71Test)  Time elapsed: 0 sec  <<< ERROR!
org.apache.commons.cli.MissingArgumentException: Missing argument for option: k
	at org.apache.commons.cli.Parser.processArgs(Parser.java:363)
	at org.apache.commons.cli.Parser.processOption(Parser.java:395)
	at org.apache.commons.cli.Parser.parse(Parser.java:210)
	at org.apache.commons.cli.Parser.parse(Parser.java:88)
	at org.apache.commons.cli.bug.BugCLI71Test.testMistakenArgument(BugCLI71Test.java:64)

testGetsDefaultIfOptional(org.apache.commons.cli.bug.BugCLI71Test)  Time elapsed: 0 sec  <<< FAILURE!
org.junit.ComparisonFailure: expected:<[Caesar]> but was:<[aesa]>
	at org.junit.Assert.assertEquals(Assert.java:115)
	at org.junit.Assert.assertEquals(Assert.java:144)
	at org.apache.commons.cli.bug.BugCLI71Test.testGetsDefaultIfOptional(BugCLI71Test.java:88)

