-------------------------------------------------------------------------------
Test set: org.apache.commons.cli.ValueTest
-------------------------------------------------------------------------------
Tests run: 12, Failures: 8, Errors: 0, Skipped: 0, Time elapsed: 0.009 sec <<< FAILURE! - in org.apache.commons.cli.ValueTest
testShortOptionalArgValues(org.apache.commons.cli.ValueTest)  Time elapsed: 0 sec  <<< FAILURE!
org.junit.ComparisonFailure: expected:<[ink]> but was:<[n]>
	at org.junit.Assert.assertEquals(Assert.java:115)
	at org.junit.Assert.assertEquals(Assert.java:144)
	at org.apache.commons.cli.ValueTest.testShortOptionalArgValues(ValueTest.java:141)

testLongOptionalArgValue(org.apache.commons.cli.ValueTest)  Time elapsed: 0 sec  <<< FAILURE!
org.junit.ComparisonFailure: expected:<[face]> but was:<[ac]>
	at org.junit.Assert.assertEquals(Assert.java:115)
	at org.junit.Assert.assertEquals(Assert.java:144)
	at org.apache.commons.cli.ValueTest.testLongOptionalArgValue(ValueTest.java:130)

testLongWithArg(org.apache.commons.cli.ValueTest)  Time elapsed: 0 sec  <<< FAILURE!
org.junit.ComparisonFailure: expected:<[a]> but was:<[bar]>
	at org.junit.Assert.assertEquals(Assert.java:115)
	at org.junit.Assert.assertEquals(Assert.java:144)
	at org.apache.commons.cli.ValueTest.testLongWithArg(ValueTest.java:86)

testLongOptionalNArgValues(org.apache.commons.cli.ValueTest)  Time elapsed: 0 sec  <<< FAILURE!
org.junit.ComparisonFailure: expected:<[house]> but was:<[ous]>
	at org.junit.Assert.assertEquals(Assert.java:115)
	at org.junit.Assert.assertEquals(Assert.java:144)
	at org.apache.commons.cli.ValueTest.testLongOptionalNArgValues(ValueTest.java:188)

testShortWithArg(org.apache.commons.cli.ValueTest)  Time elapsed: 0.001 sec  <<< FAILURE!
org.junit.ComparisonFailure: expected:<[]o> but was:<[fo]o>
	at org.junit.Assert.assertEquals(Assert.java:115)
	at org.junit.Assert.assertEquals(Assert.java:144)
	at org.apache.commons.cli.ValueTest.testShortWithArg(ValueTest.java:71)

testLongOptionalArgValues(org.apache.commons.cli.ValueTest)  Time elapsed: 0.001 sec  <<< FAILURE!
org.junit.ComparisonFailure: expected:<[gold]> but was:<[ol]>
	at org.junit.Assert.assertEquals(Assert.java:115)
	at org.junit.Assert.assertEquals(Assert.java:144)
	at org.apache.commons.cli.ValueTest.testLongOptionalArgValues(ValueTest.java:155)

testShortOptionalNArgValues(org.apache.commons.cli.ValueTest)  Time elapsed: 0.001 sec  <<< FAILURE!
org.junit.ComparisonFailure: expected:<[ink]> but was:<[n]>
	at org.junit.Assert.assertEquals(Assert.java:115)
	at org.junit.Assert.assertEquals(Assert.java:144)
	at org.apache.commons.cli.ValueTest.testShortOptionalNArgValues(ValueTest.java:169)

testShortOptionalArgValue(org.apache.commons.cli.ValueTest)  Time elapsed: 0 sec  <<< FAILURE!
org.junit.ComparisonFailure: expected:<[everything]> but was:<[verythin]>
	at org.junit.Assert.assertEquals(Assert.java:115)
	at org.junit.Assert.assertEquals(Assert.java:144)
	at org.apache.commons.cli.ValueTest.testShortOptionalArgValue(ValueTest.java:108)

