-------------------------------------------------------------------------------
Test set: org.apache.commons.cli.PatternOptionBuilderTest
-------------------------------------------------------------------------------
Tests run: 9, Failures: 5, Errors: 1, Skipped: 0, Time elapsed: 0.014 sec <<< FAILURE! - in org.apache.commons.cli.PatternOptionBuilderTest
testSimplePattern(org.apache.commons.cli.PatternOptionBuilderTest)  Time elapsed: 0 sec  <<< FAILURE!
org.junit.ComparisonFailure: flag a expected:<[fo]o> but was:<[]o>
	at org.junit.Assert.assertEquals(Assert.java:115)
	at org.apache.commons.cli.PatternOptionBuilderTest.testSimplePattern(PatternOptionBuilderTest.java:49)

testExistingFilePattern(org.apache.commons.cli.PatternOptionBuilderTest)  Time elapsed: 0.003 sec  <<< FAILURE!
java.lang.AssertionError: f value expected:<test.properties> but was:<est.propertie>
	at org.junit.Assert.fail(Assert.java:88)
	at org.junit.Assert.failNotEquals(Assert.java:834)
	at org.junit.Assert.assertEquals(Assert.java:118)
	at org.apache.commons.cli.PatternOptionBuilderTest.testExistingFilePattern(PatternOptionBuilderTest.java:166)

testURLPattern(org.apache.commons.cli.PatternOptionBuilderTest)  Time elapsed: 0.004 sec  <<< FAILURE!
java.lang.AssertionError: u value expected:<http://commons.apache.org> but was:<null>
	at org.junit.Assert.fail(Assert.java:88)
	at org.junit.Assert.failNotEquals(Assert.java:834)
	at org.junit.Assert.assertEquals(Assert.java:118)
	at org.apache.commons.cli.PatternOptionBuilderTest.testURLPattern(PatternOptionBuilderTest.java:155)

testClassPattern(org.apache.commons.cli.PatternOptionBuilderTest)  Time elapsed: 0.002 sec  <<< FAILURE!
java.lang.AssertionError: c value expected:<class java.util.Calendar> but was:<null>
	at org.junit.Assert.fail(Assert.java:88)
	at org.junit.Assert.failNotEquals(Assert.java:834)
	at org.junit.Assert.assertEquals(Assert.java:118)
	at org.apache.commons.cli.PatternOptionBuilderTest.testClassPattern(PatternOptionBuilderTest.java:132)

testNumberPattern(org.apache.commons.cli.PatternOptionBuilderTest)  Time elapsed: 0.001 sec  <<< ERROR!
org.apache.commons.cli.MissingArgumentException: Missing argument for option: n
	at org.apache.commons.cli.Parser.processArgs(Parser.java:363)
	at org.apache.commons.cli.Parser.processOption(Parser.java:395)
	at org.apache.commons.cli.Parser.parse(Parser.java:210)
	at org.apache.commons.cli.Parser.parse(Parser.java:88)
	at org.apache.commons.cli.PatternOptionBuilderTest.testNumberPattern(PatternOptionBuilderTest.java:114)

testObjectPattern(org.apache.commons.cli.PatternOptionBuilderTest)  Time elapsed: 0.001 sec  <<< FAILURE!
java.lang.AssertionError: o value expected:<> but was:<null>
	at org.junit.Assert.fail(Assert.java:88)
	at org.junit.Assert.failNotEquals(Assert.java:834)
	at org.junit.Assert.assertEquals(Assert.java:118)
	at org.apache.commons.cli.PatternOptionBuilderTest.testObjectPattern(PatternOptionBuilderTest.java:143)

