-------------------------------------------------------------------------------
Test set: org.apache.commons.cli.CommandLineTest
-------------------------------------------------------------------------------
Tests run: 3, Failures: 2, Errors: 0, Skipped: 0, Time elapsed: 0.002 sec <<< FAILURE! - in org.apache.commons.cli.CommandLineTest
testGetParsedOptionValue(org.apache.commons.cli.CommandLineTest)  Time elapsed: 0 sec  <<< FAILURE!
java.lang.AssertionError: expected:<123> but was:<2>
	at org.junit.Assert.fail(Assert.java:88)
	at org.junit.Assert.failNotEquals(Assert.java:834)
	at org.junit.Assert.assertEquals(Assert.java:645)
	at org.junit.Assert.assertEquals(Assert.java:631)
	at org.apache.commons.cli.CommandLineTest.testGetParsedOptionValue(CommandLineTest.java:76)

testGetOptionProperties(org.apache.commons.cli.CommandLineTest)  Time elapsed: 0 sec  <<< FAILURE!
java.lang.AssertionError: property 1 expected:<value1> but was:<null>
	at org.junit.Assert.fail(Assert.java:88)
	at org.junit.Assert.failNotEquals(Assert.java:834)
	at org.junit.Assert.assertEquals(Assert.java:118)
	at org.apache.commons.cli.CommandLineTest.testGetOptionProperties(CommandLineTest.java:45)

