-------------------------------------------------------------------------------
Test set: org.apache.commons.cli.ArgumentIsOptionTest
-------------------------------------------------------------------------------
Tests run: 3, Failures: 0, Errors: 2, Skipped: 0, Time elapsed: 0.04 sec <<< FAILURE! - in org.apache.commons.cli.ArgumentIsOptionTest
testOptionWithArgument(org.apache.commons.cli.ArgumentIsOptionTest)  Time elapsed: 0.037 sec  <<< ERROR!
org.apache.commons.cli.MissingArgumentException: Missing argument for option: attr
	at org.apache.commons.cli.Parser.processArgs(Parser.java:363)
	at org.apache.commons.cli.Parser.processOption(Parser.java:395)
	at org.apache.commons.cli.Parser.parse(Parser.java:210)
	at org.apache.commons.cli.Parser.parse(Parser.java:88)
	at org.apache.commons.cli.ArgumentIsOptionTest.testOptionWithArgument(ArgumentIsOptionTest.java:64)

testOptionAndOptionWithArgument(org.apache.commons.cli.ArgumentIsOptionTest)  Time elapsed: 0 sec  <<< ERROR!
org.apache.commons.cli.MissingArgumentException: Missing argument for option: attr
	at org.apache.commons.cli.Parser.processArgs(Parser.java:363)
	at org.apache.commons.cli.Parser.processOption(Parser.java:395)
	at org.apache.commons.cli.Parser.parse(Parser.java:210)
	at org.apache.commons.cli.Parser.parse(Parser.java:88)
	at org.apache.commons.cli.ArgumentIsOptionTest.testOptionAndOptionWithArgument(ArgumentIsOptionTest.java:49)

