-------------------------------------------------------------------------------
Test set: org.apache.commons.cli.ApplicationTest
-------------------------------------------------------------------------------
Tests run: 5, Failures: 3, Errors: 1, Skipped: 0, Time elapsed: 0.005 sec <<< FAILURE! - in org.apache.commons.cli.ApplicationTest
testAnt(org.apache.commons.cli.ApplicationTest)  Time elapsed: 0 sec  <<< FAILURE!
org.junit.ComparisonFailure: expected:<[p]roperty> but was:<[]roperty>
	at org.junit.Assert.assertEquals(Assert.java:115)
	at org.junit.Assert.assertEquals(Assert.java:144)
	at org.apache.commons.cli.ApplicationTest.testAnt(ApplicationTest.java:101)

testNLT(org.apache.commons.cli.ApplicationTest)  Time elapsed: 0.001 sec  <<< ERROR!
org.apache.commons.cli.MissingArgumentException: Missing argument for option: a
	at org.apache.commons.cli.Parser.processArgs(Parser.java:363)
	at org.apache.commons.cli.Parser.processOption(Parser.java:395)
	at org.apache.commons.cli.Parser.parse(Parser.java:210)
	at org.apache.commons.cli.Parser.parse(Parser.java:88)
	at org.apache.commons.cli.ApplicationTest.testNLT(ApplicationTest.java:332)

testLs(org.apache.commons.cli.ApplicationTest)  Time elapsed: 0.001 sec  <<< FAILURE!
org.junit.ComparisonFailure: expected:<[]> but was:<[10]>
	at org.junit.Assert.assertEquals(Assert.java:115)
	at org.junit.Assert.assertEquals(Assert.java:144)
	at org.apache.commons.cli.ApplicationTest.testLs(ApplicationTest.java:65)

testGroovy(org.apache.commons.cli.ApplicationTest)  Time elapsed: 0.001 sec  <<< FAILURE!
org.junit.ComparisonFailure: expected:<[println 'hello']> but was:<[rintln 'hello]>
	at org.junit.Assert.assertEquals(Assert.java:115)
	at org.junit.Assert.assertEquals(Assert.java:144)
	at org.apache.commons.cli.ApplicationTest.testGroovy(ApplicationTest.java:178)

