[INFO] Scanning for projects...
[INFO]                                                                         
[INFO] ------------------------------------------------------------------------
[INFO] Building Apache Commons CLI 1.3.1
[INFO] ------------------------------------------------------------------------
[INFO] 
[INFO] --- maven-enforcer-plugin:1.3.1:enforce (enforce-maven-3) @ commons-cli ---
[INFO] 
[INFO] --- build-helper-maven-plugin:1.8:parse-version (parse-version) @ commons-cli ---
[INFO] 
[INFO] --- maven-antrun-plugin:1.7:run (javadoc.resources) @ commons-cli ---
[INFO] Executing tasks

main:
[INFO] Executed tasks
[INFO] 
[INFO] --- maven-remote-resources-plugin:1.5:process (default) @ commons-cli ---
[INFO] 
[INFO] --- buildnumber-maven-plugin:1.3:create (default) @ commons-cli ---
[INFO] Executing: /bin/sh -c cd /home/perham/Study/LittleDarwin/Cases/commons-cli-1.3.1-src && svn --non-interactive info
[INFO] Working directory: /home/perham/Study/LittleDarwin/Cases/commons-cli-1.3.1-src
[INFO] Storing buildNumber: ?????? at timestamp: 1438484783795
[INFO] Executing: /bin/sh -c cd /home/perham/Study/LittleDarwin/Cases/commons-cli-1.3.1-src && svn --non-interactive info
[INFO] Working directory: /home/perham/Study/LittleDarwin/Cases/commons-cli-1.3.1-src
[INFO] Storing buildScmBranch: UNKNOWN_BRANCH
[INFO] 
[INFO] --- maven-resources-plugin:2.7:resources (default-resources) @ commons-cli ---
[INFO] Using 'iso-8859-1' encoding to copy filtered resources.
[INFO] skip non existing resourceDirectory /home/perham/Study/LittleDarwin/Cases/commons-cli-1.3.1-src/src/main/resources
[INFO] Copying 2 resources to META-INF
[INFO] 
[INFO] --- maven-compiler-plugin:3.2:compile (default-compile) @ commons-cli ---
[INFO] Changes detected - recompiling the module!
[INFO] Compiling 23 source files to /home/perham/Study/LittleDarwin/Cases/commons-cli-1.3.1-src/target/classes
[INFO] /home/perham/Study/LittleDarwin/Cases/commons-cli-1.3.1-src/src/main/java/org/apache/commons/cli/Parser.java: Some input files use unchecked or unsafe operations.
[INFO] /home/perham/Study/LittleDarwin/Cases/commons-cli-1.3.1-src/src/main/java/org/apache/commons/cli/Parser.java: Recompile with -Xlint:unchecked for details.
[INFO] 
[INFO] --- maven-bundle-plugin:2.5.3:manifest (bundle-manifest) @ commons-cli ---
[INFO] 
[INFO] --- animal-sniffer-maven-plugin:1.13:check (checkAPIcompatibility) @ commons-cli ---
[INFO] Checking unresolved references to org.codehaus.mojo.signature:java15:1.0
[INFO] 
[INFO] --- maven-resources-plugin:2.7:testResources (default-testResources) @ commons-cli ---
[INFO] Using 'iso-8859-1' encoding to copy filtered resources.
[INFO] Copying 0 resource
[INFO] Copying 2 resources to META-INF
[INFO] 
[INFO] --- maven-compiler-plugin:3.2:testCompile (default-testCompile) @ commons-cli ---
[INFO] Nothing to compile - all classes are up to date
[INFO] 
[INFO] --- jacoco-maven-plugin:0.7.2.201409121644:prepare-agent (prepare-agent) @ commons-cli ---
[INFO] argLine set to -javaagent:/home/perham/.m2/repository/org/jacoco/org.jacoco.agent/0.7.2.201409121644/org.jacoco.agent-0.7.2.201409121644-runtime.jar=destfile=/home/perham/Study/LittleDarwin/Cases/commons-cli-1.3.1-src/target/jacoco.exec
[INFO] 
[INFO] --- maven-surefire-plugin:2.18:test (default-test) @ commons-cli ---
[INFO] Surefire report directory: /home/perham/Study/LittleDarwin/Cases/commons-cli-1.3.1-src/target/surefire-reports

-------------------------------------------------------
 T E S T S
-------------------------------------------------------
Running org.apache.commons.cli.ArgumentIsOptionTest
Tests run: 3, Failures: 0, Errors: 2, Skipped: 0, Time elapsed: 0.033 sec <<< FAILURE! - in org.apache.commons.cli.ArgumentIsOptionTest
testOptionWithArgument(org.apache.commons.cli.ArgumentIsOptionTest)  Time elapsed: 0.032 sec  <<< ERROR!
org.apache.commons.cli.MissingArgumentException: Missing argument for option: attr
	at org.apache.commons.cli.Parser.processArgs(Parser.java:68)
	at org.apache.commons.cli.Parser.processOption(Parser.java:73)
	at org.apache.commons.cli.Parser.parse(Parser.java:40)
	at org.apache.commons.cli.Parser.parse(Parser.java:23)
	at org.apache.commons.cli.ArgumentIsOptionTest.testOptionWithArgument(ArgumentIsOptionTest.java:64)

testOptionAndOptionWithArgument(org.apache.commons.cli.ArgumentIsOptionTest)  Time elapsed: 0 sec  <<< ERROR!
org.apache.commons.cli.MissingArgumentException: Missing argument for option: attr
	at org.apache.commons.cli.Parser.processArgs(Parser.java:68)
	at org.apache.commons.cli.Parser.processOption(Parser.java:73)
	at org.apache.commons.cli.Parser.parse(Parser.java:40)
	at org.apache.commons.cli.Parser.parse(Parser.java:23)
	at org.apache.commons.cli.ArgumentIsOptionTest.testOptionAndOptionWithArgument(ArgumentIsOptionTest.java:49)

Running org.apache.commons.cli.DefaultParserTest
Tests run: 58, Failures: 0, Errors: 0, Skipped: 0, Time elapsed: 0.093 sec - in org.apache.commons.cli.DefaultParserTest
Running org.apache.commons.cli.ValuesTest
Tests run: 7, Failures: 0, Errors: 7, Skipped: 0, Time elapsed: 0.007 sec <<< FAILURE! - in org.apache.commons.cli.ValuesTest
testTwoArgValues(org.apache.commons.cli.ValuesTest)  Time elapsed: 0 sec  <<< ERROR!
org.apache.commons.cli.MissingArgumentException: Missing argument for option: b
	at org.apache.commons.cli.Parser.processArgs(Parser.java:68)
	at org.apache.commons.cli.Parser.processOption(Parser.java:73)
	at org.apache.commons.cli.Parser.parse(Parser.java:40)
	at org.apache.commons.cli.Parser.parse(Parser.java:23)
	at org.apache.commons.cli.ValuesTest.setUp(ValuesTest.java:70)

testShortArgs(org.apache.commons.cli.ValuesTest)  Time elapsed: 0 sec  <<< ERROR!
org.apache.commons.cli.MissingArgumentException: Missing argument for option: b
	at org.apache.commons.cli.Parser.processArgs(Parser.java:68)
	at org.apache.commons.cli.Parser.processOption(Parser.java:73)
	at org.apache.commons.cli.Parser.parse(Parser.java:40)
	at org.apache.commons.cli.Parser.parse(Parser.java:23)
	at org.apache.commons.cli.ValuesTest.setUp(ValuesTest.java:70)

testCharSeparator(org.apache.commons.cli.ValuesTest)  Time elapsed: 0 sec  <<< ERROR!
org.apache.commons.cli.MissingArgumentException: Missing argument for option: b
	at org.apache.commons.cli.Parser.processArgs(Parser.java:68)
	at org.apache.commons.cli.Parser.processOption(Parser.java:73)
	at org.apache.commons.cli.Parser.parse(Parser.java:40)
	at org.apache.commons.cli.Parser.parse(Parser.java:23)
	at org.apache.commons.cli.ValuesTest.setUp(ValuesTest.java:70)

testExtraArgs(org.apache.commons.cli.ValuesTest)  Time elapsed: 0.001 sec  <<< ERROR!
org.apache.commons.cli.MissingArgumentException: Missing argument for option: b
	at org.apache.commons.cli.Parser.processArgs(Parser.java:68)
	at org.apache.commons.cli.Parser.processOption(Parser.java:73)
	at org.apache.commons.cli.Parser.parse(Parser.java:40)
	at org.apache.commons.cli.Parser.parse(Parser.java:23)
	at org.apache.commons.cli.ValuesTest.setUp(ValuesTest.java:70)

testShortArgsWithValue(org.apache.commons.cli.ValuesTest)  Time elapsed: 0.001 sec  <<< ERROR!
org.apache.commons.cli.MissingArgumentException: Missing argument for option: b
	at org.apache.commons.cli.Parser.processArgs(Parser.java:68)
	at org.apache.commons.cli.Parser.processOption(Parser.java:73)
	at org.apache.commons.cli.Parser.parse(Parser.java:40)
	at org.apache.commons.cli.Parser.parse(Parser.java:23)
	at org.apache.commons.cli.ValuesTest.setUp(ValuesTest.java:70)

testComplexValues(org.apache.commons.cli.ValuesTest)  Time elapsed: 0.002 sec  <<< ERROR!
org.apache.commons.cli.MissingArgumentException: Missing argument for option: b
	at org.apache.commons.cli.Parser.processArgs(Parser.java:68)
	at org.apache.commons.cli.Parser.processOption(Parser.java:73)
	at org.apache.commons.cli.Parser.parse(Parser.java:40)
	at org.apache.commons.cli.Parser.parse(Parser.java:23)
	at org.apache.commons.cli.ValuesTest.setUp(ValuesTest.java:70)

testMultipleArgValues(org.apache.commons.cli.ValuesTest)  Time elapsed: 0.001 sec  <<< ERROR!
org.apache.commons.cli.MissingArgumentException: Missing argument for option: b
	at org.apache.commons.cli.Parser.processArgs(Parser.java:68)
	at org.apache.commons.cli.Parser.processOption(Parser.java:73)
	at org.apache.commons.cli.Parser.parse(Parser.java:40)
	at org.apache.commons.cli.Parser.parse(Parser.java:23)
	at org.apache.commons.cli.ValuesTest.setUp(ValuesTest.java:70)

Running org.apache.commons.cli.OptionsTest
Tests run: 10, Failures: 0, Errors: 0, Skipped: 0, Time elapsed: 0 sec - in org.apache.commons.cli.OptionsTest
Running org.apache.commons.cli.GnuParserTest
Tests run: 58, Failures: 0, Errors: 17, Skipped: 0, Time elapsed: 0.051 sec <<< FAILURE! - in org.apache.commons.cli.GnuParserTest
testSimpleLong(org.apache.commons.cli.GnuParserTest)  Time elapsed: 0 sec  <<< ERROR!
org.apache.commons.cli.MissingArgumentException: Missing argument for option: b
	at org.apache.commons.cli.Parser.processArgs(Parser.java:68)
	at org.apache.commons.cli.Parser.processOption(Parser.java:73)
	at org.apache.commons.cli.Parser.parse(Parser.java:40)
	at org.apache.commons.cli.Parser.parse(Parser.java:23)
	at org.apache.commons.cli.ParserTestCase.testSimpleLong(ParserTestCase.java:73)
	at sun.reflect.NativeMethodAccessorImpl.invoke0(Native Method)
	at sun.reflect.NativeMethodAccessorImpl.invoke(NativeMethodAccessorImpl.java:57)
	at sun.reflect.DelegatingMethodAccessorImpl.invoke(DelegatingMethodAccessorImpl.java:43)
	at java.lang.reflect.Method.invoke(Method.java:606)
	at org.junit.runners.model.FrameworkMethod$1.runReflectiveCall(FrameworkMethod.java:50)
	at org.junit.internal.runners.model.ReflectiveCallable.run(ReflectiveCallable.java:12)
	at org.junit.runners.model.FrameworkMethod.invokeExplosively(FrameworkMethod.java:47)
	at org.junit.internal.runners.statements.InvokeMethod.evaluate(InvokeMethod.java:17)
	at org.junit.internal.runners.statements.RunBefores.evaluate(RunBefores.java:26)
	at org.junit.runners.ParentRunner.runLeaf(ParentRunner.java:325)
	at org.junit.runners.BlockJUnit4ClassRunner.runChild(BlockJUnit4ClassRunner.java:78)
	at org.junit.runners.BlockJUnit4ClassRunner.runChild(BlockJUnit4ClassRunner.java:57)
	at org.junit.runners.ParentRunner$3.run(ParentRunner.java:290)
	at org.junit.runners.ParentRunner$1.schedule(ParentRunner.java:71)
	at org.junit.runners.ParentRunner.runChildren(ParentRunner.java:288)
	at org.junit.runners.ParentRunner.access$000(ParentRunner.java:58)
	at org.junit.runners.ParentRunner$2.evaluate(ParentRunner.java:268)
	at org.junit.runners.ParentRunner.run(ParentRunner.java:363)
	at org.apache.maven.surefire.junit4.JUnit4Provider.execute(JUnit4Provider.java:283)
	at org.apache.maven.surefire.junit4.JUnit4Provider.executeWithRerun(JUnit4Provider.java:173)
	at org.apache.maven.surefire.junit4.JUnit4Provider.executeTestSet(JUnit4Provider.java:153)
	at org.apache.maven.surefire.junit4.JUnit4Provider.invoke(JUnit4Provider.java:128)
	at org.apache.maven.surefire.booter.ForkedBooter.invokeProviderInSameClassLoader(ForkedBooter.java:203)
	at org.apache.maven.surefire.booter.ForkedBooter.runSuitesInProcess(ForkedBooter.java:155)
	at org.apache.maven.surefire.booter.ForkedBooter.main(ForkedBooter.java:103)

testSimpleShort(org.apache.commons.cli.GnuParserTest)  Time elapsed: 0.001 sec  <<< ERROR!
org.apache.commons.cli.MissingArgumentException: Missing argument for option: b
	at org.apache.commons.cli.Parser.processArgs(Parser.java:68)
	at org.apache.commons.cli.Parser.processOption(Parser.java:73)
	at org.apache.commons.cli.Parser.parse(Parser.java:40)
	at org.apache.commons.cli.Parser.parse(Parser.java:23)
	at org.apache.commons.cli.ParserTestCase.testSimpleShort(ParserTestCase.java:58)
	at sun.reflect.NativeMethodAccessorImpl.invoke0(Native Method)
	at sun.reflect.NativeMethodAccessorImpl.invoke(NativeMethodAccessorImpl.java:57)
	at sun.reflect.DelegatingMethodAccessorImpl.invoke(DelegatingMethodAccessorImpl.java:43)
	at java.lang.reflect.Method.invoke(Method.java:606)
	at org.junit.runners.model.FrameworkMethod$1.runReflectiveCall(FrameworkMethod.java:50)
	at org.junit.internal.runners.model.ReflectiveCallable.run(ReflectiveCallable.java:12)
	at org.junit.runners.model.FrameworkMethod.invokeExplosively(FrameworkMethod.java:47)
	at org.junit.internal.runners.statements.InvokeMethod.evaluate(InvokeMethod.java:17)
	at org.junit.internal.runners.statements.RunBefores.evaluate(RunBefores.java:26)
	at org.junit.runners.ParentRunner.runLeaf(ParentRunner.java:325)
	at org.junit.runners.BlockJUnit4ClassRunner.runChild(BlockJUnit4ClassRunner.java:78)
	at org.junit.runners.BlockJUnit4ClassRunner.runChild(BlockJUnit4ClassRunner.java:57)
	at org.junit.runners.ParentRunner$3.run(ParentRunner.java:290)
	at org.junit.runners.ParentRunner$1.schedule(ParentRunner.java:71)
	at org.junit.runners.ParentRunner.runChildren(ParentRunner.java:288)
	at org.junit.runners.ParentRunner.access$000(ParentRunner.java:58)
	at org.junit.runners.ParentRunner$2.evaluate(ParentRunner.java:268)
	at org.junit.runners.ParentRunner.run(ParentRunner.java:363)
	at org.apache.maven.surefire.junit4.JUnit4Provider.execute(JUnit4Provider.java:283)
	at org.apache.maven.surefire.junit4.JUnit4Provider.executeWithRerun(JUnit4Provider.java:173)
	at org.apache.maven.surefire.junit4.JUnit4Provider.executeTestSet(JUnit4Provider.java:153)
	at org.apache.maven.surefire.junit4.JUnit4Provider.invoke(JUnit4Provider.java:128)
	at org.apache.maven.surefire.booter.ForkedBooter.invokeProviderInSameClassLoader(ForkedBooter.java:203)
	at org.apache.maven.surefire.booter.ForkedBooter.runSuitesInProcess(ForkedBooter.java:155)
	at org.apache.maven.surefire.booter.ForkedBooter.main(ForkedBooter.java:103)

testShortWithoutEqual(org.apache.commons.cli.GnuParserTest)  Time elapsed: 0 sec  <<< ERROR!
org.apache.commons.cli.MissingArgumentException: Missing argument for option: f
	at org.apache.commons.cli.Parser.processArgs(Parser.java:68)
	at org.apache.commons.cli.Parser.processOption(Parser.java:73)
	at org.apache.commons.cli.Parser.parse(Parser.java:40)
	at org.apache.commons.cli.Parser.parse(Parser.java:23)
	at org.apache.commons.cli.ParserTestCase.testShortWithoutEqual(ParserTestCase.java:309)
	at sun.reflect.NativeMethodAccessorImpl.invoke0(Native Method)
	at sun.reflect.NativeMethodAccessorImpl.invoke(NativeMethodAccessorImpl.java:57)
	at sun.reflect.DelegatingMethodAccessorImpl.invoke(DelegatingMethodAccessorImpl.java:43)
	at java.lang.reflect.Method.invoke(Method.java:606)
	at org.junit.runners.model.FrameworkMethod$1.runReflectiveCall(FrameworkMethod.java:50)
	at org.junit.internal.runners.model.ReflectiveCallable.run(ReflectiveCallable.java:12)
	at org.junit.runners.model.FrameworkMethod.invokeExplosively(FrameworkMethod.java:47)
	at org.junit.internal.runners.statements.InvokeMethod.evaluate(InvokeMethod.java:17)
	at org.junit.internal.runners.statements.RunBefores.evaluate(RunBefores.java:26)
	at org.junit.runners.ParentRunner.runLeaf(ParentRunner.java:325)
	at org.junit.runners.BlockJUnit4ClassRunner.runChild(BlockJUnit4ClassRunner.java:78)
	at org.junit.runners.BlockJUnit4ClassRunner.runChild(BlockJUnit4ClassRunner.java:57)
	at org.junit.runners.ParentRunner$3.run(ParentRunner.java:290)
	at org.junit.runners.ParentRunner$1.schedule(ParentRunner.java:71)
	at org.junit.runners.ParentRunner.runChildren(ParentRunner.java:288)
	at org.junit.runners.ParentRunner.access$000(ParentRunner.java:58)
	at org.junit.runners.ParentRunner$2.evaluate(ParentRunner.java:268)
	at org.junit.runners.ParentRunner.run(ParentRunner.java:363)
	at org.apache.maven.surefire.junit4.JUnit4Provider.execute(JUnit4Provider.java:283)
	at org.apache.maven.surefire.junit4.JUnit4Provider.executeWithRerun(JUnit4Provider.java:173)
	at org.apache.maven.surefire.junit4.JUnit4Provider.executeTestSet(JUnit4Provider.java:153)
	at org.apache.maven.surefire.junit4.JUnit4Provider.invoke(JUnit4Provider.java:128)
	at org.apache.maven.surefire.booter.ForkedBooter.invokeProviderInSameClassLoader(ForkedBooter.java:203)
	at org.apache.maven.surefire.booter.ForkedBooter.runSuitesInProcess(ForkedBooter.java:155)
	at org.apache.maven.surefire.booter.ForkedBooter.main(ForkedBooter.java:103)

testNegativeArgument(org.apache.commons.cli.GnuParserTest)  Time elapsed: 0 sec  <<< ERROR!
org.apache.commons.cli.MissingArgumentException: Missing argument for option: b
	at org.apache.commons.cli.Parser.processArgs(Parser.java:68)
	at org.apache.commons.cli.Parser.processOption(Parser.java:73)
	at org.apache.commons.cli.Parser.parse(Parser.java:40)
	at org.apache.commons.cli.Parser.parse(Parser.java:23)
	at org.apache.commons.cli.ParserTestCase.testNegativeArgument(ParserTestCase.java:264)
	at sun.reflect.NativeMethodAccessorImpl.invoke0(Native Method)
	at sun.reflect.NativeMethodAccessorImpl.invoke(NativeMethodAccessorImpl.java:57)
	at sun.reflect.DelegatingMethodAccessorImpl.invoke(DelegatingMethodAccessorImpl.java:43)
	at java.lang.reflect.Method.invoke(Method.java:606)
	at org.junit.runners.model.FrameworkMethod$1.runReflectiveCall(FrameworkMethod.java:50)
	at org.junit.internal.runners.model.ReflectiveCallable.run(ReflectiveCallable.java:12)
	at org.junit.runners.model.FrameworkMethod.invokeExplosively(FrameworkMethod.java:47)
	at org.junit.internal.runners.statements.InvokeMethod.evaluate(InvokeMethod.java:17)
	at org.junit.internal.runners.statements.RunBefores.evaluate(RunBefores.java:26)
	at org.junit.runners.ParentRunner.runLeaf(ParentRunner.java:325)
	at org.junit.runners.BlockJUnit4ClassRunner.runChild(BlockJUnit4ClassRunner.java:78)
	at org.junit.runners.BlockJUnit4ClassRunner.runChild(BlockJUnit4ClassRunner.java:57)
	at org.junit.runners.ParentRunner$3.run(ParentRunner.java:290)
	at org.junit.runners.ParentRunner$1.schedule(ParentRunner.java:71)
	at org.junit.runners.ParentRunner.runChildren(ParentRunner.java:288)
	at org.junit.runners.ParentRunner.access$000(ParentRunner.java:58)
	at org.junit.runners.ParentRunner$2.evaluate(ParentRunner.java:268)
	at org.junit.runners.ParentRunner.run(ParentRunner.java:363)
	at org.apache.maven.surefire.junit4.JUnit4Provider.execute(JUnit4Provider.java:283)
	at org.apache.maven.surefire.junit4.JUnit4Provider.executeWithRerun(JUnit4Provider.java:173)
	at org.apache.maven.surefire.junit4.JUnit4Provider.executeTestSet(JUnit4Provider.java:153)
	at org.apache.maven.surefire.junit4.JUnit4Provider.invoke(JUnit4Provider.java:128)
	at org.apache.maven.surefire.booter.ForkedBooter.invokeProviderInSameClassLoader(ForkedBooter.java:203)
	at org.apache.maven.surefire.booter.ForkedBooter.runSuitesInProcess(ForkedBooter.java:155)
	at org.apache.maven.surefire.booter.ForkedBooter.main(ForkedBooter.java:103)

testMultipleWithLong(org.apache.commons.cli.GnuParserTest)  Time elapsed: 0.003 sec  <<< ERROR!
org.apache.commons.cli.MissingArgumentException: Missing argument for option: b
	at org.apache.commons.cli.Parser.processArgs(Parser.java:68)
	at org.apache.commons.cli.Parser.processOption(Parser.java:73)
	at org.apache.commons.cli.Parser.parse(Parser.java:40)
	at org.apache.commons.cli.Parser.parse(Parser.java:23)
	at org.apache.commons.cli.ParserTestCase.testMultipleWithLong(ParserTestCase.java:113)
	at sun.reflect.NativeMethodAccessorImpl.invoke0(Native Method)
	at sun.reflect.NativeMethodAccessorImpl.invoke(NativeMethodAccessorImpl.java:57)
	at sun.reflect.DelegatingMethodAccessorImpl.invoke(DelegatingMethodAccessorImpl.java:43)
	at java.lang.reflect.Method.invoke(Method.java:606)
	at org.junit.runners.model.FrameworkMethod$1.runReflectiveCall(FrameworkMethod.java:50)
	at org.junit.internal.runners.model.ReflectiveCallable.run(ReflectiveCallable.java:12)
	at org.junit.runners.model.FrameworkMethod.invokeExplosively(FrameworkMethod.java:47)
	at org.junit.internal.runners.statements.InvokeMethod.evaluate(InvokeMethod.java:17)
	at org.junit.internal.runners.statements.RunBefores.evaluate(RunBefores.java:26)
	at org.junit.runners.ParentRunner.runLeaf(ParentRunner.java:325)
	at org.junit.runners.BlockJUnit4ClassRunner.runChild(BlockJUnit4ClassRunner.java:78)
	at org.junit.runners.BlockJUnit4ClassRunner.runChild(BlockJUnit4ClassRunner.java:57)
	at org.junit.runners.ParentRunner$3.run(ParentRunner.java:290)
	at org.junit.runners.ParentRunner$1.schedule(ParentRunner.java:71)
	at org.junit.runners.ParentRunner.runChildren(ParentRunner.java:288)
	at org.junit.runners.ParentRunner.access$000(ParentRunner.java:58)
	at org.junit.runners.ParentRunner$2.evaluate(ParentRunner.java:268)
	at org.junit.runners.ParentRunner.run(ParentRunner.java:363)
	at org.apache.maven.surefire.junit4.JUnit4Provider.execute(JUnit4Provider.java:283)
	at org.apache.maven.surefire.junit4.JUnit4Provider.executeWithRerun(JUnit4Provider.java:173)
	at org.apache.maven.surefire.junit4.JUnit4Provider.executeTestSet(JUnit4Provider.java:153)
	at org.apache.maven.surefire.junit4.JUnit4Provider.invoke(JUnit4Provider.java:128)
	at org.apache.maven.surefire.booter.ForkedBooter.invokeProviderInSameClassLoader(ForkedBooter.java:203)
	at org.apache.maven.surefire.booter.ForkedBooter.runSuitesInProcess(ForkedBooter.java:155)
	at org.apache.maven.surefire.booter.ForkedBooter.main(ForkedBooter.java:103)

testSingleDash(org.apache.commons.cli.GnuParserTest)  Time elapsed: 0.003 sec  <<< ERROR!
org.apache.commons.cli.MissingArgumentException: Missing argument for option: b
	at org.apache.commons.cli.Parser.processArgs(Parser.java:68)
	at org.apache.commons.cli.Parser.processOption(Parser.java:73)
	at org.apache.commons.cli.Parser.parse(Parser.java:40)
	at org.apache.commons.cli.Parser.parse(Parser.java:23)
	at org.apache.commons.cli.ParserTestCase.testSingleDash(ParserTestCase.java:199)
	at sun.reflect.NativeMethodAccessorImpl.invoke0(Native Method)
	at sun.reflect.NativeMethodAccessorImpl.invoke(NativeMethodAccessorImpl.java:57)
	at sun.reflect.DelegatingMethodAccessorImpl.invoke(DelegatingMethodAccessorImpl.java:43)
	at java.lang.reflect.Method.invoke(Method.java:606)
	at org.junit.runners.model.FrameworkMethod$1.runReflectiveCall(FrameworkMethod.java:50)
	at org.junit.internal.runners.model.ReflectiveCallable.run(ReflectiveCallable.java:12)
	at org.junit.runners.model.FrameworkMethod.invokeExplosively(FrameworkMethod.java:47)
	at org.junit.internal.runners.statements.InvokeMethod.evaluate(InvokeMethod.java:17)
	at org.junit.internal.runners.statements.RunBefores.evaluate(RunBefores.java:26)
	at org.junit.runners.ParentRunner.runLeaf(ParentRunner.java:325)
	at org.junit.runners.BlockJUnit4ClassRunner.runChild(BlockJUnit4ClassRunner.java:78)
	at org.junit.runners.BlockJUnit4ClassRunner.runChild(BlockJUnit4ClassRunner.java:57)
	at org.junit.runners.ParentRunner$3.run(ParentRunner.java:290)
	at org.junit.runners.ParentRunner$1.schedule(ParentRunner.java:71)
	at org.junit.runners.ParentRunner.runChildren(ParentRunner.java:288)
	at org.junit.runners.ParentRunner.access$000(ParentRunner.java:58)
	at org.junit.runners.ParentRunner$2.evaluate(ParentRunner.java:268)
	at org.junit.runners.ParentRunner.run(ParentRunner.java:363)
	at org.apache.maven.surefire.junit4.JUnit4Provider.execute(JUnit4Provider.java:283)
	at org.apache.maven.surefire.junit4.JUnit4Provider.executeWithRerun(JUnit4Provider.java:173)
	at org.apache.maven.surefire.junit4.JUnit4Provider.executeTestSet(JUnit4Provider.java:153)
	at org.apache.maven.surefire.junit4.JUnit4Provider.invoke(JUnit4Provider.java:128)
	at org.apache.maven.surefire.booter.ForkedBooter.invokeProviderInSameClassLoader(ForkedBooter.java:203)
	at org.apache.maven.surefire.booter.ForkedBooter.runSuitesInProcess(ForkedBooter.java:155)
	at org.apache.maven.surefire.booter.ForkedBooter.main(ForkedBooter.java:103)

testShortWithEqual(org.apache.commons.cli.GnuParserTest)  Time elapsed: 0.003 sec  <<< ERROR!
org.apache.commons.cli.MissingArgumentException: Missing argument for option: f
	at org.apache.commons.cli.Parser.processArgs(Parser.java:68)
	at org.apache.commons.cli.Parser.processOption(Parser.java:73)
	at org.apache.commons.cli.Parser.parse(Parser.java:40)
	at org.apache.commons.cli.Parser.parse(Parser.java:23)
	at org.apache.commons.cli.ParserTestCase.testShortWithEqual(ParserTestCase.java:296)
	at sun.reflect.NativeMethodAccessorImpl.invoke0(Native Method)
	at sun.reflect.NativeMethodAccessorImpl.invoke(NativeMethodAccessorImpl.java:57)
	at sun.reflect.DelegatingMethodAccessorImpl.invoke(DelegatingMethodAccessorImpl.java:43)
	at java.lang.reflect.Method.invoke(Method.java:606)
	at org.junit.runners.model.FrameworkMethod$1.runReflectiveCall(FrameworkMethod.java:50)
	at org.junit.internal.runners.model.ReflectiveCallable.run(ReflectiveCallable.java:12)
	at org.junit.runners.model.FrameworkMethod.invokeExplosively(FrameworkMethod.java:47)
	at org.junit.internal.runners.statements.InvokeMethod.evaluate(InvokeMethod.java:17)
	at org.junit.internal.runners.statements.RunBefores.evaluate(RunBefores.java:26)
	at org.junit.runners.ParentRunner.runLeaf(ParentRunner.java:325)
	at org.junit.runners.BlockJUnit4ClassRunner.runChild(BlockJUnit4ClassRunner.java:78)
	at org.junit.runners.BlockJUnit4ClassRunner.runChild(BlockJUnit4ClassRunner.java:57)
	at org.junit.runners.ParentRunner$3.run(ParentRunner.java:290)
	at org.junit.runners.ParentRunner$1.schedule(ParentRunner.java:71)
	at org.junit.runners.ParentRunner.runChildren(ParentRunner.java:288)
	at org.junit.runners.ParentRunner.access$000(ParentRunner.java:58)
	at org.junit.runners.ParentRunner$2.evaluate(ParentRunner.java:268)
	at org.junit.runners.ParentRunner.run(ParentRunner.java:363)
	at org.apache.maven.surefire.junit4.JUnit4Provider.execute(JUnit4Provider.java:283)
	at org.apache.maven.surefire.junit4.JUnit4Provider.executeWithRerun(JUnit4Provider.java:173)
	at org.apache.maven.surefire.junit4.JUnit4Provider.executeTestSet(JUnit4Provider.java:153)
	at org.apache.maven.surefire.junit4.JUnit4Provider.invoke(JUnit4Provider.java:128)
	at org.apache.maven.surefire.booter.ForkedBooter.invokeProviderInSameClassLoader(ForkedBooter.java:203)
	at org.apache.maven.surefire.booter.ForkedBooter.runSuitesInProcess(ForkedBooter.java:155)
	at org.apache.maven.surefire.booter.ForkedBooter.main(ForkedBooter.java:103)

testWithRequiredOption(org.apache.commons.cli.GnuParserTest)  Time elapsed: 0.003 sec  <<< ERROR!
org.apache.commons.cli.MissingArgumentException: Missing argument for option: b
	at org.apache.commons.cli.Parser.processArgs(Parser.java:68)
	at org.apache.commons.cli.Parser.processOption(Parser.java:73)
	at org.apache.commons.cli.Parser.parse(Parser.java:40)
	at org.apache.commons.cli.Parser.parse(Parser.java:23)
	at org.apache.commons.cli.ParserTestCase.testWithRequiredOption(ParserTestCase.java:674)
	at sun.reflect.NativeMethodAccessorImpl.invoke0(Native Method)
	at sun.reflect.NativeMethodAccessorImpl.invoke(NativeMethodAccessorImpl.java:57)
	at sun.reflect.DelegatingMethodAccessorImpl.invoke(DelegatingMethodAccessorImpl.java:43)
	at java.lang.reflect.Method.invoke(Method.java:606)
	at org.junit.runners.model.FrameworkMethod$1.runReflectiveCall(FrameworkMethod.java:50)
	at org.junit.internal.runners.model.ReflectiveCallable.run(ReflectiveCallable.java:12)
	at org.junit.runners.model.FrameworkMethod.invokeExplosively(FrameworkMethod.java:47)
	at org.junit.internal.runners.statements.InvokeMethod.evaluate(InvokeMethod.java:17)
	at org.junit.internal.runners.statements.RunBefores.evaluate(RunBefores.java:26)
	at org.junit.runners.ParentRunner.runLeaf(ParentRunner.java:325)
	at org.junit.runners.BlockJUnit4ClassRunner.runChild(BlockJUnit4ClassRunner.java:78)
	at org.junit.runners.BlockJUnit4ClassRunner.runChild(BlockJUnit4ClassRunner.java:57)
	at org.junit.runners.ParentRunner$3.run(ParentRunner.java:290)
	at org.junit.runners.ParentRunner$1.schedule(ParentRunner.java:71)
	at org.junit.runners.ParentRunner.runChildren(ParentRunner.java:288)
	at org.junit.runners.ParentRunner.access$000(ParentRunner.java:58)
	at org.junit.runners.ParentRunner$2.evaluate(ParentRunner.java:268)
	at org.junit.runners.ParentRunner.run(ParentRunner.java:363)
	at org.apache.maven.surefire.junit4.JUnit4Provider.execute(JUnit4Provider.java:283)
	at org.apache.maven.surefire.junit4.JUnit4Provider.executeWithRerun(JUnit4Provider.java:173)
	at org.apache.maven.surefire.junit4.JUnit4Provider.executeTestSet(JUnit4Provider.java:153)
	at org.apache.maven.surefire.junit4.JUnit4Provider.invoke(JUnit4Provider.java:128)
	at org.apache.maven.surefire.booter.ForkedBooter.invokeProviderInSameClassLoader(ForkedBooter.java:203)
	at org.apache.maven.surefire.booter.ForkedBooter.runSuitesInProcess(ForkedBooter.java:155)
	at org.apache.maven.surefire.booter.ForkedBooter.main(ForkedBooter.java:103)

testUnlimitedArgs(org.apache.commons.cli.GnuParserTest)  Time elapsed: 0.003 sec  <<< ERROR!
org.apache.commons.cli.MissingArgumentException: Missing argument for option: e
	at org.apache.commons.cli.Parser.processArgs(Parser.java:68)
	at org.apache.commons.cli.Parser.processOption(Parser.java:73)
	at org.apache.commons.cli.Parser.parse(Parser.java:40)
	at org.apache.commons.cli.Parser.parse(Parser.java:23)
	at org.apache.commons.cli.ParserTestCase.testUnlimitedArgs(ParserTestCase.java:921)
	at sun.reflect.NativeMethodAccessorImpl.invoke0(Native Method)
	at sun.reflect.NativeMethodAccessorImpl.invoke(NativeMethodAccessorImpl.java:57)
	at sun.reflect.DelegatingMethodAccessorImpl.invoke(DelegatingMethodAccessorImpl.java:43)
	at java.lang.reflect.Method.invoke(Method.java:606)
	at org.junit.runners.model.FrameworkMethod$1.runReflectiveCall(FrameworkMethod.java:50)
	at org.junit.internal.runners.model.ReflectiveCallable.run(ReflectiveCallable.java:12)
	at org.junit.runners.model.FrameworkMethod.invokeExplosively(FrameworkMethod.java:47)
	at org.junit.internal.runners.statements.InvokeMethod.evaluate(InvokeMethod.java:17)
	at org.junit.internal.runners.statements.RunBefores.evaluate(RunBefores.java:26)
	at org.junit.runners.ParentRunner.runLeaf(ParentRunner.java:325)
	at org.junit.runners.BlockJUnit4ClassRunner.runChild(BlockJUnit4ClassRunner.java:78)
	at org.junit.runners.BlockJUnit4ClassRunner.runChild(BlockJUnit4ClassRunner.java:57)
	at org.junit.runners.ParentRunner$3.run(ParentRunner.java:290)
	at org.junit.runners.ParentRunner$1.schedule(ParentRunner.java:71)
	at org.junit.runners.ParentRunner.runChildren(ParentRunner.java:288)
	at org.junit.runners.ParentRunner.access$000(ParentRunner.java:58)
	at org.junit.runners.ParentRunner$2.evaluate(ParentRunner.java:268)
	at org.junit.runners.ParentRunner.run(ParentRunner.java:363)
	at org.apache.maven.surefire.junit4.JUnit4Provider.execute(JUnit4Provider.java:283)
	at org.apache.maven.surefire.junit4.JUnit4Provider.executeWithRerun(JUnit4Provider.java:173)
	at org.apache.maven.surefire.junit4.JUnit4Provider.executeTestSet(JUnit4Provider.java:153)
	at org.apache.maven.surefire.junit4.JUnit4Provider.invoke(JUnit4Provider.java:128)
	at org.apache.maven.surefire.booter.ForkedBooter.invokeProviderInSameClassLoader(ForkedBooter.java:203)
	at org.apache.maven.surefire.booter.ForkedBooter.runSuitesInProcess(ForkedBooter.java:155)
	at org.apache.maven.surefire.booter.ForkedBooter.main(ForkedBooter.java:103)

testOptionAndRequiredOption(org.apache.commons.cli.GnuParserTest)  Time elapsed: 0.002 sec  <<< ERROR!
org.apache.commons.cli.MissingArgumentException: Missing argument for option: b
	at org.apache.commons.cli.Parser.processArgs(Parser.java:68)
	at org.apache.commons.cli.Parser.processOption(Parser.java:73)
	at org.apache.commons.cli.Parser.parse(Parser.java:40)
	at org.apache.commons.cli.Parser.parse(Parser.java:23)
	at org.apache.commons.cli.ParserTestCase.testOptionAndRequiredOption(ParserTestCase.java:691)
	at sun.reflect.NativeMethodAccessorImpl.invoke0(Native Method)
	at sun.reflect.NativeMethodAccessorImpl.invoke(NativeMethodAccessorImpl.java:57)
	at sun.reflect.DelegatingMethodAccessorImpl.invoke(DelegatingMethodAccessorImpl.java:43)
	at java.lang.reflect.Method.invoke(Method.java:606)
	at org.junit.runners.model.FrameworkMethod$1.runReflectiveCall(FrameworkMethod.java:50)
	at org.junit.internal.runners.model.ReflectiveCallable.run(ReflectiveCallable.java:12)
	at org.junit.runners.model.FrameworkMethod.invokeExplosively(FrameworkMethod.java:47)
	at org.junit.internal.runners.statements.InvokeMethod.evaluate(InvokeMethod.java:17)
	at org.junit.internal.runners.statements.RunBefores.evaluate(RunBefores.java:26)
	at org.junit.runners.ParentRunner.runLeaf(ParentRunner.java:325)
	at org.junit.runners.BlockJUnit4ClassRunner.runChild(BlockJUnit4ClassRunner.java:78)
	at org.junit.runners.BlockJUnit4ClassRunner.runChild(BlockJUnit4ClassRunner.java:57)
	at org.junit.runners.ParentRunner$3.run(ParentRunner.java:290)
	at org.junit.runners.ParentRunner$1.schedule(ParentRunner.java:71)
	at org.junit.runners.ParentRunner.runChildren(ParentRunner.java:288)
	at org.junit.runners.ParentRunner.access$000(ParentRunner.java:58)
	at org.junit.runners.ParentRunner$2.evaluate(ParentRunner.java:268)
	at org.junit.runners.ParentRunner.run(ParentRunner.java:363)
	at org.apache.maven.surefire.junit4.JUnit4Provider.execute(JUnit4Provider.java:283)
	at org.apache.maven.surefire.junit4.JUnit4Provider.executeWithRerun(JUnit4Provider.java:173)
	at org.apache.maven.surefire.junit4.JUnit4Provider.executeTestSet(JUnit4Provider.java:153)
	at org.apache.maven.surefire.junit4.JUnit4Provider.invoke(JUnit4Provider.java:128)
	at org.apache.maven.surefire.booter.ForkedBooter.invokeProviderInSameClassLoader(ForkedBooter.java:203)
	at org.apache.maven.surefire.booter.ForkedBooter.runSuitesInProcess(ForkedBooter.java:155)
	at org.apache.maven.surefire.booter.ForkedBooter.main(ForkedBooter.java:103)

testLongWithEqualDoubleDash(org.apache.commons.cli.GnuParserTest)  Time elapsed: 0.001 sec  <<< ERROR!
org.apache.commons.cli.MissingArgumentException: Missing argument for option: f
	at org.apache.commons.cli.Parser.processArgs(Parser.java:68)
	at org.apache.commons.cli.Parser.processOption(Parser.java:73)
	at org.apache.commons.cli.Parser.parse(Parser.java:40)
	at org.apache.commons.cli.Parser.parse(Parser.java:23)
	at org.apache.commons.cli.ParserTestCase.testLongWithEqualDoubleDash(ParserTestCase.java:322)
	at sun.reflect.NativeMethodAccessorImpl.invoke0(Native Method)
	at sun.reflect.NativeMethodAccessorImpl.invoke(NativeMethodAccessorImpl.java:57)
	at sun.reflect.DelegatingMethodAccessorImpl.invoke(DelegatingMethodAccessorImpl.java:43)
	at java.lang.reflect.Method.invoke(Method.java:606)
	at org.junit.runners.model.FrameworkMethod$1.runReflectiveCall(FrameworkMethod.java:50)
	at org.junit.internal.runners.model.ReflectiveCallable.run(ReflectiveCallable.java:12)
	at org.junit.runners.model.FrameworkMethod.invokeExplosively(FrameworkMethod.java:47)
	at org.junit.internal.runners.statements.InvokeMethod.evaluate(InvokeMethod.java:17)
	at org.junit.internal.runners.statements.RunBefores.evaluate(RunBefores.java:26)
	at org.junit.runners.ParentRunner.runLeaf(ParentRunner.java:325)
	at org.junit.runners.BlockJUnit4ClassRunner.runChild(BlockJUnit4ClassRunner.java:78)
	at org.junit.runners.BlockJUnit4ClassRunner.runChild(BlockJUnit4ClassRunner.java:57)
	at org.junit.runners.ParentRunner$3.run(ParentRunner.java:290)
	at org.junit.runners.ParentRunner$1.schedule(ParentRunner.java:71)
	at org.junit.runners.ParentRunner.runChildren(ParentRunner.java:288)
	at org.junit.runners.ParentRunner.access$000(ParentRunner.java:58)
	at org.junit.runners.ParentRunner$2.evaluate(ParentRunner.java:268)
	at org.junit.runners.ParentRunner.run(ParentRunner.java:363)
	at org.apache.maven.surefire.junit4.JUnit4Provider.execute(JUnit4Provider.java:283)
	at org.apache.maven.surefire.junit4.JUnit4Provider.executeWithRerun(JUnit4Provider.java:173)
	at org.apache.maven.surefire.junit4.JUnit4Provider.executeTestSet(JUnit4Provider.java:153)
	at org.apache.maven.surefire.junit4.JUnit4Provider.invoke(JUnit4Provider.java:128)
	at org.apache.maven.surefire.booter.ForkedBooter.invokeProviderInSameClassLoader(ForkedBooter.java:203)
	at org.apache.maven.surefire.booter.ForkedBooter.runSuitesInProcess(ForkedBooter.java:155)
	at org.apache.maven.surefire.booter.ForkedBooter.main(ForkedBooter.java:103)

testLongWithEqualSingleDash(org.apache.commons.cli.GnuParserTest)  Time elapsed: 0.002 sec  <<< ERROR!
org.apache.commons.cli.MissingArgumentException: Missing argument for option: f
	at org.apache.commons.cli.Parser.processArgs(Parser.java:68)
	at org.apache.commons.cli.Parser.processOption(Parser.java:73)
	at org.apache.commons.cli.Parser.parse(Parser.java:40)
	at org.apache.commons.cli.Parser.parse(Parser.java:23)
	at org.apache.commons.cli.ParserTestCase.testLongWithEqualSingleDash(ParserTestCase.java:335)
	at sun.reflect.NativeMethodAccessorImpl.invoke0(Native Method)
	at sun.reflect.NativeMethodAccessorImpl.invoke(NativeMethodAccessorImpl.java:57)
	at sun.reflect.DelegatingMethodAccessorImpl.invoke(DelegatingMethodAccessorImpl.java:43)
	at java.lang.reflect.Method.invoke(Method.java:606)
	at org.junit.runners.model.FrameworkMethod$1.runReflectiveCall(FrameworkMethod.java:50)
	at org.junit.internal.runners.model.ReflectiveCallable.run(ReflectiveCallable.java:12)
	at org.junit.runners.model.FrameworkMethod.invokeExplosively(FrameworkMethod.java:47)
	at org.junit.internal.runners.statements.InvokeMethod.evaluate(InvokeMethod.java:17)
	at org.junit.internal.runners.statements.RunBefores.evaluate(RunBefores.java:26)
	at org.junit.runners.ParentRunner.runLeaf(ParentRunner.java:325)
	at org.junit.runners.BlockJUnit4ClassRunner.runChild(BlockJUnit4ClassRunner.java:78)
	at org.junit.runners.BlockJUnit4ClassRunner.runChild(BlockJUnit4ClassRunner.java:57)
	at org.junit.runners.ParentRunner$3.run(ParentRunner.java:290)
	at org.junit.runners.ParentRunner$1.schedule(ParentRunner.java:71)
	at org.junit.runners.ParentRunner.runChildren(ParentRunner.java:288)
	at org.junit.runners.ParentRunner.access$000(ParentRunner.java:58)
	at org.junit.runners.ParentRunner$2.evaluate(ParentRunner.java:268)
	at org.junit.runners.ParentRunner.run(ParentRunner.java:363)
	at org.apache.maven.surefire.junit4.JUnit4Provider.execute(JUnit4Provider.java:283)
	at org.apache.maven.surefire.junit4.JUnit4Provider.executeWithRerun(JUnit4Provider.java:173)
	at org.apache.maven.surefire.junit4.JUnit4Provider.executeTestSet(JUnit4Provider.java:153)
	at org.apache.maven.surefire.junit4.JUnit4Provider.invoke(JUnit4Provider.java:128)
	at org.apache.maven.surefire.booter.ForkedBooter.invokeProviderInSameClassLoader(ForkedBooter.java:203)
	at org.apache.maven.surefire.booter.ForkedBooter.runSuitesInProcess(ForkedBooter.java:155)
	at org.apache.maven.surefire.booter.ForkedBooter.main(ForkedBooter.java:103)

testMultiple(org.apache.commons.cli.GnuParserTest)  Time elapsed: 0.002 sec  <<< ERROR!
org.apache.commons.cli.MissingArgumentException: Missing argument for option: b
	at org.apache.commons.cli.Parser.processArgs(Parser.java:68)
	at org.apache.commons.cli.Parser.processOption(Parser.java:73)
	at org.apache.commons.cli.Parser.parse(Parser.java:40)
	at org.apache.commons.cli.Parser.parse(Parser.java:23)
	at org.apache.commons.cli.ParserTestCase.testMultiple(ParserTestCase.java:93)
	at sun.reflect.NativeMethodAccessorImpl.invoke0(Native Method)
	at sun.reflect.NativeMethodAccessorImpl.invoke(NativeMethodAccessorImpl.java:57)
	at sun.reflect.DelegatingMethodAccessorImpl.invoke(DelegatingMethodAccessorImpl.java:43)
	at java.lang.reflect.Method.invoke(Method.java:606)
	at org.junit.runners.model.FrameworkMethod$1.runReflectiveCall(FrameworkMethod.java:50)
	at org.junit.internal.runners.model.ReflectiveCallable.run(ReflectiveCallable.java:12)
	at org.junit.runners.model.FrameworkMethod.invokeExplosively(FrameworkMethod.java:47)
	at org.junit.internal.runners.statements.InvokeMethod.evaluate(InvokeMethod.java:17)
	at org.junit.internal.runners.statements.RunBefores.evaluate(RunBefores.java:26)
	at org.junit.runners.ParentRunner.runLeaf(ParentRunner.java:325)
	at org.junit.runners.BlockJUnit4ClassRunner.runChild(BlockJUnit4ClassRunner.java:78)
	at org.junit.runners.BlockJUnit4ClassRunner.runChild(BlockJUnit4ClassRunner.java:57)
	at org.junit.runners.ParentRunner$3.run(ParentRunner.java:290)
	at org.junit.runners.ParentRunner$1.schedule(ParentRunner.java:71)
	at org.junit.runners.ParentRunner.runChildren(ParentRunner.java:288)
	at org.junit.runners.ParentRunner.access$000(ParentRunner.java:58)
	at org.junit.runners.ParentRunner$2.evaluate(ParentRunner.java:268)
	at org.junit.runners.ParentRunner.run(ParentRunner.java:363)
	at org.apache.maven.surefire.junit4.JUnit4Provider.execute(JUnit4Provider.java:283)
	at org.apache.maven.surefire.junit4.JUnit4Provider.executeWithRerun(JUnit4Provider.java:173)
	at org.apache.maven.surefire.junit4.JUnit4Provider.executeTestSet(JUnit4Provider.java:153)
	at org.apache.maven.surefire.junit4.JUnit4Provider.invoke(JUnit4Provider.java:128)
	at org.apache.maven.surefire.booter.ForkedBooter.invokeProviderInSameClassLoader(ForkedBooter.java:203)
	at org.apache.maven.surefire.booter.ForkedBooter.runSuitesInProcess(ForkedBooter.java:155)
	at org.apache.maven.surefire.booter.ForkedBooter.main(ForkedBooter.java:103)

testArgumentStartingWithHyphen(org.apache.commons.cli.GnuParserTest)  Time elapsed: 0.002 sec  <<< ERROR!
org.apache.commons.cli.MissingArgumentException: Missing argument for option: b
	at org.apache.commons.cli.Parser.processArgs(Parser.java:68)
	at org.apache.commons.cli.Parser.processOption(Parser.java:73)
	at org.apache.commons.cli.Parser.parse(Parser.java:40)
	at org.apache.commons.cli.Parser.parse(Parser.java:23)
	at org.apache.commons.cli.ParserTestCase.testArgumentStartingWithHyphen(ParserTestCase.java:284)
	at sun.reflect.NativeMethodAccessorImpl.invoke0(Native Method)
	at sun.reflect.NativeMethodAccessorImpl.invoke(NativeMethodAccessorImpl.java:57)
	at sun.reflect.DelegatingMethodAccessorImpl.invoke(DelegatingMethodAccessorImpl.java:43)
	at java.lang.reflect.Method.invoke(Method.java:606)
	at org.junit.runners.model.FrameworkMethod$1.runReflectiveCall(FrameworkMethod.java:50)
	at org.junit.internal.runners.model.ReflectiveCallable.run(ReflectiveCallable.java:12)
	at org.junit.runners.model.FrameworkMethod.invokeExplosively(FrameworkMethod.java:47)
	at org.junit.internal.runners.statements.InvokeMethod.evaluate(InvokeMethod.java:17)
	at org.junit.internal.runners.statements.RunBefores.evaluate(RunBefores.java:26)
	at org.junit.runners.ParentRunner.runLeaf(ParentRunner.java:325)
	at org.junit.runners.BlockJUnit4ClassRunner.runChild(BlockJUnit4ClassRunner.java:78)
	at org.junit.runners.BlockJUnit4ClassRunner.runChild(BlockJUnit4ClassRunner.java:57)
	at org.junit.runners.ParentRunner$3.run(ParentRunner.java:290)
	at org.junit.runners.ParentRunner$1.schedule(ParentRunner.java:71)
	at org.junit.runners.ParentRunner.runChildren(ParentRunner.java:288)
	at org.junit.runners.ParentRunner.access$000(ParentRunner.java:58)
	at org.junit.runners.ParentRunner$2.evaluate(ParentRunner.java:268)
	at org.junit.runners.ParentRunner.run(ParentRunner.java:363)
	at org.apache.maven.surefire.junit4.JUnit4Provider.execute(JUnit4Provider.java:283)
	at org.apache.maven.surefire.junit4.JUnit4Provider.executeWithRerun(JUnit4Provider.java:173)
	at org.apache.maven.surefire.junit4.JUnit4Provider.executeTestSet(JUnit4Provider.java:153)
	at org.apache.maven.surefire.junit4.JUnit4Provider.invoke(JUnit4Provider.java:128)
	at org.apache.maven.surefire.booter.ForkedBooter.invokeProviderInSameClassLoader(ForkedBooter.java:203)
	at org.apache.maven.surefire.booter.ForkedBooter.runSuitesInProcess(ForkedBooter.java:155)
	at org.apache.maven.surefire.booter.ForkedBooter.main(ForkedBooter.java:103)

testPropertiesOption1(org.apache.commons.cli.GnuParserTest)  Time elapsed: 0.002 sec  <<< ERROR!
org.apache.commons.cli.MissingArgumentException: Missing argument for option: J
	at org.apache.commons.cli.Parser.processArgs(Parser.java:68)
	at org.apache.commons.cli.Parser.processOption(Parser.java:73)
	at org.apache.commons.cli.Parser.parse(Parser.java:40)
	at org.apache.commons.cli.Parser.parse(Parser.java:23)
	at org.apache.commons.cli.ParserTestCase.testPropertiesOption1(ParserTestCase.java:453)
	at sun.reflect.NativeMethodAccessorImpl.invoke0(Native Method)
	at sun.reflect.NativeMethodAccessorImpl.invoke(NativeMethodAccessorImpl.java:57)
	at sun.reflect.DelegatingMethodAccessorImpl.invoke(DelegatingMethodAccessorImpl.java:43)
	at java.lang.reflect.Method.invoke(Method.java:606)
	at org.junit.runners.model.FrameworkMethod$1.runReflectiveCall(FrameworkMethod.java:50)
	at org.junit.internal.runners.model.ReflectiveCallable.run(ReflectiveCallable.java:12)
	at org.junit.runners.model.FrameworkMethod.invokeExplosively(FrameworkMethod.java:47)
	at org.junit.internal.runners.statements.InvokeMethod.evaluate(InvokeMethod.java:17)
	at org.junit.internal.runners.statements.RunBefores.evaluate(RunBefores.java:26)
	at org.junit.runners.ParentRunner.runLeaf(ParentRunner.java:325)
	at org.junit.runners.BlockJUnit4ClassRunner.runChild(BlockJUnit4ClassRunner.java:78)
	at org.junit.runners.BlockJUnit4ClassRunner.runChild(BlockJUnit4ClassRunner.java:57)
	at org.junit.runners.ParentRunner$3.run(ParentRunner.java:290)
	at org.junit.runners.ParentRunner$1.schedule(ParentRunner.java:71)
	at org.junit.runners.ParentRunner.runChildren(ParentRunner.java:288)
	at org.junit.runners.ParentRunner.access$000(ParentRunner.java:58)
	at org.junit.runners.ParentRunner$2.evaluate(ParentRunner.java:268)
	at org.junit.runners.ParentRunner.run(ParentRunner.java:363)
	at org.apache.maven.surefire.junit4.JUnit4Provider.execute(JUnit4Provider.java:283)
	at org.apache.maven.surefire.junit4.JUnit4Provider.executeWithRerun(JUnit4Provider.java:173)
	at org.apache.maven.surefire.junit4.JUnit4Provider.executeTestSet(JUnit4Provider.java:153)
	at org.apache.maven.surefire.junit4.JUnit4Provider.invoke(JUnit4Provider.java:128)
	at org.apache.maven.surefire.booter.ForkedBooter.invokeProviderInSameClassLoader(ForkedBooter.java:203)
	at org.apache.maven.surefire.booter.ForkedBooter.runSuitesInProcess(ForkedBooter.java:155)
	at org.apache.maven.surefire.booter.ForkedBooter.main(ForkedBooter.java:103)

testPropertiesOption2(org.apache.commons.cli.GnuParserTest)  Time elapsed: 0.002 sec  <<< ERROR!
org.apache.commons.cli.MissingArgumentException: Missing argument for option: D
	at org.apache.commons.cli.Parser.processArgs(Parser.java:68)
	at org.apache.commons.cli.Parser.processOption(Parser.java:73)
	at org.apache.commons.cli.Parser.parse(Parser.java:40)
	at org.apache.commons.cli.Parser.parse(Parser.java:23)
	at org.apache.commons.cli.ParserTestCase.testPropertiesOption2(ParserTestCase.java:476)
	at sun.reflect.NativeMethodAccessorImpl.invoke0(Native Method)
	at sun.reflect.NativeMethodAccessorImpl.invoke(NativeMethodAccessorImpl.java:57)
	at sun.reflect.DelegatingMethodAccessorImpl.invoke(DelegatingMethodAccessorImpl.java:43)
	at java.lang.reflect.Method.invoke(Method.java:606)
	at org.junit.runners.model.FrameworkMethod$1.runReflectiveCall(FrameworkMethod.java:50)
	at org.junit.internal.runners.model.ReflectiveCallable.run(ReflectiveCallable.java:12)
	at org.junit.runners.model.FrameworkMethod.invokeExplosively(FrameworkMethod.java:47)
	at org.junit.internal.runners.statements.InvokeMethod.evaluate(InvokeMethod.java:17)
	at org.junit.internal.runners.statements.RunBefores.evaluate(RunBefores.java:26)
	at org.junit.runners.ParentRunner.runLeaf(ParentRunner.java:325)
	at org.junit.runners.BlockJUnit4ClassRunner.runChild(BlockJUnit4ClassRunner.java:78)
	at org.junit.runners.BlockJUnit4ClassRunner.runChild(BlockJUnit4ClassRunner.java:57)
	at org.junit.runners.ParentRunner$3.run(ParentRunner.java:290)
	at org.junit.runners.ParentRunner$1.schedule(ParentRunner.java:71)
	at org.junit.runners.ParentRunner.runChildren(ParentRunner.java:288)
	at org.junit.runners.ParentRunner.access$000(ParentRunner.java:58)
	at org.junit.runners.ParentRunner$2.evaluate(ParentRunner.java:268)
	at org.junit.runners.ParentRunner.run(ParentRunner.java:363)
	at org.apache.maven.surefire.junit4.JUnit4Provider.execute(JUnit4Provider.java:283)
	at org.apache.maven.surefire.junit4.JUnit4Provider.executeWithRerun(JUnit4Provider.java:173)
	at org.apache.maven.surefire.junit4.JUnit4Provider.executeTestSet(JUnit4Provider.java:153)
	at org.apache.maven.surefire.junit4.JUnit4Provider.invoke(JUnit4Provider.java:128)
	at org.apache.maven.surefire.booter.ForkedBooter.invokeProviderInSameClassLoader(ForkedBooter.java:203)
	at org.apache.maven.surefire.booter.ForkedBooter.runSuitesInProcess(ForkedBooter.java:155)
	at org.apache.maven.surefire.booter.ForkedBooter.main(ForkedBooter.java:103)

testStopAtExpectedArg(org.apache.commons.cli.GnuParserTest)  Time elapsed: 0.003 sec  <<< ERROR!
org.apache.commons.cli.MissingArgumentException: Missing argument for option: b
	at org.apache.commons.cli.Parser.processArgs(Parser.java:68)
	at org.apache.commons.cli.Parser.processOption(Parser.java:73)
	at org.apache.commons.cli.Parser.parse(Parser.java:40)
	at org.apache.commons.cli.Parser.parse(Parser.java:25)
	at org.apache.commons.cli.ParserTestCase.testStopAtExpectedArg(ParserTestCase.java:226)
	at sun.reflect.NativeMethodAccessorImpl.invoke0(Native Method)
	at sun.reflect.NativeMethodAccessorImpl.invoke(NativeMethodAccessorImpl.java:57)
	at sun.reflect.DelegatingMethodAccessorImpl.invoke(DelegatingMethodAccessorImpl.java:43)
	at java.lang.reflect.Method.invoke(Method.java:606)
	at org.junit.runners.model.FrameworkMethod$1.runReflectiveCall(FrameworkMethod.java:50)
	at org.junit.internal.runners.model.ReflectiveCallable.run(ReflectiveCallable.java:12)
	at org.junit.runners.model.FrameworkMethod.invokeExplosively(FrameworkMethod.java:47)
	at org.junit.internal.runners.statements.InvokeMethod.evaluate(InvokeMethod.java:17)
	at org.junit.internal.runners.statements.RunBefores.evaluate(RunBefores.java:26)
	at org.junit.runners.ParentRunner.runLeaf(ParentRunner.java:325)
	at org.junit.runners.BlockJUnit4ClassRunner.runChild(BlockJUnit4ClassRunner.java:78)
	at org.junit.runners.BlockJUnit4ClassRunner.runChild(BlockJUnit4ClassRunner.java:57)
	at org.junit.runners.ParentRunner$3.run(ParentRunner.java:290)
	at org.junit.runners.ParentRunner$1.schedule(ParentRunner.java:71)
	at org.junit.runners.ParentRunner.runChildren(ParentRunner.java:288)
	at org.junit.runners.ParentRunner.access$000(ParentRunner.java:58)
	at org.junit.runners.ParentRunner$2.evaluate(ParentRunner.java:268)
	at org.junit.runners.ParentRunner.run(ParentRunner.java:363)
	at org.apache.maven.surefire.junit4.JUnit4Provider.execute(JUnit4Provider.java:283)
	at org.apache.maven.surefire.junit4.JUnit4Provider.executeWithRerun(JUnit4Provider.java:173)
	at org.apache.maven.surefire.junit4.JUnit4Provider.executeTestSet(JUnit4Provider.java:153)
	at org.apache.maven.surefire.junit4.JUnit4Provider.invoke(JUnit4Provider.java:128)
	at org.apache.maven.surefire.booter.ForkedBooter.invokeProviderInSameClassLoader(ForkedBooter.java:203)
	at org.apache.maven.surefire.booter.ForkedBooter.runSuitesInProcess(ForkedBooter.java:155)
	at org.apache.maven.surefire.booter.ForkedBooter.main(ForkedBooter.java:103)

Running org.apache.commons.cli.PatternOptionBuilderTest
Tests run: 9, Failures: 0, Errors: 6, Skipped: 0, Time elapsed: 0.001 sec <<< FAILURE! - in org.apache.commons.cli.PatternOptionBuilderTest
testSimplePattern(org.apache.commons.cli.PatternOptionBuilderTest)  Time elapsed: 0 sec  <<< ERROR!
org.apache.commons.cli.MissingArgumentException: Missing argument for option: a
	at org.apache.commons.cli.Parser.processArgs(Parser.java:68)
	at org.apache.commons.cli.Parser.processOption(Parser.java:73)
	at org.apache.commons.cli.Parser.parse(Parser.java:40)
	at org.apache.commons.cli.Parser.parse(Parser.java:23)
	at org.apache.commons.cli.PatternOptionBuilderTest.testSimplePattern(PatternOptionBuilderTest.java:47)

testExistingFilePattern(org.apache.commons.cli.PatternOptionBuilderTest)  Time elapsed: 0 sec  <<< ERROR!
org.apache.commons.cli.MissingArgumentException: Missing argument for option: f
	at org.apache.commons.cli.Parser.processArgs(Parser.java:68)
	at org.apache.commons.cli.Parser.processOption(Parser.java:73)
	at org.apache.commons.cli.Parser.parse(Parser.java:40)
	at org.apache.commons.cli.Parser.parse(Parser.java:23)
	at org.apache.commons.cli.PatternOptionBuilderTest.testExistingFilePattern(PatternOptionBuilderTest.java:164)

testURLPattern(org.apache.commons.cli.PatternOptionBuilderTest)  Time elapsed: 0 sec  <<< ERROR!
org.apache.commons.cli.MissingArgumentException: Missing argument for option: u
	at org.apache.commons.cli.Parser.processArgs(Parser.java:68)
	at org.apache.commons.cli.Parser.processOption(Parser.java:73)
	at org.apache.commons.cli.Parser.parse(Parser.java:40)
	at org.apache.commons.cli.Parser.parse(Parser.java:23)
	at org.apache.commons.cli.PatternOptionBuilderTest.testURLPattern(PatternOptionBuilderTest.java:153)

testClassPattern(org.apache.commons.cli.PatternOptionBuilderTest)  Time elapsed: 0.001 sec  <<< ERROR!
org.apache.commons.cli.MissingArgumentException: Missing argument for option: c
	at org.apache.commons.cli.Parser.processArgs(Parser.java:68)
	at org.apache.commons.cli.Parser.processOption(Parser.java:73)
	at org.apache.commons.cli.Parser.parse(Parser.java:40)
	at org.apache.commons.cli.Parser.parse(Parser.java:23)
	at org.apache.commons.cli.PatternOptionBuilderTest.testClassPattern(PatternOptionBuilderTest.java:130)

testNumberPattern(org.apache.commons.cli.PatternOptionBuilderTest)  Time elapsed: 0 sec  <<< ERROR!
org.apache.commons.cli.MissingArgumentException: Missing argument for option: n
	at org.apache.commons.cli.Parser.processArgs(Parser.java:68)
	at org.apache.commons.cli.Parser.processOption(Parser.java:73)
	at org.apache.commons.cli.Parser.parse(Parser.java:40)
	at org.apache.commons.cli.Parser.parse(Parser.java:23)
	at org.apache.commons.cli.PatternOptionBuilderTest.testNumberPattern(PatternOptionBuilderTest.java:114)

testObjectPattern(org.apache.commons.cli.PatternOptionBuilderTest)  Time elapsed: 0 sec  <<< ERROR!
org.apache.commons.cli.MissingArgumentException: Missing argument for option: o
	at org.apache.commons.cli.Parser.processArgs(Parser.java:68)
	at org.apache.commons.cli.Parser.processOption(Parser.java:73)
	at org.apache.commons.cli.Parser.parse(Parser.java:40)
	at org.apache.commons.cli.Parser.parse(Parser.java:23)
	at org.apache.commons.cli.PatternOptionBuilderTest.testObjectPattern(PatternOptionBuilderTest.java:141)

Running org.apache.commons.cli.ApplicationTest
Tests run: 5, Failures: 0, Errors: 4, Skipped: 0, Time elapsed: 0.013 sec <<< FAILURE! - in org.apache.commons.cli.ApplicationTest
testAnt(org.apache.commons.cli.ApplicationTest)  Time elapsed: 0 sec  <<< ERROR!
org.apache.commons.cli.MissingArgumentException: Missing argument for option: buildfile
	at org.apache.commons.cli.Parser.processArgs(Parser.java:68)
	at org.apache.commons.cli.Parser.processOption(Parser.java:73)
	at org.apache.commons.cli.Parser.parse(Parser.java:40)
	at org.apache.commons.cli.Parser.parse(Parser.java:23)
	at org.apache.commons.cli.ApplicationTest.testAnt(ApplicationTest.java:97)

testNLT(org.apache.commons.cli.ApplicationTest)  Time elapsed: 0.001 sec  <<< ERROR!
org.apache.commons.cli.MissingArgumentException: Missing argument for option: l
	at org.apache.commons.cli.Parser.processArgs(Parser.java:68)
	at org.apache.commons.cli.Parser.processOption(Parser.java:73)
	at org.apache.commons.cli.Parser.parse(Parser.java:40)
	at org.apache.commons.cli.Parser.parse(Parser.java:23)
	at org.apache.commons.cli.ApplicationTest.testNLT(ApplicationTest.java:332)

testLs(org.apache.commons.cli.ApplicationTest)  Time elapsed: 0.001 sec  <<< ERROR!
org.apache.commons.cli.MissingArgumentException: Missing argument for option: block-size
	at org.apache.commons.cli.Parser.processArgs(Parser.java:68)
	at org.apache.commons.cli.Parser.processOption(Parser.java:73)
	at org.apache.commons.cli.Parser.parse(Parser.java:40)
	at org.apache.commons.cli.Parser.parse(Parser.java:23)
	at org.apache.commons.cli.ApplicationTest.testLs(ApplicationTest.java:63)

testGroovy(org.apache.commons.cli.ApplicationTest)  Time elapsed: 0.001 sec  <<< ERROR!
org.apache.commons.cli.MissingArgumentException: Missing argument for option: e
	at org.apache.commons.cli.Parser.processArgs(Parser.java:68)
	at org.apache.commons.cli.Parser.processOption(Parser.java:73)
	at org.apache.commons.cli.Parser.parse(Parser.java:40)
	at org.apache.commons.cli.Parser.parse(Parser.java:25)
	at org.apache.commons.cli.ApplicationTest.testGroovy(ApplicationTest.java:175)

Running org.apache.commons.cli.OptionTest
Tests run: 9, Failures: 0, Errors: 0, Skipped: 0, Time elapsed: 0.012 sec - in org.apache.commons.cli.OptionTest
Running org.apache.commons.cli.bug.BugCLI252Test
Tests run: 60, Failures: 0, Errors: 0, Skipped: 0, Time elapsed: 0.036 sec - in org.apache.commons.cli.bug.BugCLI252Test
Running org.apache.commons.cli.bug.BugCLI162Test
Tests run: 4, Failures: 0, Errors: 0, Skipped: 0, Time elapsed: 0 sec - in org.apache.commons.cli.bug.BugCLI162Test
Running org.apache.commons.cli.bug.BugCLI71Test
Tests run: 4, Failures: 0, Errors: 3, Skipped: 0, Time elapsed: 0.002 sec <<< FAILURE! - in org.apache.commons.cli.bug.BugCLI71Test
testBasic(org.apache.commons.cli.bug.BugCLI71Test)  Time elapsed: 0.001 sec  <<< ERROR!
org.apache.commons.cli.MissingArgumentException: Missing argument for option: a
	at org.apache.commons.cli.Parser.processArgs(Parser.java:68)
	at org.apache.commons.cli.Parser.processOption(Parser.java:73)
	at org.apache.commons.cli.Parser.parse(Parser.java:40)
	at org.apache.commons.cli.Parser.parse(Parser.java:23)
	at org.apache.commons.cli.bug.BugCLI71Test.testBasic(BugCLI71Test.java:56)

testMistakenArgument(org.apache.commons.cli.bug.BugCLI71Test)  Time elapsed: 0.001 sec  <<< ERROR!
org.apache.commons.cli.MissingArgumentException: Missing argument for option: a
	at org.apache.commons.cli.Parser.processArgs(Parser.java:68)
	at org.apache.commons.cli.Parser.processOption(Parser.java:73)
	at org.apache.commons.cli.Parser.parse(Parser.java:40)
	at org.apache.commons.cli.Parser.parse(Parser.java:23)
	at org.apache.commons.cli.bug.BugCLI71Test.testMistakenArgument(BugCLI71Test.java:64)

testGetsDefaultIfOptional(org.apache.commons.cli.bug.BugCLI71Test)  Time elapsed: 0 sec  <<< ERROR!
org.apache.commons.cli.MissingArgumentException: Missing argument for option: k
	at org.apache.commons.cli.Parser.processArgs(Parser.java:68)
	at org.apache.commons.cli.Parser.processOption(Parser.java:73)
	at org.apache.commons.cli.Parser.parse(Parser.java:40)
	at org.apache.commons.cli.Parser.parse(Parser.java:23)
	at org.apache.commons.cli.bug.BugCLI71Test.testGetsDefaultIfOptional(BugCLI71Test.java:86)

Running org.apache.commons.cli.bug.BugCLI18Test
Tests run: 1, Failures: 0, Errors: 0, Skipped: 0, Time elapsed: 0 sec - in org.apache.commons.cli.bug.BugCLI18Test
Running org.apache.commons.cli.bug.BugCLI133Test
Tests run: 1, Failures: 0, Errors: 0, Skipped: 0, Time elapsed: 0 sec - in org.apache.commons.cli.bug.BugCLI133Test
Running org.apache.commons.cli.bug.BugCLI13Test
Tests run: 1, Failures: 0, Errors: 1, Skipped: 0, Time elapsed: 0 sec <<< FAILURE! - in org.apache.commons.cli.bug.BugCLI13Test
testCLI13(org.apache.commons.cli.bug.BugCLI13Test)  Time elapsed: 0 sec  <<< ERROR!
org.apache.commons.cli.MissingArgumentException: Missing argument for option: d
	at org.apache.commons.cli.Parser.processArgs(Parser.java:68)
	at org.apache.commons.cli.Parser.processOption(Parser.java:73)
	at org.apache.commons.cli.Parser.parse(Parser.java:40)
	at org.apache.commons.cli.Parser.parse(Parser.java:23)
	at org.apache.commons.cli.bug.BugCLI13Test.testCLI13(BugCLI13Test.java:47)

Running org.apache.commons.cli.bug.BugCLI148Test
Tests run: 2, Failures: 0, Errors: 2, Skipped: 0, Time elapsed: 0.003 sec <<< FAILURE! - in org.apache.commons.cli.bug.BugCLI148Test
testWorkaround1(org.apache.commons.cli.bug.BugCLI148Test)  Time elapsed: 0 sec  <<< ERROR!
org.apache.commons.cli.MissingArgumentException: Missing argument for option: t
	at org.apache.commons.cli.Parser.processArgs(Parser.java:68)
	at org.apache.commons.cli.Parser.processOption(Parser.java:73)
	at org.apache.commons.cli.Parser.parse(Parser.java:40)
	at org.apache.commons.cli.Parser.parse(Parser.java:23)
	at org.apache.commons.cli.bug.BugCLI148Test.testWorkaround1(BugCLI148Test.java:52)

testWorkaround2(org.apache.commons.cli.bug.BugCLI148Test)  Time elapsed: 0 sec  <<< ERROR!
org.apache.commons.cli.MissingArgumentException: Missing argument for option: t
	at org.apache.commons.cli.Parser.processArgs(Parser.java:68)
	at org.apache.commons.cli.Parser.processOption(Parser.java:73)
	at org.apache.commons.cli.Parser.parse(Parser.java:40)
	at org.apache.commons.cli.Parser.parse(Parser.java:23)
	at org.apache.commons.cli.bug.BugCLI148Test.testWorkaround2(BugCLI148Test.java:62)

Running org.apache.commons.cli.bug.BugsTest
Tests run: 12, Failures: 0, Errors: 5, Skipped: 0, Time elapsed: 0.007 sec <<< FAILURE! - in org.apache.commons.cli.bug.BugsTest
test11456(org.apache.commons.cli.bug.BugsTest)  Time elapsed: 0.001 sec  <<< ERROR!
org.apache.commons.cli.MissingArgumentException: Missing argument for option: a
	at org.apache.commons.cli.Parser.processArgs(Parser.java:68)
	at org.apache.commons.cli.Parser.processOption(Parser.java:73)
	at org.apache.commons.cli.Parser.parse(Parser.java:40)
	at org.apache.commons.cli.Parser.parse(Parser.java:23)
	at org.apache.commons.cli.bug.BugsTest.test11456(BugsTest.java:131)

test11458(org.apache.commons.cli.bug.BugsTest)  Time elapsed: 0 sec  <<< ERROR!
org.apache.commons.cli.MissingArgumentException: Missing argument for option: D
	at org.apache.commons.cli.Parser.processArgs(Parser.java:68)
	at org.apache.commons.cli.Parser.processOption(Parser.java:73)
	at org.apache.commons.cli.Parser.parse(Parser.java:40)
	at org.apache.commons.cli.Parser.parse(Parser.java:23)
	at org.apache.commons.cli.bug.BugsTest.test11458(BugsTest.java:70)

test11680(org.apache.commons.cli.bug.BugsTest)  Time elapsed: 0.001 sec  <<< ERROR!
org.apache.commons.cli.MissingArgumentException: Missing argument for option: f
	at org.apache.commons.cli.Parser.processArgs(Parser.java:68)
	at org.apache.commons.cli.Parser.processOption(Parser.java:73)
	at org.apache.commons.cli.Parser.parse(Parser.java:40)
	at org.apache.commons.cli.Parser.parse(Parser.java:23)
	at org.apache.commons.cli.bug.BugsTest.test11680(BugsTest.java:114)

test15046(org.apache.commons.cli.bug.BugsTest)  Time elapsed: 0 sec  <<< ERROR!
org.apache.commons.cli.MissingArgumentException: Missing argument for option: z
	at org.apache.commons.cli.Parser.processArgs(Parser.java:68)
	at org.apache.commons.cli.Parser.processOption(Parser.java:73)
	at org.apache.commons.cli.Parser.parse(Parser.java:40)
	at org.apache.commons.cli.Parser.parse(Parser.java:23)
	at org.apache.commons.cli.bug.BugsTest.test15046(BugsTest.java:337)

test15648(org.apache.commons.cli.bug.BugsTest)  Time elapsed: 0.001 sec  <<< ERROR!
org.apache.commons.cli.MissingArgumentException: Missing argument for option: m
	at org.apache.commons.cli.Parser.processArgs(Parser.java:68)
	at org.apache.commons.cli.Parser.processOption(Parser.java:73)
	at org.apache.commons.cli.Parser.parse(Parser.java:40)
	at org.apache.commons.cli.Parser.parse(Parser.java:23)
	at org.apache.commons.cli.bug.BugsTest.test15648(BugsTest.java:354)

Running org.apache.commons.cli.HelpFormatterTest
Tests run: 25, Failures: 0, Errors: 0, Skipped: 0, Time elapsed: 0.012 sec - in org.apache.commons.cli.HelpFormatterTest
Running org.apache.commons.cli.OptionBuilderTest
Tests run: 9, Failures: 0, Errors: 0, Skipped: 0, Time elapsed: 0.002 sec - in org.apache.commons.cli.OptionBuilderTest
Running org.apache.commons.cli.PosixParserTest
Tests run: 58, Failures: 0, Errors: 17, Skipped: 0, Time elapsed: 0.031 sec <<< FAILURE! - in org.apache.commons.cli.PosixParserTest
testSimpleLong(org.apache.commons.cli.PosixParserTest)  Time elapsed: 0 sec  <<< ERROR!
org.apache.commons.cli.MissingArgumentException: Missing argument for option: b
	at org.apache.commons.cli.Parser.processArgs(Parser.java:68)
	at org.apache.commons.cli.Parser.processOption(Parser.java:73)
	at org.apache.commons.cli.Parser.parse(Parser.java:40)
	at org.apache.commons.cli.Parser.parse(Parser.java:23)
	at org.apache.commons.cli.ParserTestCase.testSimpleLong(ParserTestCase.java:73)
	at sun.reflect.NativeMethodAccessorImpl.invoke0(Native Method)
	at sun.reflect.NativeMethodAccessorImpl.invoke(NativeMethodAccessorImpl.java:57)
	at sun.reflect.DelegatingMethodAccessorImpl.invoke(DelegatingMethodAccessorImpl.java:43)
	at java.lang.reflect.Method.invoke(Method.java:606)
	at org.junit.runners.model.FrameworkMethod$1.runReflectiveCall(FrameworkMethod.java:50)
	at org.junit.internal.runners.model.ReflectiveCallable.run(ReflectiveCallable.java:12)
	at org.junit.runners.model.FrameworkMethod.invokeExplosively(FrameworkMethod.java:47)
	at org.junit.internal.runners.statements.InvokeMethod.evaluate(InvokeMethod.java:17)
	at org.junit.internal.runners.statements.RunBefores.evaluate(RunBefores.java:26)
	at org.junit.runners.ParentRunner.runLeaf(ParentRunner.java:325)
	at org.junit.runners.BlockJUnit4ClassRunner.runChild(BlockJUnit4ClassRunner.java:78)
	at org.junit.runners.BlockJUnit4ClassRunner.runChild(BlockJUnit4ClassRunner.java:57)
	at org.junit.runners.ParentRunner$3.run(ParentRunner.java:290)
	at org.junit.runners.ParentRunner$1.schedule(ParentRunner.java:71)
	at org.junit.runners.ParentRunner.runChildren(ParentRunner.java:288)
	at org.junit.runners.ParentRunner.access$000(ParentRunner.java:58)
	at org.junit.runners.ParentRunner$2.evaluate(ParentRunner.java:268)
	at org.junit.runners.ParentRunner.run(ParentRunner.java:363)
	at org.apache.maven.surefire.junit4.JUnit4Provider.execute(JUnit4Provider.java:283)
	at org.apache.maven.surefire.junit4.JUnit4Provider.executeWithRerun(JUnit4Provider.java:173)
	at org.apache.maven.surefire.junit4.JUnit4Provider.executeTestSet(JUnit4Provider.java:153)
	at org.apache.maven.surefire.junit4.JUnit4Provider.invoke(JUnit4Provider.java:128)
	at org.apache.maven.surefire.booter.ForkedBooter.invokeProviderInSameClassLoader(ForkedBooter.java:203)
	at org.apache.maven.surefire.booter.ForkedBooter.runSuitesInProcess(ForkedBooter.java:155)
	at org.apache.maven.surefire.booter.ForkedBooter.main(ForkedBooter.java:103)

testSimpleShort(org.apache.commons.cli.PosixParserTest)  Time elapsed: 0 sec  <<< ERROR!
org.apache.commons.cli.MissingArgumentException: Missing argument for option: b
	at org.apache.commons.cli.Parser.processArgs(Parser.java:68)
	at org.apache.commons.cli.Parser.processOption(Parser.java:73)
	at org.apache.commons.cli.Parser.parse(Parser.java:40)
	at org.apache.commons.cli.Parser.parse(Parser.java:23)
	at org.apache.commons.cli.ParserTestCase.testSimpleShort(ParserTestCase.java:58)
	at sun.reflect.NativeMethodAccessorImpl.invoke0(Native Method)
	at sun.reflect.NativeMethodAccessorImpl.invoke(NativeMethodAccessorImpl.java:57)
	at sun.reflect.DelegatingMethodAccessorImpl.invoke(DelegatingMethodAccessorImpl.java:43)
	at java.lang.reflect.Method.invoke(Method.java:606)
	at org.junit.runners.model.FrameworkMethod$1.runReflectiveCall(FrameworkMethod.java:50)
	at org.junit.internal.runners.model.ReflectiveCallable.run(ReflectiveCallable.java:12)
	at org.junit.runners.model.FrameworkMethod.invokeExplosively(FrameworkMethod.java:47)
	at org.junit.internal.runners.statements.InvokeMethod.evaluate(InvokeMethod.java:17)
	at org.junit.internal.runners.statements.RunBefores.evaluate(RunBefores.java:26)
	at org.junit.runners.ParentRunner.runLeaf(ParentRunner.java:325)
	at org.junit.runners.BlockJUnit4ClassRunner.runChild(BlockJUnit4ClassRunner.java:78)
	at org.junit.runners.BlockJUnit4ClassRunner.runChild(BlockJUnit4ClassRunner.java:57)
	at org.junit.runners.ParentRunner$3.run(ParentRunner.java:290)
	at org.junit.runners.ParentRunner$1.schedule(ParentRunner.java:71)
	at org.junit.runners.ParentRunner.runChildren(ParentRunner.java:288)
	at org.junit.runners.ParentRunner.access$000(ParentRunner.java:58)
	at org.junit.runners.ParentRunner$2.evaluate(ParentRunner.java:268)
	at org.junit.runners.ParentRunner.run(ParentRunner.java:363)
	at org.apache.maven.surefire.junit4.JUnit4Provider.execute(JUnit4Provider.java:283)
	at org.apache.maven.surefire.junit4.JUnit4Provider.executeWithRerun(JUnit4Provider.java:173)
	at org.apache.maven.surefire.junit4.JUnit4Provider.executeTestSet(JUnit4Provider.java:153)
	at org.apache.maven.surefire.junit4.JUnit4Provider.invoke(JUnit4Provider.java:128)
	at org.apache.maven.surefire.booter.ForkedBooter.invokeProviderInSameClassLoader(ForkedBooter.java:203)
	at org.apache.maven.surefire.booter.ForkedBooter.runSuitesInProcess(ForkedBooter.java:155)
	at org.apache.maven.surefire.booter.ForkedBooter.main(ForkedBooter.java:103)

testStopBursting2(org.apache.commons.cli.PosixParserTest)  Time elapsed: 0.001 sec  <<< ERROR!
org.apache.commons.cli.MissingArgumentException: Missing argument for option: b
	at org.apache.commons.cli.Parser.processArgs(Parser.java:68)
	at org.apache.commons.cli.Parser.processOption(Parser.java:73)
	at org.apache.commons.cli.Parser.parse(Parser.java:40)
	at org.apache.commons.cli.Parser.parse(Parser.java:23)
	at org.apache.commons.cli.ParserTestCase.testStopBursting2(ParserTestCase.java:903)
	at sun.reflect.NativeMethodAccessorImpl.invoke0(Native Method)
	at sun.reflect.NativeMethodAccessorImpl.invoke(NativeMethodAccessorImpl.java:57)
	at sun.reflect.DelegatingMethodAccessorImpl.invoke(DelegatingMethodAccessorImpl.java:43)
	at java.lang.reflect.Method.invoke(Method.java:606)
	at org.junit.runners.model.FrameworkMethod$1.runReflectiveCall(FrameworkMethod.java:50)
	at org.junit.internal.runners.model.ReflectiveCallable.run(ReflectiveCallable.java:12)
	at org.junit.runners.model.FrameworkMethod.invokeExplosively(FrameworkMethod.java:47)
	at org.junit.internal.runners.statements.InvokeMethod.evaluate(InvokeMethod.java:17)
	at org.junit.internal.runners.statements.RunBefores.evaluate(RunBefores.java:26)
	at org.junit.runners.ParentRunner.runLeaf(ParentRunner.java:325)
	at org.junit.runners.BlockJUnit4ClassRunner.runChild(BlockJUnit4ClassRunner.java:78)
	at org.junit.runners.BlockJUnit4ClassRunner.runChild(BlockJUnit4ClassRunner.java:57)
	at org.junit.runners.ParentRunner$3.run(ParentRunner.java:290)
	at org.junit.runners.ParentRunner$1.schedule(ParentRunner.java:71)
	at org.junit.runners.ParentRunner.runChildren(ParentRunner.java:288)
	at org.junit.runners.ParentRunner.access$000(ParentRunner.java:58)
	at org.junit.runners.ParentRunner$2.evaluate(ParentRunner.java:268)
	at org.junit.runners.ParentRunner.run(ParentRunner.java:363)
	at org.apache.maven.surefire.junit4.JUnit4Provider.execute(JUnit4Provider.java:283)
	at org.apache.maven.surefire.junit4.JUnit4Provider.executeWithRerun(JUnit4Provider.java:173)
	at org.apache.maven.surefire.junit4.JUnit4Provider.executeTestSet(JUnit4Provider.java:153)
	at org.apache.maven.surefire.junit4.JUnit4Provider.invoke(JUnit4Provider.java:128)
	at org.apache.maven.surefire.booter.ForkedBooter.invokeProviderInSameClassLoader(ForkedBooter.java:203)
	at org.apache.maven.surefire.booter.ForkedBooter.runSuitesInProcess(ForkedBooter.java:155)
	at org.apache.maven.surefire.booter.ForkedBooter.main(ForkedBooter.java:103)

testShortWithoutEqual(org.apache.commons.cli.PosixParserTest)  Time elapsed: 0.001 sec  <<< ERROR!
org.apache.commons.cli.MissingArgumentException: Missing argument for option: f
	at org.apache.commons.cli.Parser.processArgs(Parser.java:68)
	at org.apache.commons.cli.Parser.processOption(Parser.java:73)
	at org.apache.commons.cli.Parser.parse(Parser.java:40)
	at org.apache.commons.cli.Parser.parse(Parser.java:23)
	at org.apache.commons.cli.ParserTestCase.testShortWithoutEqual(ParserTestCase.java:309)
	at sun.reflect.NativeMethodAccessorImpl.invoke0(Native Method)
	at sun.reflect.NativeMethodAccessorImpl.invoke(NativeMethodAccessorImpl.java:57)
	at sun.reflect.DelegatingMethodAccessorImpl.invoke(DelegatingMethodAccessorImpl.java:43)
	at java.lang.reflect.Method.invoke(Method.java:606)
	at org.junit.runners.model.FrameworkMethod$1.runReflectiveCall(FrameworkMethod.java:50)
	at org.junit.internal.runners.model.ReflectiveCallable.run(ReflectiveCallable.java:12)
	at org.junit.runners.model.FrameworkMethod.invokeExplosively(FrameworkMethod.java:47)
	at org.junit.internal.runners.statements.InvokeMethod.evaluate(InvokeMethod.java:17)
	at org.junit.internal.runners.statements.RunBefores.evaluate(RunBefores.java:26)
	at org.junit.runners.ParentRunner.runLeaf(ParentRunner.java:325)
	at org.junit.runners.BlockJUnit4ClassRunner.runChild(BlockJUnit4ClassRunner.java:78)
	at org.junit.runners.BlockJUnit4ClassRunner.runChild(BlockJUnit4ClassRunner.java:57)
	at org.junit.runners.ParentRunner$3.run(ParentRunner.java:290)
	at org.junit.runners.ParentRunner$1.schedule(ParentRunner.java:71)
	at org.junit.runners.ParentRunner.runChildren(ParentRunner.java:288)
	at org.junit.runners.ParentRunner.access$000(ParentRunner.java:58)
	at org.junit.runners.ParentRunner$2.evaluate(ParentRunner.java:268)
	at org.junit.runners.ParentRunner.run(ParentRunner.java:363)
	at org.apache.maven.surefire.junit4.JUnit4Provider.execute(JUnit4Provider.java:283)
	at org.apache.maven.surefire.junit4.JUnit4Provider.executeWithRerun(JUnit4Provider.java:173)
	at org.apache.maven.surefire.junit4.JUnit4Provider.executeTestSet(JUnit4Provider.java:153)
	at org.apache.maven.surefire.junit4.JUnit4Provider.invoke(JUnit4Provider.java:128)
	at org.apache.maven.surefire.booter.ForkedBooter.invokeProviderInSameClassLoader(ForkedBooter.java:203)
	at org.apache.maven.surefire.booter.ForkedBooter.runSuitesInProcess(ForkedBooter.java:155)
	at org.apache.maven.surefire.booter.ForkedBooter.main(ForkedBooter.java:103)

testNegativeArgument(org.apache.commons.cli.PosixParserTest)  Time elapsed: 0 sec  <<< ERROR!
org.apache.commons.cli.MissingArgumentException: Missing argument for option: b
	at org.apache.commons.cli.Parser.processArgs(Parser.java:68)
	at org.apache.commons.cli.Parser.processOption(Parser.java:73)
	at org.apache.commons.cli.Parser.parse(Parser.java:40)
	at org.apache.commons.cli.Parser.parse(Parser.java:23)
	at org.apache.commons.cli.ParserTestCase.testNegativeArgument(ParserTestCase.java:264)
	at sun.reflect.NativeMethodAccessorImpl.invoke0(Native Method)
	at sun.reflect.NativeMethodAccessorImpl.invoke(NativeMethodAccessorImpl.java:57)
	at sun.reflect.DelegatingMethodAccessorImpl.invoke(DelegatingMethodAccessorImpl.java:43)
	at java.lang.reflect.Method.invoke(Method.java:606)
	at org.junit.runners.model.FrameworkMethod$1.runReflectiveCall(FrameworkMethod.java:50)
	at org.junit.internal.runners.model.ReflectiveCallable.run(ReflectiveCallable.java:12)
	at org.junit.runners.model.FrameworkMethod.invokeExplosively(FrameworkMethod.java:47)
	at org.junit.internal.runners.statements.InvokeMethod.evaluate(InvokeMethod.java:17)
	at org.junit.internal.runners.statements.RunBefores.evaluate(RunBefores.java:26)
	at org.junit.runners.ParentRunner.runLeaf(ParentRunner.java:325)
	at org.junit.runners.BlockJUnit4ClassRunner.runChild(BlockJUnit4ClassRunner.java:78)
	at org.junit.runners.BlockJUnit4ClassRunner.runChild(BlockJUnit4ClassRunner.java:57)
	at org.junit.runners.ParentRunner$3.run(ParentRunner.java:290)
	at org.junit.runners.ParentRunner$1.schedule(ParentRunner.java:71)
	at org.junit.runners.ParentRunner.runChildren(ParentRunner.java:288)
	at org.junit.runners.ParentRunner.access$000(ParentRunner.java:58)
	at org.junit.runners.ParentRunner$2.evaluate(ParentRunner.java:268)
	at org.junit.runners.ParentRunner.run(ParentRunner.java:363)
	at org.apache.maven.surefire.junit4.JUnit4Provider.execute(JUnit4Provider.java:283)
	at org.apache.maven.surefire.junit4.JUnit4Provider.executeWithRerun(JUnit4Provider.java:173)
	at org.apache.maven.surefire.junit4.JUnit4Provider.executeTestSet(JUnit4Provider.java:153)
	at org.apache.maven.surefire.junit4.JUnit4Provider.invoke(JUnit4Provider.java:128)
	at org.apache.maven.surefire.booter.ForkedBooter.invokeProviderInSameClassLoader(ForkedBooter.java:203)
	at org.apache.maven.surefire.booter.ForkedBooter.runSuitesInProcess(ForkedBooter.java:155)
	at org.apache.maven.surefire.booter.ForkedBooter.main(ForkedBooter.java:103)

testMultipleWithLong(org.apache.commons.cli.PosixParserTest)  Time elapsed: 0 sec  <<< ERROR!
org.apache.commons.cli.MissingArgumentException: Missing argument for option: b
	at org.apache.commons.cli.Parser.processArgs(Parser.java:68)
	at org.apache.commons.cli.Parser.processOption(Parser.java:73)
	at org.apache.commons.cli.Parser.parse(Parser.java:40)
	at org.apache.commons.cli.Parser.parse(Parser.java:23)
	at org.apache.commons.cli.ParserTestCase.testMultipleWithLong(ParserTestCase.java:113)
	at sun.reflect.NativeMethodAccessorImpl.invoke0(Native Method)
	at sun.reflect.NativeMethodAccessorImpl.invoke(NativeMethodAccessorImpl.java:57)
	at sun.reflect.DelegatingMethodAccessorImpl.invoke(DelegatingMethodAccessorImpl.java:43)
	at java.lang.reflect.Method.invoke(Method.java:606)
	at org.junit.runners.model.FrameworkMethod$1.runReflectiveCall(FrameworkMethod.java:50)
	at org.junit.internal.runners.model.ReflectiveCallable.run(ReflectiveCallable.java:12)
	at org.junit.runners.model.FrameworkMethod.invokeExplosively(FrameworkMethod.java:47)
	at org.junit.internal.runners.statements.InvokeMethod.evaluate(InvokeMethod.java:17)
	at org.junit.internal.runners.statements.RunBefores.evaluate(RunBefores.java:26)
	at org.junit.runners.ParentRunner.runLeaf(ParentRunner.java:325)
	at org.junit.runners.BlockJUnit4ClassRunner.runChild(BlockJUnit4ClassRunner.java:78)
	at org.junit.runners.BlockJUnit4ClassRunner.runChild(BlockJUnit4ClassRunner.java:57)
	at org.junit.runners.ParentRunner$3.run(ParentRunner.java:290)
	at org.junit.runners.ParentRunner$1.schedule(ParentRunner.java:71)
	at org.junit.runners.ParentRunner.runChildren(ParentRunner.java:288)
	at org.junit.runners.ParentRunner.access$000(ParentRunner.java:58)
	at org.junit.runners.ParentRunner$2.evaluate(ParentRunner.java:268)
	at org.junit.runners.ParentRunner.run(ParentRunner.java:363)
	at org.apache.maven.surefire.junit4.JUnit4Provider.execute(JUnit4Provider.java:283)
	at org.apache.maven.surefire.junit4.JUnit4Provider.executeWithRerun(JUnit4Provider.java:173)
	at org.apache.maven.surefire.junit4.JUnit4Provider.executeTestSet(JUnit4Provider.java:153)
	at org.apache.maven.surefire.junit4.JUnit4Provider.invoke(JUnit4Provider.java:128)
	at org.apache.maven.surefire.booter.ForkedBooter.invokeProviderInSameClassLoader(ForkedBooter.java:203)
	at org.apache.maven.surefire.booter.ForkedBooter.runSuitesInProcess(ForkedBooter.java:155)
	at org.apache.maven.surefire.booter.ForkedBooter.main(ForkedBooter.java:103)

testBursting(org.apache.commons.cli.PosixParserTest)  Time elapsed: 0 sec  <<< ERROR!
org.apache.commons.cli.MissingArgumentException: Missing argument for option: b
	at org.apache.commons.cli.Parser.processArgs(Parser.java:68)
	at org.apache.commons.cli.Parser.processOption(Parser.java:73)
	at org.apache.commons.cli.Parser.parse(Parser.java:40)
	at org.apache.commons.cli.Parser.parse(Parser.java:23)
	at org.apache.commons.cli.ParserTestCase.testBursting(ParserTestCase.java:836)
	at sun.reflect.NativeMethodAccessorImpl.invoke0(Native Method)
	at sun.reflect.NativeMethodAccessorImpl.invoke(NativeMethodAccessorImpl.java:57)
	at sun.reflect.DelegatingMethodAccessorImpl.invoke(DelegatingMethodAccessorImpl.java:43)
	at java.lang.reflect.Method.invoke(Method.java:606)
	at org.junit.runners.model.FrameworkMethod$1.runReflectiveCall(FrameworkMethod.java:50)
	at org.junit.internal.runners.model.ReflectiveCallable.run(ReflectiveCallable.java:12)
	at org.junit.runners.model.FrameworkMethod.invokeExplosively(FrameworkMethod.java:47)
	at org.junit.internal.runners.statements.InvokeMethod.evaluate(InvokeMethod.java:17)
	at org.junit.internal.runners.statements.RunBefores.evaluate(RunBefores.java:26)
	at org.junit.runners.ParentRunner.runLeaf(ParentRunner.java:325)
	at org.junit.runners.BlockJUnit4ClassRunner.runChild(BlockJUnit4ClassRunner.java:78)
	at org.junit.runners.BlockJUnit4ClassRunner.runChild(BlockJUnit4ClassRunner.java:57)
	at org.junit.runners.ParentRunner$3.run(ParentRunner.java:290)
	at org.junit.runners.ParentRunner$1.schedule(ParentRunner.java:71)
	at org.junit.runners.ParentRunner.runChildren(ParentRunner.java:288)
	at org.junit.runners.ParentRunner.access$000(ParentRunner.java:58)
	at org.junit.runners.ParentRunner$2.evaluate(ParentRunner.java:268)
	at org.junit.runners.ParentRunner.run(ParentRunner.java:363)
	at org.apache.maven.surefire.junit4.JUnit4Provider.execute(JUnit4Provider.java:283)
	at org.apache.maven.surefire.junit4.JUnit4Provider.executeWithRerun(JUnit4Provider.java:173)
	at org.apache.maven.surefire.junit4.JUnit4Provider.executeTestSet(JUnit4Provider.java:153)
	at org.apache.maven.surefire.junit4.JUnit4Provider.invoke(JUnit4Provider.java:128)
	at org.apache.maven.surefire.booter.ForkedBooter.invokeProviderInSameClassLoader(ForkedBooter.java:203)
	at org.apache.maven.surefire.booter.ForkedBooter.runSuitesInProcess(ForkedBooter.java:155)
	at org.apache.maven.surefire.booter.ForkedBooter.main(ForkedBooter.java:103)

testSingleDash(org.apache.commons.cli.PosixParserTest)  Time elapsed: 0 sec  <<< ERROR!
org.apache.commons.cli.MissingArgumentException: Missing argument for option: b
	at org.apache.commons.cli.Parser.processArgs(Parser.java:68)
	at org.apache.commons.cli.Parser.processOption(Parser.java:73)
	at org.apache.commons.cli.Parser.parse(Parser.java:40)
	at org.apache.commons.cli.Parser.parse(Parser.java:23)
	at org.apache.commons.cli.ParserTestCase.testSingleDash(ParserTestCase.java:199)
	at sun.reflect.NativeMethodAccessorImpl.invoke0(Native Method)
	at sun.reflect.NativeMethodAccessorImpl.invoke(NativeMethodAccessorImpl.java:57)
	at sun.reflect.DelegatingMethodAccessorImpl.invoke(DelegatingMethodAccessorImpl.java:43)
	at java.lang.reflect.Method.invoke(Method.java:606)
	at org.junit.runners.model.FrameworkMethod$1.runReflectiveCall(FrameworkMethod.java:50)
	at org.junit.internal.runners.model.ReflectiveCallable.run(ReflectiveCallable.java:12)
	at org.junit.runners.model.FrameworkMethod.invokeExplosively(FrameworkMethod.java:47)
	at org.junit.internal.runners.statements.InvokeMethod.evaluate(InvokeMethod.java:17)
	at org.junit.internal.runners.statements.RunBefores.evaluate(RunBefores.java:26)
	at org.junit.runners.ParentRunner.runLeaf(ParentRunner.java:325)
	at org.junit.runners.BlockJUnit4ClassRunner.runChild(BlockJUnit4ClassRunner.java:78)
	at org.junit.runners.BlockJUnit4ClassRunner.runChild(BlockJUnit4ClassRunner.java:57)
	at org.junit.runners.ParentRunner$3.run(ParentRunner.java:290)
	at org.junit.runners.ParentRunner$1.schedule(ParentRunner.java:71)
	at org.junit.runners.ParentRunner.runChildren(ParentRunner.java:288)
	at org.junit.runners.ParentRunner.access$000(ParentRunner.java:58)
	at org.junit.runners.ParentRunner$2.evaluate(ParentRunner.java:268)
	at org.junit.runners.ParentRunner.run(ParentRunner.java:363)
	at org.apache.maven.surefire.junit4.JUnit4Provider.execute(JUnit4Provider.java:283)
	at org.apache.maven.surefire.junit4.JUnit4Provider.executeWithRerun(JUnit4Provider.java:173)
	at org.apache.maven.surefire.junit4.JUnit4Provider.executeTestSet(JUnit4Provider.java:153)
	at org.apache.maven.surefire.junit4.JUnit4Provider.invoke(JUnit4Provider.java:128)
	at org.apache.maven.surefire.booter.ForkedBooter.invokeProviderInSameClassLoader(ForkedBooter.java:203)
	at org.apache.maven.surefire.booter.ForkedBooter.runSuitesInProcess(ForkedBooter.java:155)
	at org.apache.maven.surefire.booter.ForkedBooter.main(ForkedBooter.java:103)

testWithRequiredOption(org.apache.commons.cli.PosixParserTest)  Time elapsed: 0 sec  <<< ERROR!
org.apache.commons.cli.MissingArgumentException: Missing argument for option: b
	at org.apache.commons.cli.Parser.processArgs(Parser.java:68)
	at org.apache.commons.cli.Parser.processOption(Parser.java:73)
	at org.apache.commons.cli.Parser.parse(Parser.java:40)
	at org.apache.commons.cli.Parser.parse(Parser.java:23)
	at org.apache.commons.cli.ParserTestCase.testWithRequiredOption(ParserTestCase.java:674)
	at sun.reflect.NativeMethodAccessorImpl.invoke0(Native Method)
	at sun.reflect.NativeMethodAccessorImpl.invoke(NativeMethodAccessorImpl.java:57)
	at sun.reflect.DelegatingMethodAccessorImpl.invoke(DelegatingMethodAccessorImpl.java:43)
	at java.lang.reflect.Method.invoke(Method.java:606)
	at org.junit.runners.model.FrameworkMethod$1.runReflectiveCall(FrameworkMethod.java:50)
	at org.junit.internal.runners.model.ReflectiveCallable.run(ReflectiveCallable.java:12)
	at org.junit.runners.model.FrameworkMethod.invokeExplosively(FrameworkMethod.java:47)
	at org.junit.internal.runners.statements.InvokeMethod.evaluate(InvokeMethod.java:17)
	at org.junit.internal.runners.statements.RunBefores.evaluate(RunBefores.java:26)
	at org.junit.runners.ParentRunner.runLeaf(ParentRunner.java:325)
	at org.junit.runners.BlockJUnit4ClassRunner.runChild(BlockJUnit4ClassRunner.java:78)
	at org.junit.runners.BlockJUnit4ClassRunner.runChild(BlockJUnit4ClassRunner.java:57)
	at org.junit.runners.ParentRunner$3.run(ParentRunner.java:290)
	at org.junit.runners.ParentRunner$1.schedule(ParentRunner.java:71)
	at org.junit.runners.ParentRunner.runChildren(ParentRunner.java:288)
	at org.junit.runners.ParentRunner.access$000(ParentRunner.java:58)
	at org.junit.runners.ParentRunner$2.evaluate(ParentRunner.java:268)
	at org.junit.runners.ParentRunner.run(ParentRunner.java:363)
	at org.apache.maven.surefire.junit4.JUnit4Provider.execute(JUnit4Provider.java:283)
	at org.apache.maven.surefire.junit4.JUnit4Provider.executeWithRerun(JUnit4Provider.java:173)
	at org.apache.maven.surefire.junit4.JUnit4Provider.executeTestSet(JUnit4Provider.java:153)
	at org.apache.maven.surefire.junit4.JUnit4Provider.invoke(JUnit4Provider.java:128)
	at org.apache.maven.surefire.booter.ForkedBooter.invokeProviderInSameClassLoader(ForkedBooter.java:203)
	at org.apache.maven.surefire.booter.ForkedBooter.runSuitesInProcess(ForkedBooter.java:155)
	at org.apache.maven.surefire.booter.ForkedBooter.main(ForkedBooter.java:103)

testUnlimitedArgs(org.apache.commons.cli.PosixParserTest)  Time elapsed: 0.001 sec  <<< ERROR!
org.apache.commons.cli.MissingArgumentException: Missing argument for option: e
	at org.apache.commons.cli.Parser.processArgs(Parser.java:68)
	at org.apache.commons.cli.Parser.processOption(Parser.java:73)
	at org.apache.commons.cli.Parser.parse(Parser.java:40)
	at org.apache.commons.cli.Parser.parse(Parser.java:23)
	at org.apache.commons.cli.ParserTestCase.testUnlimitedArgs(ParserTestCase.java:921)
	at sun.reflect.NativeMethodAccessorImpl.invoke0(Native Method)
	at sun.reflect.NativeMethodAccessorImpl.invoke(NativeMethodAccessorImpl.java:57)
	at sun.reflect.DelegatingMethodAccessorImpl.invoke(DelegatingMethodAccessorImpl.java:43)
	at java.lang.reflect.Method.invoke(Method.java:606)
	at org.junit.runners.model.FrameworkMethod$1.runReflectiveCall(FrameworkMethod.java:50)
	at org.junit.internal.runners.model.ReflectiveCallable.run(ReflectiveCallable.java:12)
	at org.junit.runners.model.FrameworkMethod.invokeExplosively(FrameworkMethod.java:47)
	at org.junit.internal.runners.statements.InvokeMethod.evaluate(InvokeMethod.java:17)
	at org.junit.internal.runners.statements.RunBefores.evaluate(RunBefores.java:26)
	at org.junit.runners.ParentRunner.runLeaf(ParentRunner.java:325)
	at org.junit.runners.BlockJUnit4ClassRunner.runChild(BlockJUnit4ClassRunner.java:78)
	at org.junit.runners.BlockJUnit4ClassRunner.runChild(BlockJUnit4ClassRunner.java:57)
	at org.junit.runners.ParentRunner$3.run(ParentRunner.java:290)
	at org.junit.runners.ParentRunner$1.schedule(ParentRunner.java:71)
	at org.junit.runners.ParentRunner.runChildren(ParentRunner.java:288)
	at org.junit.runners.ParentRunner.access$000(ParentRunner.java:58)
	at org.junit.runners.ParentRunner$2.evaluate(ParentRunner.java:268)
	at org.junit.runners.ParentRunner.run(ParentRunner.java:363)
	at org.apache.maven.surefire.junit4.JUnit4Provider.execute(JUnit4Provider.java:283)
	at org.apache.maven.surefire.junit4.JUnit4Provider.executeWithRerun(JUnit4Provider.java:173)
	at org.apache.maven.surefire.junit4.JUnit4Provider.executeTestSet(JUnit4Provider.java:153)
	at org.apache.maven.surefire.junit4.JUnit4Provider.invoke(JUnit4Provider.java:128)
	at org.apache.maven.surefire.booter.ForkedBooter.invokeProviderInSameClassLoader(ForkedBooter.java:203)
	at org.apache.maven.surefire.booter.ForkedBooter.runSuitesInProcess(ForkedBooter.java:155)
	at org.apache.maven.surefire.booter.ForkedBooter.main(ForkedBooter.java:103)

testOptionAndRequiredOption(org.apache.commons.cli.PosixParserTest)  Time elapsed: 0.001 sec  <<< ERROR!
org.apache.commons.cli.MissingArgumentException: Missing argument for option: b
	at org.apache.commons.cli.Parser.processArgs(Parser.java:68)
	at org.apache.commons.cli.Parser.processOption(Parser.java:73)
	at org.apache.commons.cli.Parser.parse(Parser.java:40)
	at org.apache.commons.cli.Parser.parse(Parser.java:23)
	at org.apache.commons.cli.ParserTestCase.testOptionAndRequiredOption(ParserTestCase.java:691)
	at sun.reflect.NativeMethodAccessorImpl.invoke0(Native Method)
	at sun.reflect.NativeMethodAccessorImpl.invoke(NativeMethodAccessorImpl.java:57)
	at sun.reflect.DelegatingMethodAccessorImpl.invoke(DelegatingMethodAccessorImpl.java:43)
	at java.lang.reflect.Method.invoke(Method.java:606)
	at org.junit.runners.model.FrameworkMethod$1.runReflectiveCall(FrameworkMethod.java:50)
	at org.junit.internal.runners.model.ReflectiveCallable.run(ReflectiveCallable.java:12)
	at org.junit.runners.model.FrameworkMethod.invokeExplosively(FrameworkMethod.java:47)
	at org.junit.internal.runners.statements.InvokeMethod.evaluate(InvokeMethod.java:17)
	at org.junit.internal.runners.statements.RunBefores.evaluate(RunBefores.java:26)
	at org.junit.runners.ParentRunner.runLeaf(ParentRunner.java:325)
	at org.junit.runners.BlockJUnit4ClassRunner.runChild(BlockJUnit4ClassRunner.java:78)
	at org.junit.runners.BlockJUnit4ClassRunner.runChild(BlockJUnit4ClassRunner.java:57)
	at org.junit.runners.ParentRunner$3.run(ParentRunner.java:290)
	at org.junit.runners.ParentRunner$1.schedule(ParentRunner.java:71)
	at org.junit.runners.ParentRunner.runChildren(ParentRunner.java:288)
	at org.junit.runners.ParentRunner.access$000(ParentRunner.java:58)
	at org.junit.runners.ParentRunner$2.evaluate(ParentRunner.java:268)
	at org.junit.runners.ParentRunner.run(ParentRunner.java:363)
	at org.apache.maven.surefire.junit4.JUnit4Provider.execute(JUnit4Provider.java:283)
	at org.apache.maven.surefire.junit4.JUnit4Provider.executeWithRerun(JUnit4Provider.java:173)
	at org.apache.maven.surefire.junit4.JUnit4Provider.executeTestSet(JUnit4Provider.java:153)
	at org.apache.maven.surefire.junit4.JUnit4Provider.invoke(JUnit4Provider.java:128)
	at org.apache.maven.surefire.booter.ForkedBooter.invokeProviderInSameClassLoader(ForkedBooter.java:203)
	at org.apache.maven.surefire.booter.ForkedBooter.runSuitesInProcess(ForkedBooter.java:155)
	at org.apache.maven.surefire.booter.ForkedBooter.main(ForkedBooter.java:103)

testLongWithEqualDoubleDash(org.apache.commons.cli.PosixParserTest)  Time elapsed: 0 sec  <<< ERROR!
org.apache.commons.cli.MissingArgumentException: Missing argument for option: f
	at org.apache.commons.cli.Parser.processArgs(Parser.java:68)
	at org.apache.commons.cli.Parser.processOption(Parser.java:73)
	at org.apache.commons.cli.Parser.parse(Parser.java:40)
	at org.apache.commons.cli.Parser.parse(Parser.java:23)
	at org.apache.commons.cli.ParserTestCase.testLongWithEqualDoubleDash(ParserTestCase.java:322)
	at sun.reflect.NativeMethodAccessorImpl.invoke0(Native Method)
	at sun.reflect.NativeMethodAccessorImpl.invoke(NativeMethodAccessorImpl.java:57)
	at sun.reflect.DelegatingMethodAccessorImpl.invoke(DelegatingMethodAccessorImpl.java:43)
	at java.lang.reflect.Method.invoke(Method.java:606)
	at org.junit.runners.model.FrameworkMethod$1.runReflectiveCall(FrameworkMethod.java:50)
	at org.junit.internal.runners.model.ReflectiveCallable.run(ReflectiveCallable.java:12)
	at org.junit.runners.model.FrameworkMethod.invokeExplosively(FrameworkMethod.java:47)
	at org.junit.internal.runners.statements.InvokeMethod.evaluate(InvokeMethod.java:17)
	at org.junit.internal.runners.statements.RunBefores.evaluate(RunBefores.java:26)
	at org.junit.runners.ParentRunner.runLeaf(ParentRunner.java:325)
	at org.junit.runners.BlockJUnit4ClassRunner.runChild(BlockJUnit4ClassRunner.java:78)
	at org.junit.runners.BlockJUnit4ClassRunner.runChild(BlockJUnit4ClassRunner.java:57)
	at org.junit.runners.ParentRunner$3.run(ParentRunner.java:290)
	at org.junit.runners.ParentRunner$1.schedule(ParentRunner.java:71)
	at org.junit.runners.ParentRunner.runChildren(ParentRunner.java:288)
	at org.junit.runners.ParentRunner.access$000(ParentRunner.java:58)
	at org.junit.runners.ParentRunner$2.evaluate(ParentRunner.java:268)
	at org.junit.runners.ParentRunner.run(ParentRunner.java:363)
	at org.apache.maven.surefire.junit4.JUnit4Provider.execute(JUnit4Provider.java:283)
	at org.apache.maven.surefire.junit4.JUnit4Provider.executeWithRerun(JUnit4Provider.java:173)
	at org.apache.maven.surefire.junit4.JUnit4Provider.executeTestSet(JUnit4Provider.java:153)
	at org.apache.maven.surefire.junit4.JUnit4Provider.invoke(JUnit4Provider.java:128)
	at org.apache.maven.surefire.booter.ForkedBooter.invokeProviderInSameClassLoader(ForkedBooter.java:203)
	at org.apache.maven.surefire.booter.ForkedBooter.runSuitesInProcess(ForkedBooter.java:155)
	at org.apache.maven.surefire.booter.ForkedBooter.main(ForkedBooter.java:103)

testMultiple(org.apache.commons.cli.PosixParserTest)  Time elapsed: 0.001 sec  <<< ERROR!
org.apache.commons.cli.MissingArgumentException: Missing argument for option: b
	at org.apache.commons.cli.Parser.processArgs(Parser.java:68)
	at org.apache.commons.cli.Parser.processOption(Parser.java:73)
	at org.apache.commons.cli.Parser.parse(Parser.java:40)
	at org.apache.commons.cli.Parser.parse(Parser.java:23)
	at org.apache.commons.cli.ParserTestCase.testMultiple(ParserTestCase.java:93)
	at sun.reflect.NativeMethodAccessorImpl.invoke0(Native Method)
	at sun.reflect.NativeMethodAccessorImpl.invoke(NativeMethodAccessorImpl.java:57)
	at sun.reflect.DelegatingMethodAccessorImpl.invoke(DelegatingMethodAccessorImpl.java:43)
	at java.lang.reflect.Method.invoke(Method.java:606)
	at org.junit.runners.model.FrameworkMethod$1.runReflectiveCall(FrameworkMethod.java:50)
	at org.junit.internal.runners.model.ReflectiveCallable.run(ReflectiveCallable.java:12)
	at org.junit.runners.model.FrameworkMethod.invokeExplosively(FrameworkMethod.java:47)
	at org.junit.internal.runners.statements.InvokeMethod.evaluate(InvokeMethod.java:17)
	at org.junit.internal.runners.statements.RunBefores.evaluate(RunBefores.java:26)
	at org.junit.runners.ParentRunner.runLeaf(ParentRunner.java:325)
	at org.junit.runners.BlockJUnit4ClassRunner.runChild(BlockJUnit4ClassRunner.java:78)
	at org.junit.runners.BlockJUnit4ClassRunner.runChild(BlockJUnit4ClassRunner.java:57)
	at org.junit.runners.ParentRunner$3.run(ParentRunner.java:290)
	at org.junit.runners.ParentRunner$1.schedule(ParentRunner.java:71)
	at org.junit.runners.ParentRunner.runChildren(ParentRunner.java:288)
	at org.junit.runners.ParentRunner.access$000(ParentRunner.java:58)
	at org.junit.runners.ParentRunner$2.evaluate(ParentRunner.java:268)
	at org.junit.runners.ParentRunner.run(ParentRunner.java:363)
	at org.apache.maven.surefire.junit4.JUnit4Provider.execute(JUnit4Provider.java:283)
	at org.apache.maven.surefire.junit4.JUnit4Provider.executeWithRerun(JUnit4Provider.java:173)
	at org.apache.maven.surefire.junit4.JUnit4Provider.executeTestSet(JUnit4Provider.java:153)
	at org.apache.maven.surefire.junit4.JUnit4Provider.invoke(JUnit4Provider.java:128)
	at org.apache.maven.surefire.booter.ForkedBooter.invokeProviderInSameClassLoader(ForkedBooter.java:203)
	at org.apache.maven.surefire.booter.ForkedBooter.runSuitesInProcess(ForkedBooter.java:155)
	at org.apache.maven.surefire.booter.ForkedBooter.main(ForkedBooter.java:103)

testArgumentStartingWithHyphen(org.apache.commons.cli.PosixParserTest)  Time elapsed: 0.001 sec  <<< ERROR!
org.apache.commons.cli.MissingArgumentException: Missing argument for option: b
	at org.apache.commons.cli.Parser.processArgs(Parser.java:68)
	at org.apache.commons.cli.Parser.processOption(Parser.java:73)
	at org.apache.commons.cli.Parser.parse(Parser.java:40)
	at org.apache.commons.cli.Parser.parse(Parser.java:23)
	at org.apache.commons.cli.ParserTestCase.testArgumentStartingWithHyphen(ParserTestCase.java:284)
	at sun.reflect.NativeMethodAccessorImpl.invoke0(Native Method)
	at sun.reflect.NativeMethodAccessorImpl.invoke(NativeMethodAccessorImpl.java:57)
	at sun.reflect.DelegatingMethodAccessorImpl.invoke(DelegatingMethodAccessorImpl.java:43)
	at java.lang.reflect.Method.invoke(Method.java:606)
	at org.junit.runners.model.FrameworkMethod$1.runReflectiveCall(FrameworkMethod.java:50)
	at org.junit.internal.runners.model.ReflectiveCallable.run(ReflectiveCallable.java:12)
	at org.junit.runners.model.FrameworkMethod.invokeExplosively(FrameworkMethod.java:47)
	at org.junit.internal.runners.statements.InvokeMethod.evaluate(InvokeMethod.java:17)
	at org.junit.internal.runners.statements.RunBefores.evaluate(RunBefores.java:26)
	at org.junit.runners.ParentRunner.runLeaf(ParentRunner.java:325)
	at org.junit.runners.BlockJUnit4ClassRunner.runChild(BlockJUnit4ClassRunner.java:78)
	at org.junit.runners.BlockJUnit4ClassRunner.runChild(BlockJUnit4ClassRunner.java:57)
	at org.junit.runners.ParentRunner$3.run(ParentRunner.java:290)
	at org.junit.runners.ParentRunner$1.schedule(ParentRunner.java:71)
	at org.junit.runners.ParentRunner.runChildren(ParentRunner.java:288)
	at org.junit.runners.ParentRunner.access$000(ParentRunner.java:58)
	at org.junit.runners.ParentRunner$2.evaluate(ParentRunner.java:268)
	at org.junit.runners.ParentRunner.run(ParentRunner.java:363)
	at org.apache.maven.surefire.junit4.JUnit4Provider.execute(JUnit4Provider.java:283)
	at org.apache.maven.surefire.junit4.JUnit4Provider.executeWithRerun(JUnit4Provider.java:173)
	at org.apache.maven.surefire.junit4.JUnit4Provider.executeTestSet(JUnit4Provider.java:153)
	at org.apache.maven.surefire.junit4.JUnit4Provider.invoke(JUnit4Provider.java:128)
	at org.apache.maven.surefire.booter.ForkedBooter.invokeProviderInSameClassLoader(ForkedBooter.java:203)
	at org.apache.maven.surefire.booter.ForkedBooter.runSuitesInProcess(ForkedBooter.java:155)
	at org.apache.maven.surefire.booter.ForkedBooter.main(ForkedBooter.java:103)

testPropertiesOption1(org.apache.commons.cli.PosixParserTest)  Time elapsed: 0 sec  <<< ERROR!
org.apache.commons.cli.MissingArgumentException: Missing argument for option: J
	at org.apache.commons.cli.Parser.processArgs(Parser.java:68)
	at org.apache.commons.cli.Parser.processOption(Parser.java:73)
	at org.apache.commons.cli.Parser.parse(Parser.java:40)
	at org.apache.commons.cli.Parser.parse(Parser.java:23)
	at org.apache.commons.cli.ParserTestCase.testPropertiesOption1(ParserTestCase.java:453)
	at sun.reflect.NativeMethodAccessorImpl.invoke0(Native Method)
	at sun.reflect.NativeMethodAccessorImpl.invoke(NativeMethodAccessorImpl.java:57)
	at sun.reflect.DelegatingMethodAccessorImpl.invoke(DelegatingMethodAccessorImpl.java:43)
	at java.lang.reflect.Method.invoke(Method.java:606)
	at org.junit.runners.model.FrameworkMethod$1.runReflectiveCall(FrameworkMethod.java:50)
	at org.junit.internal.runners.model.ReflectiveCallable.run(ReflectiveCallable.java:12)
	at org.junit.runners.model.FrameworkMethod.invokeExplosively(FrameworkMethod.java:47)
	at org.junit.internal.runners.statements.InvokeMethod.evaluate(InvokeMethod.java:17)
	at org.junit.internal.runners.statements.RunBefores.evaluate(RunBefores.java:26)
	at org.junit.runners.ParentRunner.runLeaf(ParentRunner.java:325)
	at org.junit.runners.BlockJUnit4ClassRunner.runChild(BlockJUnit4ClassRunner.java:78)
	at org.junit.runners.BlockJUnit4ClassRunner.runChild(BlockJUnit4ClassRunner.java:57)
	at org.junit.runners.ParentRunner$3.run(ParentRunner.java:290)
	at org.junit.runners.ParentRunner$1.schedule(ParentRunner.java:71)
	at org.junit.runners.ParentRunner.runChildren(ParentRunner.java:288)
	at org.junit.runners.ParentRunner.access$000(ParentRunner.java:58)
	at org.junit.runners.ParentRunner$2.evaluate(ParentRunner.java:268)
	at org.junit.runners.ParentRunner.run(ParentRunner.java:363)
	at org.apache.maven.surefire.junit4.JUnit4Provider.execute(JUnit4Provider.java:283)
	at org.apache.maven.surefire.junit4.JUnit4Provider.executeWithRerun(JUnit4Provider.java:173)
	at org.apache.maven.surefire.junit4.JUnit4Provider.executeTestSet(JUnit4Provider.java:153)
	at org.apache.maven.surefire.junit4.JUnit4Provider.invoke(JUnit4Provider.java:128)
	at org.apache.maven.surefire.booter.ForkedBooter.invokeProviderInSameClassLoader(ForkedBooter.java:203)
	at org.apache.maven.surefire.booter.ForkedBooter.runSuitesInProcess(ForkedBooter.java:155)
	at org.apache.maven.surefire.booter.ForkedBooter.main(ForkedBooter.java:103)

testPropertiesOption2(org.apache.commons.cli.PosixParserTest)  Time elapsed: 0.001 sec  <<< ERROR!
org.apache.commons.cli.MissingArgumentException: Missing argument for option: D
	at org.apache.commons.cli.Parser.processArgs(Parser.java:68)
	at org.apache.commons.cli.Parser.processOption(Parser.java:73)
	at org.apache.commons.cli.Parser.parse(Parser.java:40)
	at org.apache.commons.cli.Parser.parse(Parser.java:23)
	at org.apache.commons.cli.ParserTestCase.testPropertiesOption2(ParserTestCase.java:476)
	at sun.reflect.NativeMethodAccessorImpl.invoke0(Native Method)
	at sun.reflect.NativeMethodAccessorImpl.invoke(NativeMethodAccessorImpl.java:57)
	at sun.reflect.DelegatingMethodAccessorImpl.invoke(DelegatingMethodAccessorImpl.java:43)
	at java.lang.reflect.Method.invoke(Method.java:606)
	at org.junit.runners.model.FrameworkMethod$1.runReflectiveCall(FrameworkMethod.java:50)
	at org.junit.internal.runners.model.ReflectiveCallable.run(ReflectiveCallable.java:12)
	at org.junit.runners.model.FrameworkMethod.invokeExplosively(FrameworkMethod.java:47)
	at org.junit.internal.runners.statements.InvokeMethod.evaluate(InvokeMethod.java:17)
	at org.junit.internal.runners.statements.RunBefores.evaluate(RunBefores.java:26)
	at org.junit.runners.ParentRunner.runLeaf(ParentRunner.java:325)
	at org.junit.runners.BlockJUnit4ClassRunner.runChild(BlockJUnit4ClassRunner.java:78)
	at org.junit.runners.BlockJUnit4ClassRunner.runChild(BlockJUnit4ClassRunner.java:57)
	at org.junit.runners.ParentRunner$3.run(ParentRunner.java:290)
	at org.junit.runners.ParentRunner$1.schedule(ParentRunner.java:71)
	at org.junit.runners.ParentRunner.runChildren(ParentRunner.java:288)
	at org.junit.runners.ParentRunner.access$000(ParentRunner.java:58)
	at org.junit.runners.ParentRunner$2.evaluate(ParentRunner.java:268)
	at org.junit.runners.ParentRunner.run(ParentRunner.java:363)
	at org.apache.maven.surefire.junit4.JUnit4Provider.execute(JUnit4Provider.java:283)
	at org.apache.maven.surefire.junit4.JUnit4Provider.executeWithRerun(JUnit4Provider.java:173)
	at org.apache.maven.surefire.junit4.JUnit4Provider.executeTestSet(JUnit4Provider.java:153)
	at org.apache.maven.surefire.junit4.JUnit4Provider.invoke(JUnit4Provider.java:128)
	at org.apache.maven.surefire.booter.ForkedBooter.invokeProviderInSameClassLoader(ForkedBooter.java:203)
	at org.apache.maven.surefire.booter.ForkedBooter.runSuitesInProcess(ForkedBooter.java:155)
	at org.apache.maven.surefire.booter.ForkedBooter.main(ForkedBooter.java:103)

testStopAtExpectedArg(org.apache.commons.cli.PosixParserTest)  Time elapsed: 0.001 sec  <<< ERROR!
org.apache.commons.cli.MissingArgumentException: Missing argument for option: b
	at org.apache.commons.cli.Parser.processArgs(Parser.java:68)
	at org.apache.commons.cli.Parser.processOption(Parser.java:73)
	at org.apache.commons.cli.Parser.parse(Parser.java:40)
	at org.apache.commons.cli.Parser.parse(Parser.java:25)
	at org.apache.commons.cli.ParserTestCase.testStopAtExpectedArg(ParserTestCase.java:226)
	at sun.reflect.NativeMethodAccessorImpl.invoke0(Native Method)
	at sun.reflect.NativeMethodAccessorImpl.invoke(NativeMethodAccessorImpl.java:57)
	at sun.reflect.DelegatingMethodAccessorImpl.invoke(DelegatingMethodAccessorImpl.java:43)
	at java.lang.reflect.Method.invoke(Method.java:606)
	at org.junit.runners.model.FrameworkMethod$1.runReflectiveCall(FrameworkMethod.java:50)
	at org.junit.internal.runners.model.ReflectiveCallable.run(ReflectiveCallable.java:12)
	at org.junit.runners.model.FrameworkMethod.invokeExplosively(FrameworkMethod.java:47)
	at org.junit.internal.runners.statements.InvokeMethod.evaluate(InvokeMethod.java:17)
	at org.junit.internal.runners.statements.RunBefores.evaluate(RunBefores.java:26)
	at org.junit.runners.ParentRunner.runLeaf(ParentRunner.java:325)
	at org.junit.runners.BlockJUnit4ClassRunner.runChild(BlockJUnit4ClassRunner.java:78)
	at org.junit.runners.BlockJUnit4ClassRunner.runChild(BlockJUnit4ClassRunner.java:57)
	at org.junit.runners.ParentRunner$3.run(ParentRunner.java:290)
	at org.junit.runners.ParentRunner$1.schedule(ParentRunner.java:71)
	at org.junit.runners.ParentRunner.runChildren(ParentRunner.java:288)
	at org.junit.runners.ParentRunner.access$000(ParentRunner.java:58)
	at org.junit.runners.ParentRunner$2.evaluate(ParentRunner.java:268)
	at org.junit.runners.ParentRunner.run(ParentRunner.java:363)
	at org.apache.maven.surefire.junit4.JUnit4Provider.execute(JUnit4Provider.java:283)
	at org.apache.maven.surefire.junit4.JUnit4Provider.executeWithRerun(JUnit4Provider.java:173)
	at org.apache.maven.surefire.junit4.JUnit4Provider.executeTestSet(JUnit4Provider.java:153)
	at org.apache.maven.surefire.junit4.JUnit4Provider.invoke(JUnit4Provider.java:128)
	at org.apache.maven.surefire.booter.ForkedBooter.invokeProviderInSameClassLoader(ForkedBooter.java:203)
	at org.apache.maven.surefire.booter.ForkedBooter.runSuitesInProcess(ForkedBooter.java:155)
	at org.apache.maven.surefire.booter.ForkedBooter.main(ForkedBooter.java:103)

Running org.apache.commons.cli.UtilTest
Tests run: 2, Failures: 0, Errors: 0, Skipped: 0, Time elapsed: 0.001 sec - in org.apache.commons.cli.UtilTest
Running org.apache.commons.cli.OptionGroupTest
Tests run: 13, Failures: 0, Errors: 0, Skipped: 0, Time elapsed: 0.004 sec - in org.apache.commons.cli.OptionGroupTest
Running org.apache.commons.cli.CommandLineTest
Tests run: 3, Failures: 0, Errors: 1, Skipped: 0, Time elapsed: 0.004 sec <<< FAILURE! - in org.apache.commons.cli.CommandLineTest
testGetOptionProperties(org.apache.commons.cli.CommandLineTest)  Time elapsed: 0 sec  <<< ERROR!
org.apache.commons.cli.MissingArgumentException: Missing argument for option: D
	at org.apache.commons.cli.Parser.processArgs(Parser.java:68)
	at org.apache.commons.cli.Parser.processOption(Parser.java:73)
	at org.apache.commons.cli.Parser.parse(Parser.java:40)
	at org.apache.commons.cli.Parser.parse(Parser.java:23)
	at org.apache.commons.cli.CommandLineTest.testGetOptionProperties(CommandLineTest.java:40)

Running org.apache.commons.cli.BasicParserTest
Tests run: 58, Failures: 0, Errors: 11, Skipped: 0, Time elapsed: 0.041 sec <<< FAILURE! - in org.apache.commons.cli.BasicParserTest
testSimpleLong(org.apache.commons.cli.BasicParserTest)  Time elapsed: 0.003 sec  <<< ERROR!
org.apache.commons.cli.MissingArgumentException: Missing argument for option: b
	at org.apache.commons.cli.Parser.processArgs(Parser.java:68)
	at org.apache.commons.cli.Parser.processOption(Parser.java:73)
	at org.apache.commons.cli.Parser.parse(Parser.java:40)
	at org.apache.commons.cli.Parser.parse(Parser.java:23)
	at org.apache.commons.cli.ParserTestCase.testSimpleLong(ParserTestCase.java:73)
	at sun.reflect.NativeMethodAccessorImpl.invoke0(Native Method)
	at sun.reflect.NativeMethodAccessorImpl.invoke(NativeMethodAccessorImpl.java:57)
	at sun.reflect.DelegatingMethodAccessorImpl.invoke(DelegatingMethodAccessorImpl.java:43)
	at java.lang.reflect.Method.invoke(Method.java:606)
	at org.junit.runners.model.FrameworkMethod$1.runReflectiveCall(FrameworkMethod.java:50)
	at org.junit.internal.runners.model.ReflectiveCallable.run(ReflectiveCallable.java:12)
	at org.junit.runners.model.FrameworkMethod.invokeExplosively(FrameworkMethod.java:47)
	at org.junit.internal.runners.statements.InvokeMethod.evaluate(InvokeMethod.java:17)
	at org.junit.internal.runners.statements.RunBefores.evaluate(RunBefores.java:26)
	at org.junit.runners.ParentRunner.runLeaf(ParentRunner.java:325)
	at org.junit.runners.BlockJUnit4ClassRunner.runChild(BlockJUnit4ClassRunner.java:78)
	at org.junit.runners.BlockJUnit4ClassRunner.runChild(BlockJUnit4ClassRunner.java:57)
	at org.junit.runners.ParentRunner$3.run(ParentRunner.java:290)
	at org.junit.runners.ParentRunner$1.schedule(ParentRunner.java:71)
	at org.junit.runners.ParentRunner.runChildren(ParentRunner.java:288)
	at org.junit.runners.ParentRunner.access$000(ParentRunner.java:58)
	at org.junit.runners.ParentRunner$2.evaluate(ParentRunner.java:268)
	at org.junit.runners.ParentRunner.run(ParentRunner.java:363)
	at org.apache.maven.surefire.junit4.JUnit4Provider.execute(JUnit4Provider.java:283)
	at org.apache.maven.surefire.junit4.JUnit4Provider.executeWithRerun(JUnit4Provider.java:173)
	at org.apache.maven.surefire.junit4.JUnit4Provider.executeTestSet(JUnit4Provider.java:153)
	at org.apache.maven.surefire.junit4.JUnit4Provider.invoke(JUnit4Provider.java:128)
	at org.apache.maven.surefire.booter.ForkedBooter.invokeProviderInSameClassLoader(ForkedBooter.java:203)
	at org.apache.maven.surefire.booter.ForkedBooter.runSuitesInProcess(ForkedBooter.java:155)
	at org.apache.maven.surefire.booter.ForkedBooter.main(ForkedBooter.java:103)

testSimpleShort(org.apache.commons.cli.BasicParserTest)  Time elapsed: 0 sec  <<< ERROR!
org.apache.commons.cli.MissingArgumentException: Missing argument for option: b
	at org.apache.commons.cli.Parser.processArgs(Parser.java:68)
	at org.apache.commons.cli.Parser.processOption(Parser.java:73)
	at org.apache.commons.cli.Parser.parse(Parser.java:40)
	at org.apache.commons.cli.Parser.parse(Parser.java:23)
	at org.apache.commons.cli.ParserTestCase.testSimpleShort(ParserTestCase.java:58)
	at sun.reflect.NativeMethodAccessorImpl.invoke0(Native Method)
	at sun.reflect.NativeMethodAccessorImpl.invoke(NativeMethodAccessorImpl.java:57)
	at sun.reflect.DelegatingMethodAccessorImpl.invoke(DelegatingMethodAccessorImpl.java:43)
	at java.lang.reflect.Method.invoke(Method.java:606)
	at org.junit.runners.model.FrameworkMethod$1.runReflectiveCall(FrameworkMethod.java:50)
	at org.junit.internal.runners.model.ReflectiveCallable.run(ReflectiveCallable.java:12)
	at org.junit.runners.model.FrameworkMethod.invokeExplosively(FrameworkMethod.java:47)
	at org.junit.internal.runners.statements.InvokeMethod.evaluate(InvokeMethod.java:17)
	at org.junit.internal.runners.statements.RunBefores.evaluate(RunBefores.java:26)
	at org.junit.runners.ParentRunner.runLeaf(ParentRunner.java:325)
	at org.junit.runners.BlockJUnit4ClassRunner.runChild(BlockJUnit4ClassRunner.java:78)
	at org.junit.runners.BlockJUnit4ClassRunner.runChild(BlockJUnit4ClassRunner.java:57)
	at org.junit.runners.ParentRunner$3.run(ParentRunner.java:290)
	at org.junit.runners.ParentRunner$1.schedule(ParentRunner.java:71)
	at org.junit.runners.ParentRunner.runChildren(ParentRunner.java:288)
	at org.junit.runners.ParentRunner.access$000(ParentRunner.java:58)
	at org.junit.runners.ParentRunner$2.evaluate(ParentRunner.java:268)
	at org.junit.runners.ParentRunner.run(ParentRunner.java:363)
	at org.apache.maven.surefire.junit4.JUnit4Provider.execute(JUnit4Provider.java:283)
	at org.apache.maven.surefire.junit4.JUnit4Provider.executeWithRerun(JUnit4Provider.java:173)
	at org.apache.maven.surefire.junit4.JUnit4Provider.executeTestSet(JUnit4Provider.java:153)
	at org.apache.maven.surefire.junit4.JUnit4Provider.invoke(JUnit4Provider.java:128)
	at org.apache.maven.surefire.booter.ForkedBooter.invokeProviderInSameClassLoader(ForkedBooter.java:203)
	at org.apache.maven.surefire.booter.ForkedBooter.runSuitesInProcess(ForkedBooter.java:155)
	at org.apache.maven.surefire.booter.ForkedBooter.main(ForkedBooter.java:103)

testNegativeArgument(org.apache.commons.cli.BasicParserTest)  Time elapsed: 0.001 sec  <<< ERROR!
org.apache.commons.cli.MissingArgumentException: Missing argument for option: b
	at org.apache.commons.cli.Parser.processArgs(Parser.java:68)
	at org.apache.commons.cli.Parser.processOption(Parser.java:73)
	at org.apache.commons.cli.Parser.parse(Parser.java:40)
	at org.apache.commons.cli.Parser.parse(Parser.java:23)
	at org.apache.commons.cli.ParserTestCase.testNegativeArgument(ParserTestCase.java:264)
	at sun.reflect.NativeMethodAccessorImpl.invoke0(Native Method)
	at sun.reflect.NativeMethodAccessorImpl.invoke(NativeMethodAccessorImpl.java:57)
	at sun.reflect.DelegatingMethodAccessorImpl.invoke(DelegatingMethodAccessorImpl.java:43)
	at java.lang.reflect.Method.invoke(Method.java:606)
	at org.junit.runners.model.FrameworkMethod$1.runReflectiveCall(FrameworkMethod.java:50)
	at org.junit.internal.runners.model.ReflectiveCallable.run(ReflectiveCallable.java:12)
	at org.junit.runners.model.FrameworkMethod.invokeExplosively(FrameworkMethod.java:47)
	at org.junit.internal.runners.statements.InvokeMethod.evaluate(InvokeMethod.java:17)
	at org.junit.internal.runners.statements.RunBefores.evaluate(RunBefores.java:26)
	at org.junit.runners.ParentRunner.runLeaf(ParentRunner.java:325)
	at org.junit.runners.BlockJUnit4ClassRunner.runChild(BlockJUnit4ClassRunner.java:78)
	at org.junit.runners.BlockJUnit4ClassRunner.runChild(BlockJUnit4ClassRunner.java:57)
	at org.junit.runners.ParentRunner$3.run(ParentRunner.java:290)
	at org.junit.runners.ParentRunner$1.schedule(ParentRunner.java:71)
	at org.junit.runners.ParentRunner.runChildren(ParentRunner.java:288)
	at org.junit.runners.ParentRunner.access$000(ParentRunner.java:58)
	at org.junit.runners.ParentRunner$2.evaluate(ParentRunner.java:268)
	at org.junit.runners.ParentRunner.run(ParentRunner.java:363)
	at org.apache.maven.surefire.junit4.JUnit4Provider.execute(JUnit4Provider.java:283)
	at org.apache.maven.surefire.junit4.JUnit4Provider.executeWithRerun(JUnit4Provider.java:173)
	at org.apache.maven.surefire.junit4.JUnit4Provider.executeTestSet(JUnit4Provider.java:153)
	at org.apache.maven.surefire.junit4.JUnit4Provider.invoke(JUnit4Provider.java:128)
	at org.apache.maven.surefire.booter.ForkedBooter.invokeProviderInSameClassLoader(ForkedBooter.java:203)
	at org.apache.maven.surefire.booter.ForkedBooter.runSuitesInProcess(ForkedBooter.java:155)
	at org.apache.maven.surefire.booter.ForkedBooter.main(ForkedBooter.java:103)

testMultipleWithLong(org.apache.commons.cli.BasicParserTest)  Time elapsed: 0 sec  <<< ERROR!
org.apache.commons.cli.MissingArgumentException: Missing argument for option: b
	at org.apache.commons.cli.Parser.processArgs(Parser.java:68)
	at org.apache.commons.cli.Parser.processOption(Parser.java:73)
	at org.apache.commons.cli.Parser.parse(Parser.java:40)
	at org.apache.commons.cli.Parser.parse(Parser.java:23)
	at org.apache.commons.cli.ParserTestCase.testMultipleWithLong(ParserTestCase.java:113)
	at sun.reflect.NativeMethodAccessorImpl.invoke0(Native Method)
	at sun.reflect.NativeMethodAccessorImpl.invoke(NativeMethodAccessorImpl.java:57)
	at sun.reflect.DelegatingMethodAccessorImpl.invoke(DelegatingMethodAccessorImpl.java:43)
	at java.lang.reflect.Method.invoke(Method.java:606)
	at org.junit.runners.model.FrameworkMethod$1.runReflectiveCall(FrameworkMethod.java:50)
	at org.junit.internal.runners.model.ReflectiveCallable.run(ReflectiveCallable.java:12)
	at org.junit.runners.model.FrameworkMethod.invokeExplosively(FrameworkMethod.java:47)
	at org.junit.internal.runners.statements.InvokeMethod.evaluate(InvokeMethod.java:17)
	at org.junit.internal.runners.statements.RunBefores.evaluate(RunBefores.java:26)
	at org.junit.runners.ParentRunner.runLeaf(ParentRunner.java:325)
	at org.junit.runners.BlockJUnit4ClassRunner.runChild(BlockJUnit4ClassRunner.java:78)
	at org.junit.runners.BlockJUnit4ClassRunner.runChild(BlockJUnit4ClassRunner.java:57)
	at org.junit.runners.ParentRunner$3.run(ParentRunner.java:290)
	at org.junit.runners.ParentRunner$1.schedule(ParentRunner.java:71)
	at org.junit.runners.ParentRunner.runChildren(ParentRunner.java:288)
	at org.junit.runners.ParentRunner.access$000(ParentRunner.java:58)
	at org.junit.runners.ParentRunner$2.evaluate(ParentRunner.java:268)
	at org.junit.runners.ParentRunner.run(ParentRunner.java:363)
	at org.apache.maven.surefire.junit4.JUnit4Provider.execute(JUnit4Provider.java:283)
	at org.apache.maven.surefire.junit4.JUnit4Provider.executeWithRerun(JUnit4Provider.java:173)
	at org.apache.maven.surefire.junit4.JUnit4Provider.executeTestSet(JUnit4Provider.java:153)
	at org.apache.maven.surefire.junit4.JUnit4Provider.invoke(JUnit4Provider.java:128)
	at org.apache.maven.surefire.booter.ForkedBooter.invokeProviderInSameClassLoader(ForkedBooter.java:203)
	at org.apache.maven.surefire.booter.ForkedBooter.runSuitesInProcess(ForkedBooter.java:155)
	at org.apache.maven.surefire.booter.ForkedBooter.main(ForkedBooter.java:103)

testSingleDash(org.apache.commons.cli.BasicParserTest)  Time elapsed: 0 sec  <<< ERROR!
org.apache.commons.cli.MissingArgumentException: Missing argument for option: b
	at org.apache.commons.cli.Parser.processArgs(Parser.java:68)
	at org.apache.commons.cli.Parser.processOption(Parser.java:73)
	at org.apache.commons.cli.Parser.parse(Parser.java:40)
	at org.apache.commons.cli.Parser.parse(Parser.java:23)
	at org.apache.commons.cli.ParserTestCase.testSingleDash(ParserTestCase.java:199)
	at sun.reflect.NativeMethodAccessorImpl.invoke0(Native Method)
	at sun.reflect.NativeMethodAccessorImpl.invoke(NativeMethodAccessorImpl.java:57)
	at sun.reflect.DelegatingMethodAccessorImpl.invoke(DelegatingMethodAccessorImpl.java:43)
	at java.lang.reflect.Method.invoke(Method.java:606)
	at org.junit.runners.model.FrameworkMethod$1.runReflectiveCall(FrameworkMethod.java:50)
	at org.junit.internal.runners.model.ReflectiveCallable.run(ReflectiveCallable.java:12)
	at org.junit.runners.model.FrameworkMethod.invokeExplosively(FrameworkMethod.java:47)
	at org.junit.internal.runners.statements.InvokeMethod.evaluate(InvokeMethod.java:17)
	at org.junit.internal.runners.statements.RunBefores.evaluate(RunBefores.java:26)
	at org.junit.runners.ParentRunner.runLeaf(ParentRunner.java:325)
	at org.junit.runners.BlockJUnit4ClassRunner.runChild(BlockJUnit4ClassRunner.java:78)
	at org.junit.runners.BlockJUnit4ClassRunner.runChild(BlockJUnit4ClassRunner.java:57)
	at org.junit.runners.ParentRunner$3.run(ParentRunner.java:290)
	at org.junit.runners.ParentRunner$1.schedule(ParentRunner.java:71)
	at org.junit.runners.ParentRunner.runChildren(ParentRunner.java:288)
	at org.junit.runners.ParentRunner.access$000(ParentRunner.java:58)
	at org.junit.runners.ParentRunner$2.evaluate(ParentRunner.java:268)
	at org.junit.runners.ParentRunner.run(ParentRunner.java:363)
	at org.apache.maven.surefire.junit4.JUnit4Provider.execute(JUnit4Provider.java:283)
	at org.apache.maven.surefire.junit4.JUnit4Provider.executeWithRerun(JUnit4Provider.java:173)
	at org.apache.maven.surefire.junit4.JUnit4Provider.executeTestSet(JUnit4Provider.java:153)
	at org.apache.maven.surefire.junit4.JUnit4Provider.invoke(JUnit4Provider.java:128)
	at org.apache.maven.surefire.booter.ForkedBooter.invokeProviderInSameClassLoader(ForkedBooter.java:203)
	at org.apache.maven.surefire.booter.ForkedBooter.runSuitesInProcess(ForkedBooter.java:155)
	at org.apache.maven.surefire.booter.ForkedBooter.main(ForkedBooter.java:103)

testWithRequiredOption(org.apache.commons.cli.BasicParserTest)  Time elapsed: 0 sec  <<< ERROR!
org.apache.commons.cli.MissingArgumentException: Missing argument for option: b
	at org.apache.commons.cli.Parser.processArgs(Parser.java:68)
	at org.apache.commons.cli.Parser.processOption(Parser.java:73)
	at org.apache.commons.cli.Parser.parse(Parser.java:40)
	at org.apache.commons.cli.Parser.parse(Parser.java:23)
	at org.apache.commons.cli.ParserTestCase.testWithRequiredOption(ParserTestCase.java:674)
	at sun.reflect.NativeMethodAccessorImpl.invoke0(Native Method)
	at sun.reflect.NativeMethodAccessorImpl.invoke(NativeMethodAccessorImpl.java:57)
	at sun.reflect.DelegatingMethodAccessorImpl.invoke(DelegatingMethodAccessorImpl.java:43)
	at java.lang.reflect.Method.invoke(Method.java:606)
	at org.junit.runners.model.FrameworkMethod$1.runReflectiveCall(FrameworkMethod.java:50)
	at org.junit.internal.runners.model.ReflectiveCallable.run(ReflectiveCallable.java:12)
	at org.junit.runners.model.FrameworkMethod.invokeExplosively(FrameworkMethod.java:47)
	at org.junit.internal.runners.statements.InvokeMethod.evaluate(InvokeMethod.java:17)
	at org.junit.internal.runners.statements.RunBefores.evaluate(RunBefores.java:26)
	at org.junit.runners.ParentRunner.runLeaf(ParentRunner.java:325)
	at org.junit.runners.BlockJUnit4ClassRunner.runChild(BlockJUnit4ClassRunner.java:78)
	at org.junit.runners.BlockJUnit4ClassRunner.runChild(BlockJUnit4ClassRunner.java:57)
	at org.junit.runners.ParentRunner$3.run(ParentRunner.java:290)
	at org.junit.runners.ParentRunner$1.schedule(ParentRunner.java:71)
	at org.junit.runners.ParentRunner.runChildren(ParentRunner.java:288)
	at org.junit.runners.ParentRunner.access$000(ParentRunner.java:58)
	at org.junit.runners.ParentRunner$2.evaluate(ParentRunner.java:268)
	at org.junit.runners.ParentRunner.run(ParentRunner.java:363)
	at org.apache.maven.surefire.junit4.JUnit4Provider.execute(JUnit4Provider.java:283)
	at org.apache.maven.surefire.junit4.JUnit4Provider.executeWithRerun(JUnit4Provider.java:173)
	at org.apache.maven.surefire.junit4.JUnit4Provider.executeTestSet(JUnit4Provider.java:153)
	at org.apache.maven.surefire.junit4.JUnit4Provider.invoke(JUnit4Provider.java:128)
	at org.apache.maven.surefire.booter.ForkedBooter.invokeProviderInSameClassLoader(ForkedBooter.java:203)
	at org.apache.maven.surefire.booter.ForkedBooter.runSuitesInProcess(ForkedBooter.java:155)
	at org.apache.maven.surefire.booter.ForkedBooter.main(ForkedBooter.java:103)

testUnlimitedArgs(org.apache.commons.cli.BasicParserTest)  Time elapsed: 0 sec  <<< ERROR!
org.apache.commons.cli.MissingArgumentException: Missing argument for option: e
	at org.apache.commons.cli.Parser.processArgs(Parser.java:68)
	at org.apache.commons.cli.Parser.processOption(Parser.java:73)
	at org.apache.commons.cli.Parser.parse(Parser.java:40)
	at org.apache.commons.cli.Parser.parse(Parser.java:23)
	at org.apache.commons.cli.ParserTestCase.testUnlimitedArgs(ParserTestCase.java:921)
	at sun.reflect.NativeMethodAccessorImpl.invoke0(Native Method)
	at sun.reflect.NativeMethodAccessorImpl.invoke(NativeMethodAccessorImpl.java:57)
	at sun.reflect.DelegatingMethodAccessorImpl.invoke(DelegatingMethodAccessorImpl.java:43)
	at java.lang.reflect.Method.invoke(Method.java:606)
	at org.junit.runners.model.FrameworkMethod$1.runReflectiveCall(FrameworkMethod.java:50)
	at org.junit.internal.runners.model.ReflectiveCallable.run(ReflectiveCallable.java:12)
	at org.junit.runners.model.FrameworkMethod.invokeExplosively(FrameworkMethod.java:47)
	at org.junit.internal.runners.statements.InvokeMethod.evaluate(InvokeMethod.java:17)
	at org.junit.internal.runners.statements.RunBefores.evaluate(RunBefores.java:26)
	at org.junit.runners.ParentRunner.runLeaf(ParentRunner.java:325)
	at org.junit.runners.BlockJUnit4ClassRunner.runChild(BlockJUnit4ClassRunner.java:78)
	at org.junit.runners.BlockJUnit4ClassRunner.runChild(BlockJUnit4ClassRunner.java:57)
	at org.junit.runners.ParentRunner$3.run(ParentRunner.java:290)
	at org.junit.runners.ParentRunner$1.schedule(ParentRunner.java:71)
	at org.junit.runners.ParentRunner.runChildren(ParentRunner.java:288)
	at org.junit.runners.ParentRunner.access$000(ParentRunner.java:58)
	at org.junit.runners.ParentRunner$2.evaluate(ParentRunner.java:268)
	at org.junit.runners.ParentRunner.run(ParentRunner.java:363)
	at org.apache.maven.surefire.junit4.JUnit4Provider.execute(JUnit4Provider.java:283)
	at org.apache.maven.surefire.junit4.JUnit4Provider.executeWithRerun(JUnit4Provider.java:173)
	at org.apache.maven.surefire.junit4.JUnit4Provider.executeTestSet(JUnit4Provider.java:153)
	at org.apache.maven.surefire.junit4.JUnit4Provider.invoke(JUnit4Provider.java:128)
	at org.apache.maven.surefire.booter.ForkedBooter.invokeProviderInSameClassLoader(ForkedBooter.java:203)
	at org.apache.maven.surefire.booter.ForkedBooter.runSuitesInProcess(ForkedBooter.java:155)
	at org.apache.maven.surefire.booter.ForkedBooter.main(ForkedBooter.java:103)

testOptionAndRequiredOption(org.apache.commons.cli.BasicParserTest)  Time elapsed: 0.001 sec  <<< ERROR!
org.apache.commons.cli.MissingArgumentException: Missing argument for option: b
	at org.apache.commons.cli.Parser.processArgs(Parser.java:68)
	at org.apache.commons.cli.Parser.processOption(Parser.java:73)
	at org.apache.commons.cli.Parser.parse(Parser.java:40)
	at org.apache.commons.cli.Parser.parse(Parser.java:23)
	at org.apache.commons.cli.ParserTestCase.testOptionAndRequiredOption(ParserTestCase.java:691)
	at sun.reflect.NativeMethodAccessorImpl.invoke0(Native Method)
	at sun.reflect.NativeMethodAccessorImpl.invoke(NativeMethodAccessorImpl.java:57)
	at sun.reflect.DelegatingMethodAccessorImpl.invoke(DelegatingMethodAccessorImpl.java:43)
	at java.lang.reflect.Method.invoke(Method.java:606)
	at org.junit.runners.model.FrameworkMethod$1.runReflectiveCall(FrameworkMethod.java:50)
	at org.junit.internal.runners.model.ReflectiveCallable.run(ReflectiveCallable.java:12)
	at org.junit.runners.model.FrameworkMethod.invokeExplosively(FrameworkMethod.java:47)
	at org.junit.internal.runners.statements.InvokeMethod.evaluate(InvokeMethod.java:17)
	at org.junit.internal.runners.statements.RunBefores.evaluate(RunBefores.java:26)
	at org.junit.runners.ParentRunner.runLeaf(ParentRunner.java:325)
	at org.junit.runners.BlockJUnit4ClassRunner.runChild(BlockJUnit4ClassRunner.java:78)
	at org.junit.runners.BlockJUnit4ClassRunner.runChild(BlockJUnit4ClassRunner.java:57)
	at org.junit.runners.ParentRunner$3.run(ParentRunner.java:290)
	at org.junit.runners.ParentRunner$1.schedule(ParentRunner.java:71)
	at org.junit.runners.ParentRunner.runChildren(ParentRunner.java:288)
	at org.junit.runners.ParentRunner.access$000(ParentRunner.java:58)
	at org.junit.runners.ParentRunner$2.evaluate(ParentRunner.java:268)
	at org.junit.runners.ParentRunner.run(ParentRunner.java:363)
	at org.apache.maven.surefire.junit4.JUnit4Provider.execute(JUnit4Provider.java:283)
	at org.apache.maven.surefire.junit4.JUnit4Provider.executeWithRerun(JUnit4Provider.java:173)
	at org.apache.maven.surefire.junit4.JUnit4Provider.executeTestSet(JUnit4Provider.java:153)
	at org.apache.maven.surefire.junit4.JUnit4Provider.invoke(JUnit4Provider.java:128)
	at org.apache.maven.surefire.booter.ForkedBooter.invokeProviderInSameClassLoader(ForkedBooter.java:203)
	at org.apache.maven.surefire.booter.ForkedBooter.runSuitesInProcess(ForkedBooter.java:155)
	at org.apache.maven.surefire.booter.ForkedBooter.main(ForkedBooter.java:103)

testMultiple(org.apache.commons.cli.BasicParserTest)  Time elapsed: 0.001 sec  <<< ERROR!
org.apache.commons.cli.MissingArgumentException: Missing argument for option: b
	at org.apache.commons.cli.Parser.processArgs(Parser.java:68)
	at org.apache.commons.cli.Parser.processOption(Parser.java:73)
	at org.apache.commons.cli.Parser.parse(Parser.java:40)
	at org.apache.commons.cli.Parser.parse(Parser.java:23)
	at org.apache.commons.cli.ParserTestCase.testMultiple(ParserTestCase.java:93)
	at sun.reflect.NativeMethodAccessorImpl.invoke0(Native Method)
	at sun.reflect.NativeMethodAccessorImpl.invoke(NativeMethodAccessorImpl.java:57)
	at sun.reflect.DelegatingMethodAccessorImpl.invoke(DelegatingMethodAccessorImpl.java:43)
	at java.lang.reflect.Method.invoke(Method.java:606)
	at org.junit.runners.model.FrameworkMethod$1.runReflectiveCall(FrameworkMethod.java:50)
	at org.junit.internal.runners.model.ReflectiveCallable.run(ReflectiveCallable.java:12)
	at org.junit.runners.model.FrameworkMethod.invokeExplosively(FrameworkMethod.java:47)
	at org.junit.internal.runners.statements.InvokeMethod.evaluate(InvokeMethod.java:17)
	at org.junit.internal.runners.statements.RunBefores.evaluate(RunBefores.java:26)
	at org.junit.runners.ParentRunner.runLeaf(ParentRunner.java:325)
	at org.junit.runners.BlockJUnit4ClassRunner.runChild(BlockJUnit4ClassRunner.java:78)
	at org.junit.runners.BlockJUnit4ClassRunner.runChild(BlockJUnit4ClassRunner.java:57)
	at org.junit.runners.ParentRunner$3.run(ParentRunner.java:290)
	at org.junit.runners.ParentRunner$1.schedule(ParentRunner.java:71)
	at org.junit.runners.ParentRunner.runChildren(ParentRunner.java:288)
	at org.junit.runners.ParentRunner.access$000(ParentRunner.java:58)
	at org.junit.runners.ParentRunner$2.evaluate(ParentRunner.java:268)
	at org.junit.runners.ParentRunner.run(ParentRunner.java:363)
	at org.apache.maven.surefire.junit4.JUnit4Provider.execute(JUnit4Provider.java:283)
	at org.apache.maven.surefire.junit4.JUnit4Provider.executeWithRerun(JUnit4Provider.java:173)
	at org.apache.maven.surefire.junit4.JUnit4Provider.executeTestSet(JUnit4Provider.java:153)
	at org.apache.maven.surefire.junit4.JUnit4Provider.invoke(JUnit4Provider.java:128)
	at org.apache.maven.surefire.booter.ForkedBooter.invokeProviderInSameClassLoader(ForkedBooter.java:203)
	at org.apache.maven.surefire.booter.ForkedBooter.runSuitesInProcess(ForkedBooter.java:155)
	at org.apache.maven.surefire.booter.ForkedBooter.main(ForkedBooter.java:103)

testArgumentStartingWithHyphen(org.apache.commons.cli.BasicParserTest)  Time elapsed: 0.001 sec  <<< ERROR!
org.apache.commons.cli.MissingArgumentException: Missing argument for option: b
	at org.apache.commons.cli.Parser.processArgs(Parser.java:68)
	at org.apache.commons.cli.Parser.processOption(Parser.java:73)
	at org.apache.commons.cli.Parser.parse(Parser.java:40)
	at org.apache.commons.cli.Parser.parse(Parser.java:23)
	at org.apache.commons.cli.ParserTestCase.testArgumentStartingWithHyphen(ParserTestCase.java:284)
	at sun.reflect.NativeMethodAccessorImpl.invoke0(Native Method)
	at sun.reflect.NativeMethodAccessorImpl.invoke(NativeMethodAccessorImpl.java:57)
	at sun.reflect.DelegatingMethodAccessorImpl.invoke(DelegatingMethodAccessorImpl.java:43)
	at java.lang.reflect.Method.invoke(Method.java:606)
	at org.junit.runners.model.FrameworkMethod$1.runReflectiveCall(FrameworkMethod.java:50)
	at org.junit.internal.runners.model.ReflectiveCallable.run(ReflectiveCallable.java:12)
	at org.junit.runners.model.FrameworkMethod.invokeExplosively(FrameworkMethod.java:47)
	at org.junit.internal.runners.statements.InvokeMethod.evaluate(InvokeMethod.java:17)
	at org.junit.internal.runners.statements.RunBefores.evaluate(RunBefores.java:26)
	at org.junit.runners.ParentRunner.runLeaf(ParentRunner.java:325)
	at org.junit.runners.BlockJUnit4ClassRunner.runChild(BlockJUnit4ClassRunner.java:78)
	at org.junit.runners.BlockJUnit4ClassRunner.runChild(BlockJUnit4ClassRunner.java:57)
	at org.junit.runners.ParentRunner$3.run(ParentRunner.java:290)
	at org.junit.runners.ParentRunner$1.schedule(ParentRunner.java:71)
	at org.junit.runners.ParentRunner.runChildren(ParentRunner.java:288)
	at org.junit.runners.ParentRunner.access$000(ParentRunner.java:58)
	at org.junit.runners.ParentRunner$2.evaluate(ParentRunner.java:268)
	at org.junit.runners.ParentRunner.run(ParentRunner.java:363)
	at org.apache.maven.surefire.junit4.JUnit4Provider.execute(JUnit4Provider.java:283)
	at org.apache.maven.surefire.junit4.JUnit4Provider.executeWithRerun(JUnit4Provider.java:173)
	at org.apache.maven.surefire.junit4.JUnit4Provider.executeTestSet(JUnit4Provider.java:153)
	at org.apache.maven.surefire.junit4.JUnit4Provider.invoke(JUnit4Provider.java:128)
	at org.apache.maven.surefire.booter.ForkedBooter.invokeProviderInSameClassLoader(ForkedBooter.java:203)
	at org.apache.maven.surefire.booter.ForkedBooter.runSuitesInProcess(ForkedBooter.java:155)
	at org.apache.maven.surefire.booter.ForkedBooter.main(ForkedBooter.java:103)

testStopAtExpectedArg(org.apache.commons.cli.BasicParserTest)  Time elapsed: 0.001 sec  <<< ERROR!
org.apache.commons.cli.MissingArgumentException: Missing argument for option: b
	at org.apache.commons.cli.Parser.processArgs(Parser.java:68)
	at org.apache.commons.cli.Parser.processOption(Parser.java:73)
	at org.apache.commons.cli.Parser.parse(Parser.java:40)
	at org.apache.commons.cli.Parser.parse(Parser.java:25)
	at org.apache.commons.cli.ParserTestCase.testStopAtExpectedArg(ParserTestCase.java:226)
	at sun.reflect.NativeMethodAccessorImpl.invoke0(Native Method)
	at sun.reflect.NativeMethodAccessorImpl.invoke(NativeMethodAccessorImpl.java:57)
	at sun.reflect.DelegatingMethodAccessorImpl.invoke(DelegatingMethodAccessorImpl.java:43)
	at java.lang.reflect.Method.invoke(Method.java:606)
	at org.junit.runners.model.FrameworkMethod$1.runReflectiveCall(FrameworkMethod.java:50)
	at org.junit.internal.runners.model.ReflectiveCallable.run(ReflectiveCallable.java:12)
	at org.junit.runners.model.FrameworkMethod.invokeExplosively(FrameworkMethod.java:47)
	at org.junit.internal.runners.statements.InvokeMethod.evaluate(InvokeMethod.java:17)
	at org.junit.internal.runners.statements.RunBefores.evaluate(RunBefores.java:26)
	at org.junit.runners.ParentRunner.runLeaf(ParentRunner.java:325)
	at org.junit.runners.BlockJUnit4ClassRunner.runChild(BlockJUnit4ClassRunner.java:78)
	at org.junit.runners.BlockJUnit4ClassRunner.runChild(BlockJUnit4ClassRunner.java:57)
	at org.junit.runners.ParentRunner$3.run(ParentRunner.java:290)
	at org.junit.runners.ParentRunner$1.schedule(ParentRunner.java:71)
	at org.junit.runners.ParentRunner.runChildren(ParentRunner.java:288)
	at org.junit.runners.ParentRunner.access$000(ParentRunner.java:58)
	at org.junit.runners.ParentRunner$2.evaluate(ParentRunner.java:268)
	at org.junit.runners.ParentRunner.run(ParentRunner.java:363)
	at org.apache.maven.surefire.junit4.JUnit4Provider.execute(JUnit4Provider.java:283)
	at org.apache.maven.surefire.junit4.JUnit4Provider.executeWithRerun(JUnit4Provider.java:173)
	at org.apache.maven.surefire.junit4.JUnit4Provider.executeTestSet(JUnit4Provider.java:153)
	at org.apache.maven.surefire.junit4.JUnit4Provider.invoke(JUnit4Provider.java:128)
	at org.apache.maven.surefire.booter.ForkedBooter.invokeProviderInSameClassLoader(ForkedBooter.java:203)
	at org.apache.maven.surefire.booter.ForkedBooter.runSuitesInProcess(ForkedBooter.java:155)
	at org.apache.maven.surefire.booter.ForkedBooter.main(ForkedBooter.java:103)

Running org.apache.commons.cli.ValueTest
Tests run: 12, Failures: 0, Errors: 12, Skipped: 0, Time elapsed: 0.01 sec <<< FAILURE! - in org.apache.commons.cli.ValueTest
testShortOptionalArgValues(org.apache.commons.cli.ValueTest)  Time elapsed: 0 sec  <<< ERROR!
org.apache.commons.cli.MissingArgumentException: Missing argument for option: b
	at org.apache.commons.cli.Parser.processArgs(Parser.java:68)
	at org.apache.commons.cli.Parser.processOption(Parser.java:73)
	at org.apache.commons.cli.Parser.parse(Parser.java:40)
	at org.apache.commons.cli.Parser.parse(Parser.java:23)
	at org.apache.commons.cli.ValueTest.setUp(ValueTest.java:56)

testLongOptionalArgValue(org.apache.commons.cli.ValueTest)  Time elapsed: 0 sec  <<< ERROR!
org.apache.commons.cli.MissingArgumentException: Missing argument for option: b
	at org.apache.commons.cli.Parser.processArgs(Parser.java:68)
	at org.apache.commons.cli.Parser.processOption(Parser.java:73)
	at org.apache.commons.cli.Parser.parse(Parser.java:40)
	at org.apache.commons.cli.Parser.parse(Parser.java:23)
	at org.apache.commons.cli.ValueTest.setUp(ValueTest.java:56)

testShortOptionalArgNoValue(org.apache.commons.cli.ValueTest)  Time elapsed: 0.001 sec  <<< ERROR!
org.apache.commons.cli.MissingArgumentException: Missing argument for option: b
	at org.apache.commons.cli.Parser.processArgs(Parser.java:68)
	at org.apache.commons.cli.Parser.processOption(Parser.java:73)
	at org.apache.commons.cli.Parser.parse(Parser.java:40)
	at org.apache.commons.cli.Parser.parse(Parser.java:23)
	at org.apache.commons.cli.ValueTest.setUp(ValueTest.java:56)

testLongWithArg(org.apache.commons.cli.ValueTest)  Time elapsed: 0.001 sec  <<< ERROR!
org.apache.commons.cli.MissingArgumentException: Missing argument for option: b
	at org.apache.commons.cli.Parser.processArgs(Parser.java:68)
	at org.apache.commons.cli.Parser.processOption(Parser.java:73)
	at org.apache.commons.cli.Parser.parse(Parser.java:40)
	at org.apache.commons.cli.Parser.parse(Parser.java:23)
	at org.apache.commons.cli.ValueTest.setUp(ValueTest.java:56)

testLongOptionalNArgValues(org.apache.commons.cli.ValueTest)  Time elapsed: 0.001 sec  <<< ERROR!
org.apache.commons.cli.MissingArgumentException: Missing argument for option: b
	at org.apache.commons.cli.Parser.processArgs(Parser.java:68)
	at org.apache.commons.cli.Parser.processOption(Parser.java:73)
	at org.apache.commons.cli.Parser.parse(Parser.java:40)
	at org.apache.commons.cli.Parser.parse(Parser.java:23)
	at org.apache.commons.cli.ValueTest.setUp(ValueTest.java:56)

testShortWithArg(org.apache.commons.cli.ValueTest)  Time elapsed: 0.001 sec  <<< ERROR!
org.apache.commons.cli.MissingArgumentException: Missing argument for option: b
	at org.apache.commons.cli.Parser.processArgs(Parser.java:68)
	at org.apache.commons.cli.Parser.processOption(Parser.java:73)
	at org.apache.commons.cli.Parser.parse(Parser.java:40)
	at org.apache.commons.cli.Parser.parse(Parser.java:23)
	at org.apache.commons.cli.ValueTest.setUp(ValueTest.java:56)

testLongOptionalArgValues(org.apache.commons.cli.ValueTest)  Time elapsed: 0.001 sec  <<< ERROR!
org.apache.commons.cli.MissingArgumentException: Missing argument for option: b
	at org.apache.commons.cli.Parser.processArgs(Parser.java:68)
	at org.apache.commons.cli.Parser.processOption(Parser.java:73)
	at org.apache.commons.cli.Parser.parse(Parser.java:40)
	at org.apache.commons.cli.Parser.parse(Parser.java:23)
	at org.apache.commons.cli.ValueTest.setUp(ValueTest.java:56)

testShortOptionalNArgValues(org.apache.commons.cli.ValueTest)  Time elapsed: 0.001 sec  <<< ERROR!
org.apache.commons.cli.MissingArgumentException: Missing argument for option: b
	at org.apache.commons.cli.Parser.processArgs(Parser.java:68)
	at org.apache.commons.cli.Parser.processOption(Parser.java:73)
	at org.apache.commons.cli.Parser.parse(Parser.java:40)
	at org.apache.commons.cli.Parser.parse(Parser.java:23)
	at org.apache.commons.cli.ValueTest.setUp(ValueTest.java:56)

testLongNoArg(org.apache.commons.cli.ValueTest)  Time elapsed: 0.001 sec  <<< ERROR!
org.apache.commons.cli.MissingArgumentException: Missing argument for option: b
	at org.apache.commons.cli.Parser.processArgs(Parser.java:68)
	at org.apache.commons.cli.Parser.processOption(Parser.java:73)
	at org.apache.commons.cli.Parser.parse(Parser.java:40)
	at org.apache.commons.cli.Parser.parse(Parser.java:23)
	at org.apache.commons.cli.ValueTest.setUp(ValueTest.java:56)

testShortNoArg(org.apache.commons.cli.ValueTest)  Time elapsed: 0.001 sec  <<< ERROR!
org.apache.commons.cli.MissingArgumentException: Missing argument for option: b
	at org.apache.commons.cli.Parser.processArgs(Parser.java:68)
	at org.apache.commons.cli.Parser.processOption(Parser.java:73)
	at org.apache.commons.cli.Parser.parse(Parser.java:40)
	at org.apache.commons.cli.Parser.parse(Parser.java:23)
	at org.apache.commons.cli.ValueTest.setUp(ValueTest.java:56)

testLongOptionalNoValue(org.apache.commons.cli.ValueTest)  Time elapsed: 0.001 sec  <<< ERROR!
org.apache.commons.cli.MissingArgumentException: Missing argument for option: b
	at org.apache.commons.cli.Parser.processArgs(Parser.java:68)
	at org.apache.commons.cli.Parser.processOption(Parser.java:73)
	at org.apache.commons.cli.Parser.parse(Parser.java:40)
	at org.apache.commons.cli.Parser.parse(Parser.java:23)
	at org.apache.commons.cli.ValueTest.setUp(ValueTest.java:56)

testShortOptionalArgValue(org.apache.commons.cli.ValueTest)  Time elapsed: 0.001 sec  <<< ERROR!
org.apache.commons.cli.MissingArgumentException: Missing argument for option: b
	at org.apache.commons.cli.Parser.processArgs(Parser.java:68)
	at org.apache.commons.cli.Parser.processOption(Parser.java:73)
	at org.apache.commons.cli.Parser.parse(Parser.java:40)
	at org.apache.commons.cli.Parser.parse(Parser.java:23)
	at org.apache.commons.cli.ValueTest.setUp(ValueTest.java:56)


Results :


Tests in error: 
  ApplicationTest.testAnt:97 » MissingArgument Missing argument for option: buil...
  ApplicationTest.testGroovy:175 » MissingArgument Missing argument for option: ...
  ApplicationTest.testLs:63 » MissingArgument Missing argument for option: block...
  ApplicationTest.testNLT:332 » MissingArgument Missing argument for option: l
  ArgumentIsOptionTest.testOptionAndOptionWithArgument:49 » MissingArgument Miss...
  ArgumentIsOptionTest.testOptionWithArgument:64 » MissingArgument Missing argum...
  BasicParserTest>ParserTestCase.testArgumentStartingWithHyphen:284 » MissingArgument
  BasicParserTest>ParserTestCase.testMultiple:93 » MissingArgument Missing argum...
  BasicParserTest>ParserTestCase.testMultipleWithLong:113 » MissingArgument Miss...
  BasicParserTest>ParserTestCase.testNegativeArgument:264 » MissingArgument Miss...
  BasicParserTest>ParserTestCase.testOptionAndRequiredOption:691 » MissingArgument
  BasicParserTest>ParserTestCase.testSimpleLong:73 » MissingArgument Missing arg...
  BasicParserTest>ParserTestCase.testSimpleShort:58 » MissingArgument Missing ar...
  BasicParserTest>ParserTestCase.testSingleDash:199 » MissingArgument Missing ar...
  BasicParserTest>ParserTestCase.testStopAtExpectedArg:226 » MissingArgument Mis...
  BasicParserTest>ParserTestCase.testUnlimitedArgs:921 » MissingArgument Missing...
  BasicParserTest>ParserTestCase.testWithRequiredOption:674 » MissingArgument Mi...
  CommandLineTest.testGetOptionProperties:40 » MissingArgument Missing argument ...
  GnuParserTest>ParserTestCase.testArgumentStartingWithHyphen:284 » MissingArgument
  GnuParserTest>ParserTestCase.testLongWithEqualDoubleDash:322 » MissingArgument
  GnuParserTest>ParserTestCase.testLongWithEqualSingleDash:335 » MissingArgument
  GnuParserTest>ParserTestCase.testMultiple:93 » MissingArgument Missing argumen...
  GnuParserTest>ParserTestCase.testMultipleWithLong:113 » MissingArgument Missin...
  GnuParserTest>ParserTestCase.testNegativeArgument:264 » MissingArgument Missin...
  GnuParserTest>ParserTestCase.testOptionAndRequiredOption:691 » MissingArgument
  GnuParserTest>ParserTestCase.testPropertiesOption1:453 » MissingArgument Missi...
  GnuParserTest>ParserTestCase.testPropertiesOption2:476 » MissingArgument Missi...
  GnuParserTest>ParserTestCase.testShortWithEqual:296 » MissingArgument Missing ...
  GnuParserTest>ParserTestCase.testShortWithoutEqual:309 » MissingArgument Missi...
  GnuParserTest>ParserTestCase.testSimpleLong:73 » MissingArgument Missing argum...
  GnuParserTest>ParserTestCase.testSimpleShort:58 » MissingArgument Missing argu...
  GnuParserTest>ParserTestCase.testSingleDash:199 » MissingArgument Missing argu...
  GnuParserTest>ParserTestCase.testStopAtExpectedArg:226 » MissingArgument Missi...
  GnuParserTest>ParserTestCase.testUnlimitedArgs:921 » MissingArgument Missing a...
  GnuParserTest>ParserTestCase.testWithRequiredOption:674 » MissingArgument Miss...
  PatternOptionBuilderTest.testClassPattern:130 » MissingArgument Missing argume...
  PatternOptionBuilderTest.testExistingFilePattern:164 » MissingArgument Missing...
  PatternOptionBuilderTest.testNumberPattern:114 » MissingArgument Missing argum...
  PatternOptionBuilderTest.testObjectPattern:141 » MissingArgument Missing argum...
  PatternOptionBuilderTest.testSimplePattern:47 » MissingArgument Missing argume...
  PatternOptionBuilderTest.testURLPattern:153 » MissingArgument Missing argument...
  PosixParserTest>ParserTestCase.testArgumentStartingWithHyphen:284 » MissingArgument
  PosixParserTest>ParserTestCase.testBursting:836 » MissingArgument Missing argu...
  PosixParserTest>ParserTestCase.testLongWithEqualDoubleDash:322 » MissingArgument
  PosixParserTest>ParserTestCase.testMultiple:93 » MissingArgument Missing argum...
  PosixParserTest>ParserTestCase.testMultipleWithLong:113 » MissingArgument Miss...
  PosixParserTest>ParserTestCase.testNegativeArgument:264 » MissingArgument Miss...
  PosixParserTest>ParserTestCase.testOptionAndRequiredOption:691 » MissingArgument
  PosixParserTest>ParserTestCase.testPropertiesOption1:453 » MissingArgument Mis...
  PosixParserTest>ParserTestCase.testPropertiesOption2:476 » MissingArgument Mis...
  PosixParserTest>ParserTestCase.testShortWithoutEqual:309 » MissingArgument Mis...
  PosixParserTest>ParserTestCase.testSimpleLong:73 » MissingArgument Missing arg...
  PosixParserTest>ParserTestCase.testSimpleShort:58 » MissingArgument Missing ar...
  PosixParserTest>ParserTestCase.testSingleDash:199 » MissingArgument Missing ar...
  PosixParserTest>ParserTestCase.testStopAtExpectedArg:226 » MissingArgument Mis...
  PosixParserTest>ParserTestCase.testStopBursting2:903 » MissingArgument Missing...
  PosixParserTest>ParserTestCase.testUnlimitedArgs:921 » MissingArgument Missing...
  PosixParserTest>ParserTestCase.testWithRequiredOption:674 » MissingArgument Mi...
  ValueTest.setUp:56 » MissingArgument Missing argument for option: b
  ValueTest.setUp:56 » MissingArgument Missing argument for option: b
  ValueTest.setUp:56 » MissingArgument Missing argument for option: b
  ValueTest.setUp:56 » MissingArgument Missing argument for option: b
  ValueTest.setUp:56 » MissingArgument Missing argument for option: b
  ValueTest.setUp:56 » MissingArgument Missing argument for option: b
  ValueTest.setUp:56 » MissingArgument Missing argument for option: b
  ValueTest.setUp:56 » MissingArgument Missing argument for option: b
  ValueTest.setUp:56 » MissingArgument Missing argument for option: b
  ValueTest.setUp:56 » MissingArgument Missing argument for option: b
  ValueTest.setUp:56 » MissingArgument Missing argument for option: b
  ValueTest.setUp:56 » MissingArgument Missing argument for option: b
  ValuesTest.setUp:70 » MissingArgument Missing argument for option: b
  ValuesTest.setUp:70 » MissingArgument Missing argument for option: b
  ValuesTest.setUp:70 » MissingArgument Missing argument for option: b
  ValuesTest.setUp:70 » MissingArgument Missing argument for option: b
  ValuesTest.setUp:70 » MissingArgument Missing argument for option: b
  ValuesTest.setUp:70 » MissingArgument Missing argument for option: b
  ValuesTest.setUp:70 » MissingArgument Missing argument for option: b
  BugCLI13Test.testCLI13:47 » MissingArgument Missing argument for option: d
  BugCLI148Test.testWorkaround1:52 » MissingArgument Missing argument for option...
  BugCLI148Test.testWorkaround2:62 » MissingArgument Missing argument for option...
  BugCLI71Test.testBasic:56 » MissingArgument Missing argument for option: a
  BugCLI71Test.testGetsDefaultIfOptional:86 » MissingArgument Missing argument f...
  BugCLI71Test.testMistakenArgument:64 » MissingArgument Missing argument for op...
  BugsTest.test11456:131 » MissingArgument Missing argument for option: a
  BugsTest.test11458:70 » MissingArgument Missing argument for option: D
  BugsTest.test11680:114 » MissingArgument Missing argument for option: f
  BugsTest.test15046:337 » MissingArgument Missing argument for option: z
  BugsTest.test15648:354 » MissingArgument Missing argument for option: m


Tests run: 424, Failures: 0, Errors: 88, Skipped: 0

[INFO] ------------------------------------------------------------------------
[INFO] BUILD FAILURE
[INFO] ------------------------------------------------------------------------
[INFO] Total time: 8.842s
[INFO] Finished at: Sun Aug 02 04:06:29 BST 2015
[INFO] Final Memory: 23M/290M
[INFO] ------------------------------------------------------------------------
[ERROR] Failed to execute goal org.apache.maven.plugins:maven-surefire-plugin:2.18:test (default-test) on project commons-cli: There are test failures.
[ERROR] 
[ERROR] Please refer to /home/perham/Study/LittleDarwin/Cases/commons-cli-1.3.1-src/target/surefire-reports for the individual test results.
[ERROR] -> [Help 1]
[ERROR] 
[ERROR] To see the full stack trace of the errors, re-run Maven with the -e switch.
[ERROR] Re-run Maven using the -X switch to enable full debug logging.
[ERROR] 
[ERROR] For more information about the errors and possible solutions, please read the following articles:
[ERROR] [Help 1] http://cwiki.apache.org/confluence/display/MAVEN/MojoFailureException
