[INFO] Scanning for projects...
[INFO]                                                                         
[INFO] ------------------------------------------------------------------------
[INFO] Building Apache Commons CLI 1.3.1
[INFO] ------------------------------------------------------------------------
[INFO] 
[INFO] --- maven-enforcer-plugin:1.3.1:enforce (enforce-maven-3) @ commons-cli ---
[INFO] 
[INFO] --- build-helper-maven-plugin:1.8:parse-version (parse-version) @ commons-cli ---
[INFO] 
[INFO] --- maven-antrun-plugin:1.7:run (javadoc.resources) @ commons-cli ---
[INFO] Executing tasks

main:
[INFO] Executed tasks
[INFO] 
[INFO] --- maven-remote-resources-plugin:1.5:process (default) @ commons-cli ---
[INFO] 
[INFO] --- buildnumber-maven-plugin:1.3:create (default) @ commons-cli ---
[INFO] Executing: /bin/sh -c cd /home/perham/Study/LittleDarwin/Cases/commons-cli-1.3.1-src && svn --non-interactive info
[INFO] Working directory: /home/perham/Study/LittleDarwin/Cases/commons-cli-1.3.1-src
[INFO] Storing buildNumber: ?????? at timestamp: 1438484620181
[INFO] Executing: /bin/sh -c cd /home/perham/Study/LittleDarwin/Cases/commons-cli-1.3.1-src && svn --non-interactive info
[INFO] Working directory: /home/perham/Study/LittleDarwin/Cases/commons-cli-1.3.1-src
[INFO] Storing buildScmBranch: UNKNOWN_BRANCH
[INFO] 
[INFO] --- maven-resources-plugin:2.7:resources (default-resources) @ commons-cli ---
[INFO] Using 'iso-8859-1' encoding to copy filtered resources.
[INFO] skip non existing resourceDirectory /home/perham/Study/LittleDarwin/Cases/commons-cli-1.3.1-src/src/main/resources
[INFO] Copying 2 resources to META-INF
[INFO] 
[INFO] --- maven-compiler-plugin:3.2:compile (default-compile) @ commons-cli ---
[INFO] Changes detected - recompiling the module!
[INFO] Compiling 23 source files to /home/perham/Study/LittleDarwin/Cases/commons-cli-1.3.1-src/target/classes
[INFO] /home/perham/Study/LittleDarwin/Cases/commons-cli-1.3.1-src/src/main/java/org/apache/commons/cli/Parser.java: Some input files use unchecked or unsafe operations.
[INFO] /home/perham/Study/LittleDarwin/Cases/commons-cli-1.3.1-src/src/main/java/org/apache/commons/cli/Parser.java: Recompile with -Xlint:unchecked for details.
[INFO] 
[INFO] --- maven-bundle-plugin:2.5.3:manifest (bundle-manifest) @ commons-cli ---
[INFO] 
[INFO] --- animal-sniffer-maven-plugin:1.13:check (checkAPIcompatibility) @ commons-cli ---
[INFO] Checking unresolved references to org.codehaus.mojo.signature:java15:1.0
[INFO] 
[INFO] --- maven-resources-plugin:2.7:testResources (default-testResources) @ commons-cli ---
[INFO] Using 'iso-8859-1' encoding to copy filtered resources.
[INFO] Copying 0 resource
[INFO] Copying 2 resources to META-INF
[INFO] 
[INFO] --- maven-compiler-plugin:3.2:testCompile (default-testCompile) @ commons-cli ---
[INFO] Nothing to compile - all classes are up to date
[INFO] 
[INFO] --- jacoco-maven-plugin:0.7.2.201409121644:prepare-agent (prepare-agent) @ commons-cli ---
[INFO] argLine set to -javaagent:/home/perham/.m2/repository/org/jacoco/org.jacoco.agent/0.7.2.201409121644/org.jacoco.agent-0.7.2.201409121644-runtime.jar=destfile=/home/perham/Study/LittleDarwin/Cases/commons-cli-1.3.1-src/target/jacoco.exec
[INFO] 
[INFO] --- maven-surefire-plugin:2.18:test (default-test) @ commons-cli ---
[INFO] Surefire report directory: /home/perham/Study/LittleDarwin/Cases/commons-cli-1.3.1-src/target/surefire-reports

-------------------------------------------------------
 T E S T S
-------------------------------------------------------
Running org.apache.commons.cli.ArgumentIsOptionTest
Tests run: 3, Failures: 0, Errors: 0, Skipped: 0, Time elapsed: 0.017 sec - in org.apache.commons.cli.ArgumentIsOptionTest
Running org.apache.commons.cli.DefaultParserTest
Tests run: 58, Failures: 0, Errors: 11, Skipped: 0, Time elapsed: 0.205 sec <<< FAILURE! - in org.apache.commons.cli.DefaultParserTest
testOptionGroupLong(org.apache.commons.cli.DefaultParserTest)  Time elapsed: 0.056 sec  <<< ERROR!
java.lang.NullPointerException: null
	at org.apache.commons.cli.OptionValidator.validateOption(OptionValidator.java:10)
	at org.apache.commons.cli.Option.<init>(Option.java:146)
	at org.apache.commons.cli.Option.<init>(Option.java:113)
	at org.apache.commons.cli.OptionBuilder.create(OptionBuilder.java:376)
	at org.apache.commons.cli.OptionBuilder.create(OptionBuilder.java:357)
	at org.apache.commons.cli.ParserTestCase.testOptionGroupLong(ParserTestCase.java:798)
	at sun.reflect.NativeMethodAccessorImpl.invoke0(Native Method)
	at sun.reflect.NativeMethodAccessorImpl.invoke(NativeMethodAccessorImpl.java:57)
	at sun.reflect.DelegatingMethodAccessorImpl.invoke(DelegatingMethodAccessorImpl.java:43)
	at java.lang.reflect.Method.invoke(Method.java:606)
	at org.junit.runners.model.FrameworkMethod$1.runReflectiveCall(FrameworkMethod.java:50)
	at org.junit.internal.runners.model.ReflectiveCallable.run(ReflectiveCallable.java:12)
	at org.junit.runners.model.FrameworkMethod.invokeExplosively(FrameworkMethod.java:47)
	at org.junit.internal.runners.statements.InvokeMethod.evaluate(InvokeMethod.java:17)
	at org.junit.internal.runners.statements.RunBefores.evaluate(RunBefores.java:26)
	at org.junit.runners.ParentRunner.runLeaf(ParentRunner.java:325)
	at org.junit.runners.BlockJUnit4ClassRunner.runChild(BlockJUnit4ClassRunner.java:78)
	at org.junit.runners.BlockJUnit4ClassRunner.runChild(BlockJUnit4ClassRunner.java:57)
	at org.junit.runners.ParentRunner$3.run(ParentRunner.java:290)
	at org.junit.runners.ParentRunner$1.schedule(ParentRunner.java:71)
	at org.junit.runners.ParentRunner.runChildren(ParentRunner.java:288)
	at org.junit.runners.ParentRunner.access$000(ParentRunner.java:58)
	at org.junit.runners.ParentRunner$2.evaluate(ParentRunner.java:268)
	at org.junit.runners.ParentRunner.run(ParentRunner.java:363)
	at org.apache.maven.surefire.junit4.JUnit4Provider.execute(JUnit4Provider.java:283)
	at org.apache.maven.surefire.junit4.JUnit4Provider.executeWithRerun(JUnit4Provider.java:173)
	at org.apache.maven.surefire.junit4.JUnit4Provider.executeTestSet(JUnit4Provider.java:153)
	at org.apache.maven.surefire.junit4.JUnit4Provider.invoke(JUnit4Provider.java:128)
	at org.apache.maven.surefire.booter.ForkedBooter.invokeProviderInSameClassLoader(ForkedBooter.java:203)
	at org.apache.maven.surefire.booter.ForkedBooter.runSuitesInProcess(ForkedBooter.java:155)
	at org.apache.maven.surefire.booter.ForkedBooter.main(ForkedBooter.java:103)

testPartialLongOptionSingleDash(org.apache.commons.cli.DefaultParserTest)  Time elapsed: 0.005 sec  <<< ERROR!
java.lang.NullPointerException: null
	at org.apache.commons.cli.OptionValidator.validateOption(OptionValidator.java:10)
	at org.apache.commons.cli.Option.<init>(Option.java:146)
	at org.apache.commons.cli.Option.<init>(Option.java:113)
	at org.apache.commons.cli.OptionBuilder.create(OptionBuilder.java:376)
	at org.apache.commons.cli.OptionBuilder.create(OptionBuilder.java:357)
	at org.apache.commons.cli.ParserTestCase.testPartialLongOptionSingleDash(ParserTestCase.java:656)
	at sun.reflect.NativeMethodAccessorImpl.invoke0(Native Method)
	at sun.reflect.NativeMethodAccessorImpl.invoke(NativeMethodAccessorImpl.java:57)
	at sun.reflect.DelegatingMethodAccessorImpl.invoke(DelegatingMethodAccessorImpl.java:43)
	at java.lang.reflect.Method.invoke(Method.java:606)
	at org.junit.runners.model.FrameworkMethod$1.runReflectiveCall(FrameworkMethod.java:50)
	at org.junit.internal.runners.model.ReflectiveCallable.run(ReflectiveCallable.java:12)
	at org.junit.runners.model.FrameworkMethod.invokeExplosively(FrameworkMethod.java:47)
	at org.junit.internal.runners.statements.InvokeMethod.evaluate(InvokeMethod.java:17)
	at org.junit.internal.runners.statements.RunBefores.evaluate(RunBefores.java:26)
	at org.junit.runners.ParentRunner.runLeaf(ParentRunner.java:325)
	at org.junit.runners.BlockJUnit4ClassRunner.runChild(BlockJUnit4ClassRunner.java:78)
	at org.junit.runners.BlockJUnit4ClassRunner.runChild(BlockJUnit4ClassRunner.java:57)
	at org.junit.runners.ParentRunner$3.run(ParentRunner.java:290)
	at org.junit.runners.ParentRunner$1.schedule(ParentRunner.java:71)
	at org.junit.runners.ParentRunner.runChildren(ParentRunner.java:288)
	at org.junit.runners.ParentRunner.access$000(ParentRunner.java:58)
	at org.junit.runners.ParentRunner$2.evaluate(ParentRunner.java:268)
	at org.junit.runners.ParentRunner.run(ParentRunner.java:363)
	at org.apache.maven.surefire.junit4.JUnit4Provider.execute(JUnit4Provider.java:283)
	at org.apache.maven.surefire.junit4.JUnit4Provider.executeWithRerun(JUnit4Provider.java:173)
	at org.apache.maven.surefire.junit4.JUnit4Provider.executeTestSet(JUnit4Provider.java:153)
	at org.apache.maven.surefire.junit4.JUnit4Provider.invoke(JUnit4Provider.java:128)
	at org.apache.maven.surefire.booter.ForkedBooter.invokeProviderInSameClassLoader(ForkedBooter.java:203)
	at org.apache.maven.surefire.booter.ForkedBooter.runSuitesInProcess(ForkedBooter.java:155)
	at org.apache.maven.surefire.booter.ForkedBooter.main(ForkedBooter.java:103)

testPropertyOptionSingularValue(org.apache.commons.cli.DefaultParserTest)  Time elapsed: 0.005 sec  <<< ERROR!
java.lang.NullPointerException: null
	at org.apache.commons.cli.OptionValidator.validateOption(OptionValidator.java:10)
	at org.apache.commons.cli.Option.<init>(Option.java:146)
	at org.apache.commons.cli.Option.<init>(Option.java:113)
	at org.apache.commons.cli.OptionBuilder.create(OptionBuilder.java:376)
	at org.apache.commons.cli.OptionBuilder.create(OptionBuilder.java:357)
	at org.apache.commons.cli.ParserTestCase.testPropertyOptionSingularValue(ParserTestCase.java:944)
	at sun.reflect.NativeMethodAccessorImpl.invoke0(Native Method)
	at sun.reflect.NativeMethodAccessorImpl.invoke(NativeMethodAccessorImpl.java:57)
	at sun.reflect.DelegatingMethodAccessorImpl.invoke(DelegatingMethodAccessorImpl.java:43)
	at java.lang.reflect.Method.invoke(Method.java:606)
	at org.junit.runners.model.FrameworkMethod$1.runReflectiveCall(FrameworkMethod.java:50)
	at org.junit.internal.runners.model.ReflectiveCallable.run(ReflectiveCallable.java:12)
	at org.junit.runners.model.FrameworkMethod.invokeExplosively(FrameworkMethod.java:47)
	at org.junit.internal.runners.statements.InvokeMethod.evaluate(InvokeMethod.java:17)
	at org.junit.internal.runners.statements.RunBefores.evaluate(RunBefores.java:26)
	at org.junit.runners.ParentRunner.runLeaf(ParentRunner.java:325)
	at org.junit.runners.BlockJUnit4ClassRunner.runChild(BlockJUnit4ClassRunner.java:78)
	at org.junit.runners.BlockJUnit4ClassRunner.runChild(BlockJUnit4ClassRunner.java:57)
	at org.junit.runners.ParentRunner$3.run(ParentRunner.java:290)
	at org.junit.runners.ParentRunner$1.schedule(ParentRunner.java:71)
	at org.junit.runners.ParentRunner.runChildren(ParentRunner.java:288)
	at org.junit.runners.ParentRunner.access$000(ParentRunner.java:58)
	at org.junit.runners.ParentRunner$2.evaluate(ParentRunner.java:268)
	at org.junit.runners.ParentRunner.run(ParentRunner.java:363)
	at org.apache.maven.surefire.junit4.JUnit4Provider.execute(JUnit4Provider.java:283)
	at org.apache.maven.surefire.junit4.JUnit4Provider.executeWithRerun(JUnit4Provider.java:173)
	at org.apache.maven.surefire.junit4.JUnit4Provider.executeTestSet(JUnit4Provider.java:153)
	at org.apache.maven.surefire.junit4.JUnit4Provider.invoke(JUnit4Provider.java:128)
	at org.apache.maven.surefire.booter.ForkedBooter.invokeProviderInSameClassLoader(ForkedBooter.java:203)
	at org.apache.maven.surefire.booter.ForkedBooter.runSuitesInProcess(ForkedBooter.java:155)
	at org.apache.maven.surefire.booter.ForkedBooter.main(ForkedBooter.java:103)

testAmbiguousPartialLongOption1(org.apache.commons.cli.DefaultParserTest)  Time elapsed: 0.005 sec  <<< ERROR!
java.lang.NullPointerException: null
	at org.apache.commons.cli.OptionValidator.validateOption(OptionValidator.java:10)
	at org.apache.commons.cli.Option.<init>(Option.java:146)
	at org.apache.commons.cli.Option.<init>(Option.java:113)
	at org.apache.commons.cli.OptionBuilder.create(OptionBuilder.java:376)
	at org.apache.commons.cli.OptionBuilder.create(OptionBuilder.java:357)
	at org.apache.commons.cli.ParserTestCase.testAmbiguousPartialLongOption1(ParserTestCase.java:552)
	at sun.reflect.NativeMethodAccessorImpl.invoke0(Native Method)
	at sun.reflect.NativeMethodAccessorImpl.invoke(NativeMethodAccessorImpl.java:57)
	at sun.reflect.DelegatingMethodAccessorImpl.invoke(DelegatingMethodAccessorImpl.java:43)
	at java.lang.reflect.Method.invoke(Method.java:606)
	at org.junit.runners.model.FrameworkMethod$1.runReflectiveCall(FrameworkMethod.java:50)
	at org.junit.internal.runners.model.ReflectiveCallable.run(ReflectiveCallable.java:12)
	at org.junit.runners.model.FrameworkMethod.invokeExplosively(FrameworkMethod.java:47)
	at org.junit.internal.runners.statements.InvokeMethod.evaluate(InvokeMethod.java:17)
	at org.junit.internal.runners.statements.RunBefores.evaluate(RunBefores.java:26)
	at org.junit.runners.ParentRunner.runLeaf(ParentRunner.java:325)
	at org.junit.runners.BlockJUnit4ClassRunner.runChild(BlockJUnit4ClassRunner.java:78)
	at org.junit.runners.BlockJUnit4ClassRunner.runChild(BlockJUnit4ClassRunner.java:57)
	at org.junit.runners.ParentRunner$3.run(ParentRunner.java:290)
	at org.junit.runners.ParentRunner$1.schedule(ParentRunner.java:71)
	at org.junit.runners.ParentRunner.runChildren(ParentRunner.java:288)
	at org.junit.runners.ParentRunner.access$000(ParentRunner.java:58)
	at org.junit.runners.ParentRunner$2.evaluate(ParentRunner.java:268)
	at org.junit.runners.ParentRunner.run(ParentRunner.java:363)
	at org.apache.maven.surefire.junit4.JUnit4Provider.execute(JUnit4Provider.java:283)
	at org.apache.maven.surefire.junit4.JUnit4Provider.executeWithRerun(JUnit4Provider.java:173)
	at org.apache.maven.surefire.junit4.JUnit4Provider.executeTestSet(JUnit4Provider.java:153)
	at org.apache.maven.surefire.junit4.JUnit4Provider.invoke(JUnit4Provider.java:128)
	at org.apache.maven.surefire.booter.ForkedBooter.invokeProviderInSameClassLoader(ForkedBooter.java:203)
	at org.apache.maven.surefire.booter.ForkedBooter.runSuitesInProcess(ForkedBooter.java:155)
	at org.apache.maven.surefire.booter.ForkedBooter.main(ForkedBooter.java:103)

testAmbiguousPartialLongOption2(org.apache.commons.cli.DefaultParserTest)  Time elapsed: 0.005 sec  <<< ERROR!
java.lang.NullPointerException: null
	at org.apache.commons.cli.OptionValidator.validateOption(OptionValidator.java:10)
	at org.apache.commons.cli.Option.<init>(Option.java:146)
	at org.apache.commons.cli.Option.<init>(Option.java:113)
	at org.apache.commons.cli.OptionBuilder.create(OptionBuilder.java:376)
	at org.apache.commons.cli.OptionBuilder.create(OptionBuilder.java:357)
	at org.apache.commons.cli.ParserTestCase.testAmbiguousPartialLongOption2(ParserTestCase.java:578)
	at sun.reflect.NativeMethodAccessorImpl.invoke0(Native Method)
	at sun.reflect.NativeMethodAccessorImpl.invoke(NativeMethodAccessorImpl.java:57)
	at sun.reflect.DelegatingMethodAccessorImpl.invoke(DelegatingMethodAccessorImpl.java:43)
	at java.lang.reflect.Method.invoke(Method.java:606)
	at org.junit.runners.model.FrameworkMethod$1.runReflectiveCall(FrameworkMethod.java:50)
	at org.junit.internal.runners.model.ReflectiveCallable.run(ReflectiveCallable.java:12)
	at org.junit.runners.model.FrameworkMethod.invokeExplosively(FrameworkMethod.java:47)
	at org.junit.internal.runners.statements.InvokeMethod.evaluate(InvokeMethod.java:17)
	at org.junit.internal.runners.statements.RunBefores.evaluate(RunBefores.java:26)
	at org.junit.runners.ParentRunner.runLeaf(ParentRunner.java:325)
	at org.junit.runners.BlockJUnit4ClassRunner.runChild(BlockJUnit4ClassRunner.java:78)
	at org.junit.runners.BlockJUnit4ClassRunner.runChild(BlockJUnit4ClassRunner.java:57)
	at org.junit.runners.ParentRunner$3.run(ParentRunner.java:290)
	at org.junit.runners.ParentRunner$1.schedule(ParentRunner.java:71)
	at org.junit.runners.ParentRunner.runChildren(ParentRunner.java:288)
	at org.junit.runners.ParentRunner.access$000(ParentRunner.java:58)
	at org.junit.runners.ParentRunner$2.evaluate(ParentRunner.java:268)
	at org.junit.runners.ParentRunner.run(ParentRunner.java:363)
	at org.apache.maven.surefire.junit4.JUnit4Provider.execute(JUnit4Provider.java:283)
	at org.apache.maven.surefire.junit4.JUnit4Provider.executeWithRerun(JUnit4Provider.java:173)
	at org.apache.maven.surefire.junit4.JUnit4Provider.executeTestSet(JUnit4Provider.java:153)
	at org.apache.maven.surefire.junit4.JUnit4Provider.invoke(JUnit4Provider.java:128)
	at org.apache.maven.surefire.booter.ForkedBooter.invokeProviderInSameClassLoader(ForkedBooter.java:203)
	at org.apache.maven.surefire.booter.ForkedBooter.runSuitesInProcess(ForkedBooter.java:155)
	at org.apache.maven.surefire.booter.ForkedBooter.main(ForkedBooter.java:103)

testAmbiguousPartialLongOption3(org.apache.commons.cli.DefaultParserTest)  Time elapsed: 0.005 sec  <<< ERROR!
java.lang.NullPointerException: null
	at org.apache.commons.cli.OptionValidator.validateOption(OptionValidator.java:10)
	at org.apache.commons.cli.Option.<init>(Option.java:146)
	at org.apache.commons.cli.Option.<init>(Option.java:113)
	at org.apache.commons.cli.OptionBuilder.create(OptionBuilder.java:376)
	at org.apache.commons.cli.OptionBuilder.create(OptionBuilder.java:357)
	at org.apache.commons.cli.ParserTestCase.testAmbiguousPartialLongOption3(ParserTestCase.java:604)
	at sun.reflect.NativeMethodAccessorImpl.invoke0(Native Method)
	at sun.reflect.NativeMethodAccessorImpl.invoke(NativeMethodAccessorImpl.java:57)
	at sun.reflect.DelegatingMethodAccessorImpl.invoke(DelegatingMethodAccessorImpl.java:43)
	at java.lang.reflect.Method.invoke(Method.java:606)
	at org.junit.runners.model.FrameworkMethod$1.runReflectiveCall(FrameworkMethod.java:50)
	at org.junit.internal.runners.model.ReflectiveCallable.run(ReflectiveCallable.java:12)
	at org.junit.runners.model.FrameworkMethod.invokeExplosively(FrameworkMethod.java:47)
	at org.junit.internal.runners.statements.InvokeMethod.evaluate(InvokeMethod.java:17)
	at org.junit.internal.runners.statements.RunBefores.evaluate(RunBefores.java:26)
	at org.junit.runners.ParentRunner.runLeaf(ParentRunner.java:325)
	at org.junit.runners.BlockJUnit4ClassRunner.runChild(BlockJUnit4ClassRunner.java:78)
	at org.junit.runners.BlockJUnit4ClassRunner.runChild(BlockJUnit4ClassRunner.java:57)
	at org.junit.runners.ParentRunner$3.run(ParentRunner.java:290)
	at org.junit.runners.ParentRunner$1.schedule(ParentRunner.java:71)
	at org.junit.runners.ParentRunner.runChildren(ParentRunner.java:288)
	at org.junit.runners.ParentRunner.access$000(ParentRunner.java:58)
	at org.junit.runners.ParentRunner$2.evaluate(ParentRunner.java:268)
	at org.junit.runners.ParentRunner.run(ParentRunner.java:363)
	at org.apache.maven.surefire.junit4.JUnit4Provider.execute(JUnit4Provider.java:283)
	at org.apache.maven.surefire.junit4.JUnit4Provider.executeWithRerun(JUnit4Provider.java:173)
	at org.apache.maven.surefire.junit4.JUnit4Provider.executeTestSet(JUnit4Provider.java:153)
	at org.apache.maven.surefire.junit4.JUnit4Provider.invoke(JUnit4Provider.java:128)
	at org.apache.maven.surefire.booter.ForkedBooter.invokeProviderInSameClassLoader(ForkedBooter.java:203)
	at org.apache.maven.surefire.booter.ForkedBooter.runSuitesInProcess(ForkedBooter.java:155)
	at org.apache.maven.surefire.booter.ForkedBooter.main(ForkedBooter.java:103)

testAmbiguousPartialLongOption4(org.apache.commons.cli.DefaultParserTest)  Time elapsed: 0.004 sec  <<< ERROR!
java.lang.NullPointerException: null
	at org.apache.commons.cli.OptionValidator.validateOption(OptionValidator.java:10)
	at org.apache.commons.cli.Option.<init>(Option.java:146)
	at org.apache.commons.cli.Option.<init>(Option.java:113)
	at org.apache.commons.cli.OptionBuilder.create(OptionBuilder.java:376)
	at org.apache.commons.cli.OptionBuilder.create(OptionBuilder.java:357)
	at org.apache.commons.cli.ParserTestCase.testAmbiguousPartialLongOption4(ParserTestCase.java:630)
	at sun.reflect.NativeMethodAccessorImpl.invoke0(Native Method)
	at sun.reflect.NativeMethodAccessorImpl.invoke(NativeMethodAccessorImpl.java:57)
	at sun.reflect.DelegatingMethodAccessorImpl.invoke(DelegatingMethodAccessorImpl.java:43)
	at java.lang.reflect.Method.invoke(Method.java:606)
	at org.junit.runners.model.FrameworkMethod$1.runReflectiveCall(FrameworkMethod.java:50)
	at org.junit.internal.runners.model.ReflectiveCallable.run(ReflectiveCallable.java:12)
	at org.junit.runners.model.FrameworkMethod.invokeExplosively(FrameworkMethod.java:47)
	at org.junit.internal.runners.statements.InvokeMethod.evaluate(InvokeMethod.java:17)
	at org.junit.internal.runners.statements.RunBefores.evaluate(RunBefores.java:26)
	at org.junit.runners.ParentRunner.runLeaf(ParentRunner.java:325)
	at org.junit.runners.BlockJUnit4ClassRunner.runChild(BlockJUnit4ClassRunner.java:78)
	at org.junit.runners.BlockJUnit4ClassRunner.runChild(BlockJUnit4ClassRunner.java:57)
	at org.junit.runners.ParentRunner$3.run(ParentRunner.java:290)
	at org.junit.runners.ParentRunner$1.schedule(ParentRunner.java:71)
	at org.junit.runners.ParentRunner.runChildren(ParentRunner.java:288)
	at org.junit.runners.ParentRunner.access$000(ParentRunner.java:58)
	at org.junit.runners.ParentRunner$2.evaluate(ParentRunner.java:268)
	at org.junit.runners.ParentRunner.run(ParentRunner.java:363)
	at org.apache.maven.surefire.junit4.JUnit4Provider.execute(JUnit4Provider.java:283)
	at org.apache.maven.surefire.junit4.JUnit4Provider.executeWithRerun(JUnit4Provider.java:173)
	at org.apache.maven.surefire.junit4.JUnit4Provider.executeTestSet(JUnit4Provider.java:153)
	at org.apache.maven.surefire.junit4.JUnit4Provider.invoke(JUnit4Provider.java:128)
	at org.apache.maven.surefire.booter.ForkedBooter.invokeProviderInSameClassLoader(ForkedBooter.java:203)
	at org.apache.maven.surefire.booter.ForkedBooter.runSuitesInProcess(ForkedBooter.java:155)
	at org.apache.maven.surefire.booter.ForkedBooter.main(ForkedBooter.java:103)

testUnambiguousPartialLongOption1(org.apache.commons.cli.DefaultParserTest)  Time elapsed: 0.004 sec  <<< ERROR!
java.lang.NullPointerException: null
	at org.apache.commons.cli.OptionValidator.validateOption(OptionValidator.java:10)
	at org.apache.commons.cli.Option.<init>(Option.java:146)
	at org.apache.commons.cli.Option.<init>(Option.java:113)
	at org.apache.commons.cli.OptionBuilder.create(OptionBuilder.java:376)
	at org.apache.commons.cli.OptionBuilder.create(OptionBuilder.java:357)
	at org.apache.commons.cli.ParserTestCase.testUnambiguousPartialLongOption1(ParserTestCase.java:494)
	at sun.reflect.NativeMethodAccessorImpl.invoke0(Native Method)
	at sun.reflect.NativeMethodAccessorImpl.invoke(NativeMethodAccessorImpl.java:57)
	at sun.reflect.DelegatingMethodAccessorImpl.invoke(DelegatingMethodAccessorImpl.java:43)
	at java.lang.reflect.Method.invoke(Method.java:606)
	at org.junit.runners.model.FrameworkMethod$1.runReflectiveCall(FrameworkMethod.java:50)
	at org.junit.internal.runners.model.ReflectiveCallable.run(ReflectiveCallable.java:12)
	at org.junit.runners.model.FrameworkMethod.invokeExplosively(FrameworkMethod.java:47)
	at org.junit.internal.runners.statements.InvokeMethod.evaluate(InvokeMethod.java:17)
	at org.junit.internal.runners.statements.RunBefores.evaluate(RunBefores.java:26)
	at org.junit.runners.ParentRunner.runLeaf(ParentRunner.java:325)
	at org.junit.runners.BlockJUnit4ClassRunner.runChild(BlockJUnit4ClassRunner.java:78)
	at org.junit.runners.BlockJUnit4ClassRunner.runChild(BlockJUnit4ClassRunner.java:57)
	at org.junit.runners.ParentRunner$3.run(ParentRunner.java:290)
	at org.junit.runners.ParentRunner$1.schedule(ParentRunner.java:71)
	at org.junit.runners.ParentRunner.runChildren(ParentRunner.java:288)
	at org.junit.runners.ParentRunner.access$000(ParentRunner.java:58)
	at org.junit.runners.ParentRunner$2.evaluate(ParentRunner.java:268)
	at org.junit.runners.ParentRunner.run(ParentRunner.java:363)
	at org.apache.maven.surefire.junit4.JUnit4Provider.execute(JUnit4Provider.java:283)
	at org.apache.maven.surefire.junit4.JUnit4Provider.executeWithRerun(JUnit4Provider.java:173)
	at org.apache.maven.surefire.junit4.JUnit4Provider.executeTestSet(JUnit4Provider.java:153)
	at org.apache.maven.surefire.junit4.JUnit4Provider.invoke(JUnit4Provider.java:128)
	at org.apache.maven.surefire.booter.ForkedBooter.invokeProviderInSameClassLoader(ForkedBooter.java:203)
	at org.apache.maven.surefire.booter.ForkedBooter.runSuitesInProcess(ForkedBooter.java:155)
	at org.apache.maven.surefire.booter.ForkedBooter.main(ForkedBooter.java:103)

testUnambiguousPartialLongOption2(org.apache.commons.cli.DefaultParserTest)  Time elapsed: 0.005 sec  <<< ERROR!
java.lang.NullPointerException: null
	at org.apache.commons.cli.OptionValidator.validateOption(OptionValidator.java:10)
	at org.apache.commons.cli.Option.<init>(Option.java:146)
	at org.apache.commons.cli.Option.<init>(Option.java:113)
	at org.apache.commons.cli.OptionBuilder.create(OptionBuilder.java:376)
	at org.apache.commons.cli.OptionBuilder.create(OptionBuilder.java:357)
	at org.apache.commons.cli.ParserTestCase.testUnambiguousPartialLongOption2(ParserTestCase.java:508)
	at sun.reflect.NativeMethodAccessorImpl.invoke0(Native Method)
	at sun.reflect.NativeMethodAccessorImpl.invoke(NativeMethodAccessorImpl.java:57)
	at sun.reflect.DelegatingMethodAccessorImpl.invoke(DelegatingMethodAccessorImpl.java:43)
	at java.lang.reflect.Method.invoke(Method.java:606)
	at org.junit.runners.model.FrameworkMethod$1.runReflectiveCall(FrameworkMethod.java:50)
	at org.junit.internal.runners.model.ReflectiveCallable.run(ReflectiveCallable.java:12)
	at org.junit.runners.model.FrameworkMethod.invokeExplosively(FrameworkMethod.java:47)
	at org.junit.internal.runners.statements.InvokeMethod.evaluate(InvokeMethod.java:17)
	at org.junit.internal.runners.statements.RunBefores.evaluate(RunBefores.java:26)
	at org.junit.runners.ParentRunner.runLeaf(ParentRunner.java:325)
	at org.junit.runners.BlockJUnit4ClassRunner.runChild(BlockJUnit4ClassRunner.java:78)
	at org.junit.runners.BlockJUnit4ClassRunner.runChild(BlockJUnit4ClassRunner.java:57)
	at org.junit.runners.ParentRunner$3.run(ParentRunner.java:290)
	at org.junit.runners.ParentRunner$1.schedule(ParentRunner.java:71)
	at org.junit.runners.ParentRunner.runChildren(ParentRunner.java:288)
	at org.junit.runners.ParentRunner.access$000(ParentRunner.java:58)
	at org.junit.runners.ParentRunner$2.evaluate(ParentRunner.java:268)
	at org.junit.runners.ParentRunner.run(ParentRunner.java:363)
	at org.apache.maven.surefire.junit4.JUnit4Provider.execute(JUnit4Provider.java:283)
	at org.apache.maven.surefire.junit4.JUnit4Provider.executeWithRerun(JUnit4Provider.java:173)
	at org.apache.maven.surefire.junit4.JUnit4Provider.executeTestSet(JUnit4Provider.java:153)
	at org.apache.maven.surefire.junit4.JUnit4Provider.invoke(JUnit4Provider.java:128)
	at org.apache.maven.surefire.booter.ForkedBooter.invokeProviderInSameClassLoader(ForkedBooter.java:203)
	at org.apache.maven.surefire.booter.ForkedBooter.runSuitesInProcess(ForkedBooter.java:155)
	at org.apache.maven.surefire.booter.ForkedBooter.main(ForkedBooter.java:103)

testUnambiguousPartialLongOption3(org.apache.commons.cli.DefaultParserTest)  Time elapsed: 0.004 sec  <<< ERROR!
java.lang.NullPointerException: null
	at org.apache.commons.cli.OptionValidator.validateOption(OptionValidator.java:10)
	at org.apache.commons.cli.Option.<init>(Option.java:146)
	at org.apache.commons.cli.Option.<init>(Option.java:113)
	at org.apache.commons.cli.OptionBuilder.create(OptionBuilder.java:376)
	at org.apache.commons.cli.OptionBuilder.create(OptionBuilder.java:357)
	at org.apache.commons.cli.ParserTestCase.testUnambiguousPartialLongOption3(ParserTestCase.java:522)
	at sun.reflect.NativeMethodAccessorImpl.invoke0(Native Method)
	at sun.reflect.NativeMethodAccessorImpl.invoke(NativeMethodAccessorImpl.java:57)
	at sun.reflect.DelegatingMethodAccessorImpl.invoke(DelegatingMethodAccessorImpl.java:43)
	at java.lang.reflect.Method.invoke(Method.java:606)
	at org.junit.runners.model.FrameworkMethod$1.runReflectiveCall(FrameworkMethod.java:50)
	at org.junit.internal.runners.model.ReflectiveCallable.run(ReflectiveCallable.java:12)
	at org.junit.runners.model.FrameworkMethod.invokeExplosively(FrameworkMethod.java:47)
	at org.junit.internal.runners.statements.InvokeMethod.evaluate(InvokeMethod.java:17)
	at org.junit.internal.runners.statements.RunBefores.evaluate(RunBefores.java:26)
	at org.junit.runners.ParentRunner.runLeaf(ParentRunner.java:325)
	at org.junit.runners.BlockJUnit4ClassRunner.runChild(BlockJUnit4ClassRunner.java:78)
	at org.junit.runners.BlockJUnit4ClassRunner.runChild(BlockJUnit4ClassRunner.java:57)
	at org.junit.runners.ParentRunner$3.run(ParentRunner.java:290)
	at org.junit.runners.ParentRunner$1.schedule(ParentRunner.java:71)
	at org.junit.runners.ParentRunner.runChildren(ParentRunner.java:288)
	at org.junit.runners.ParentRunner.access$000(ParentRunner.java:58)
	at org.junit.runners.ParentRunner$2.evaluate(ParentRunner.java:268)
	at org.junit.runners.ParentRunner.run(ParentRunner.java:363)
	at org.apache.maven.surefire.junit4.JUnit4Provider.execute(JUnit4Provider.java:283)
	at org.apache.maven.surefire.junit4.JUnit4Provider.executeWithRerun(JUnit4Provider.java:173)
	at org.apache.maven.surefire.junit4.JUnit4Provider.executeTestSet(JUnit4Provider.java:153)
	at org.apache.maven.surefire.junit4.JUnit4Provider.invoke(JUnit4Provider.java:128)
	at org.apache.maven.surefire.booter.ForkedBooter.invokeProviderInSameClassLoader(ForkedBooter.java:203)
	at org.apache.maven.surefire.booter.ForkedBooter.runSuitesInProcess(ForkedBooter.java:155)
	at org.apache.maven.surefire.booter.ForkedBooter.main(ForkedBooter.java:103)

testUnambiguousPartialLongOption4(org.apache.commons.cli.DefaultParserTest)  Time elapsed: 0.006 sec  <<< ERROR!
java.lang.NullPointerException: null
	at org.apache.commons.cli.OptionValidator.validateOption(OptionValidator.java:10)
	at org.apache.commons.cli.Option.<init>(Option.java:146)
	at org.apache.commons.cli.Option.<init>(Option.java:113)
	at org.apache.commons.cli.OptionBuilder.create(OptionBuilder.java:376)
	at org.apache.commons.cli.OptionBuilder.create(OptionBuilder.java:357)
	at org.apache.commons.cli.ParserTestCase.testUnambiguousPartialLongOption4(ParserTestCase.java:537)
	at sun.reflect.NativeMethodAccessorImpl.invoke0(Native Method)
	at sun.reflect.NativeMethodAccessorImpl.invoke(NativeMethodAccessorImpl.java:57)
	at sun.reflect.DelegatingMethodAccessorImpl.invoke(DelegatingMethodAccessorImpl.java:43)
	at java.lang.reflect.Method.invoke(Method.java:606)
	at org.junit.runners.model.FrameworkMethod$1.runReflectiveCall(FrameworkMethod.java:50)
	at org.junit.internal.runners.model.ReflectiveCallable.run(ReflectiveCallable.java:12)
	at org.junit.runners.model.FrameworkMethod.invokeExplosively(FrameworkMethod.java:47)
	at org.junit.internal.runners.statements.InvokeMethod.evaluate(InvokeMethod.java:17)
	at org.junit.internal.runners.statements.RunBefores.evaluate(RunBefores.java:26)
	at org.junit.runners.ParentRunner.runLeaf(ParentRunner.java:325)
	at org.junit.runners.BlockJUnit4ClassRunner.runChild(BlockJUnit4ClassRunner.java:78)
	at org.junit.runners.BlockJUnit4ClassRunner.runChild(BlockJUnit4ClassRunner.java:57)
	at org.junit.runners.ParentRunner$3.run(ParentRunner.java:290)
	at org.junit.runners.ParentRunner$1.schedule(ParentRunner.java:71)
	at org.junit.runners.ParentRunner.runChildren(ParentRunner.java:288)
	at org.junit.runners.ParentRunner.access$000(ParentRunner.java:58)
	at org.junit.runners.ParentRunner$2.evaluate(ParentRunner.java:268)
	at org.junit.runners.ParentRunner.run(ParentRunner.java:363)
	at org.apache.maven.surefire.junit4.JUnit4Provider.execute(JUnit4Provider.java:283)
	at org.apache.maven.surefire.junit4.JUnit4Provider.executeWithRerun(JUnit4Provider.java:173)
	at org.apache.maven.surefire.junit4.JUnit4Provider.executeTestSet(JUnit4Provider.java:153)
	at org.apache.maven.surefire.junit4.JUnit4Provider.invoke(JUnit4Provider.java:128)
	at org.apache.maven.surefire.booter.ForkedBooter.invokeProviderInSameClassLoader(ForkedBooter.java:203)
	at org.apache.maven.surefire.booter.ForkedBooter.runSuitesInProcess(ForkedBooter.java:155)
	at org.apache.maven.surefire.booter.ForkedBooter.main(ForkedBooter.java:103)

Running org.apache.commons.cli.ValuesTest
Tests run: 7, Failures: 0, Errors: 0, Skipped: 0, Time elapsed: 0.014 sec - in org.apache.commons.cli.ValuesTest
Running org.apache.commons.cli.OptionsTest
Tests run: 10, Failures: 0, Errors: 2, Skipped: 0, Time elapsed: 0.019 sec <<< FAILURE! - in org.apache.commons.cli.OptionsTest
testGetMatchingOpts(org.apache.commons.cli.OptionsTest)  Time elapsed: 0.002 sec  <<< ERROR!
java.lang.NullPointerException: null
	at org.apache.commons.cli.OptionValidator.validateOption(OptionValidator.java:10)
	at org.apache.commons.cli.Option.<init>(Option.java:146)
	at org.apache.commons.cli.Option.<init>(Option.java:113)
	at org.apache.commons.cli.OptionBuilder.create(OptionBuilder.java:376)
	at org.apache.commons.cli.OptionBuilder.create(OptionBuilder.java:357)
	at org.apache.commons.cli.OptionsTest.testGetMatchingOpts(OptionsTest.java:178)

testHelpOptions(org.apache.commons.cli.OptionsTest)  Time elapsed: 0.002 sec  <<< ERROR!
java.lang.NullPointerException: null
	at org.apache.commons.cli.OptionValidator.validateOption(OptionValidator.java:10)
	at org.apache.commons.cli.Option.<init>(Option.java:146)
	at org.apache.commons.cli.Option.<init>(Option.java:113)
	at org.apache.commons.cli.OptionBuilder.create(OptionBuilder.java:376)
	at org.apache.commons.cli.OptionBuilder.create(OptionBuilder.java:357)
	at org.apache.commons.cli.OptionsTest.testHelpOptions(OptionsTest.java:79)

Running org.apache.commons.cli.GnuParserTest
Tests run: 58, Failures: 0, Errors: 2, Skipped: 0, Time elapsed: 0.104 sec <<< FAILURE! - in org.apache.commons.cli.GnuParserTest
testOptionGroupLong(org.apache.commons.cli.GnuParserTest)  Time elapsed: 0.004 sec  <<< ERROR!
java.lang.NullPointerException: null
	at org.apache.commons.cli.OptionValidator.validateOption(OptionValidator.java:10)
	at org.apache.commons.cli.Option.<init>(Option.java:146)
	at org.apache.commons.cli.Option.<init>(Option.java:113)
	at org.apache.commons.cli.OptionBuilder.create(OptionBuilder.java:376)
	at org.apache.commons.cli.OptionBuilder.create(OptionBuilder.java:357)
	at org.apache.commons.cli.ParserTestCase.testOptionGroupLong(ParserTestCase.java:798)
	at sun.reflect.NativeMethodAccessorImpl.invoke0(Native Method)
	at sun.reflect.NativeMethodAccessorImpl.invoke(NativeMethodAccessorImpl.java:57)
	at sun.reflect.DelegatingMethodAccessorImpl.invoke(DelegatingMethodAccessorImpl.java:43)
	at java.lang.reflect.Method.invoke(Method.java:606)
	at org.junit.runners.model.FrameworkMethod$1.runReflectiveCall(FrameworkMethod.java:50)
	at org.junit.internal.runners.model.ReflectiveCallable.run(ReflectiveCallable.java:12)
	at org.junit.runners.model.FrameworkMethod.invokeExplosively(FrameworkMethod.java:47)
	at org.junit.internal.runners.statements.InvokeMethod.evaluate(InvokeMethod.java:17)
	at org.junit.internal.runners.statements.RunBefores.evaluate(RunBefores.java:26)
	at org.junit.runners.ParentRunner.runLeaf(ParentRunner.java:325)
	at org.junit.runners.BlockJUnit4ClassRunner.runChild(BlockJUnit4ClassRunner.java:78)
	at org.junit.runners.BlockJUnit4ClassRunner.runChild(BlockJUnit4ClassRunner.java:57)
	at org.junit.runners.ParentRunner$3.run(ParentRunner.java:290)
	at org.junit.runners.ParentRunner$1.schedule(ParentRunner.java:71)
	at org.junit.runners.ParentRunner.runChildren(ParentRunner.java:288)
	at org.junit.runners.ParentRunner.access$000(ParentRunner.java:58)
	at org.junit.runners.ParentRunner$2.evaluate(ParentRunner.java:268)
	at org.junit.runners.ParentRunner.run(ParentRunner.java:363)
	at org.apache.maven.surefire.junit4.JUnit4Provider.execute(JUnit4Provider.java:283)
	at org.apache.maven.surefire.junit4.JUnit4Provider.executeWithRerun(JUnit4Provider.java:173)
	at org.apache.maven.surefire.junit4.JUnit4Provider.executeTestSet(JUnit4Provider.java:153)
	at org.apache.maven.surefire.junit4.JUnit4Provider.invoke(JUnit4Provider.java:128)
	at org.apache.maven.surefire.booter.ForkedBooter.invokeProviderInSameClassLoader(ForkedBooter.java:203)
	at org.apache.maven.surefire.booter.ForkedBooter.runSuitesInProcess(ForkedBooter.java:155)
	at org.apache.maven.surefire.booter.ForkedBooter.main(ForkedBooter.java:103)

testPropertyOptionSingularValue(org.apache.commons.cli.GnuParserTest)  Time elapsed: 0.004 sec  <<< ERROR!
java.lang.NullPointerException: null
	at org.apache.commons.cli.OptionValidator.validateOption(OptionValidator.java:10)
	at org.apache.commons.cli.Option.<init>(Option.java:146)
	at org.apache.commons.cli.Option.<init>(Option.java:113)
	at org.apache.commons.cli.OptionBuilder.create(OptionBuilder.java:376)
	at org.apache.commons.cli.OptionBuilder.create(OptionBuilder.java:357)
	at org.apache.commons.cli.ParserTestCase.testPropertyOptionSingularValue(ParserTestCase.java:944)
	at sun.reflect.NativeMethodAccessorImpl.invoke0(Native Method)
	at sun.reflect.NativeMethodAccessorImpl.invoke(NativeMethodAccessorImpl.java:57)
	at sun.reflect.DelegatingMethodAccessorImpl.invoke(DelegatingMethodAccessorImpl.java:43)
	at java.lang.reflect.Method.invoke(Method.java:606)
	at org.junit.runners.model.FrameworkMethod$1.runReflectiveCall(FrameworkMethod.java:50)
	at org.junit.internal.runners.model.ReflectiveCallable.run(ReflectiveCallable.java:12)
	at org.junit.runners.model.FrameworkMethod.invokeExplosively(FrameworkMethod.java:47)
	at org.junit.internal.runners.statements.InvokeMethod.evaluate(InvokeMethod.java:17)
	at org.junit.internal.runners.statements.RunBefores.evaluate(RunBefores.java:26)
	at org.junit.runners.ParentRunner.runLeaf(ParentRunner.java:325)
	at org.junit.runners.BlockJUnit4ClassRunner.runChild(BlockJUnit4ClassRunner.java:78)
	at org.junit.runners.BlockJUnit4ClassRunner.runChild(BlockJUnit4ClassRunner.java:57)
	at org.junit.runners.ParentRunner$3.run(ParentRunner.java:290)
	at org.junit.runners.ParentRunner$1.schedule(ParentRunner.java:71)
	at org.junit.runners.ParentRunner.runChildren(ParentRunner.java:288)
	at org.junit.runners.ParentRunner.access$000(ParentRunner.java:58)
	at org.junit.runners.ParentRunner$2.evaluate(ParentRunner.java:268)
	at org.junit.runners.ParentRunner.run(ParentRunner.java:363)
	at org.apache.maven.surefire.junit4.JUnit4Provider.execute(JUnit4Provider.java:283)
	at org.apache.maven.surefire.junit4.JUnit4Provider.executeWithRerun(JUnit4Provider.java:173)
	at org.apache.maven.surefire.junit4.JUnit4Provider.executeTestSet(JUnit4Provider.java:153)
	at org.apache.maven.surefire.junit4.JUnit4Provider.invoke(JUnit4Provider.java:128)
	at org.apache.maven.surefire.booter.ForkedBooter.invokeProviderInSameClassLoader(ForkedBooter.java:203)
	at org.apache.maven.surefire.booter.ForkedBooter.runSuitesInProcess(ForkedBooter.java:155)
	at org.apache.maven.surefire.booter.ForkedBooter.main(ForkedBooter.java:103)

Running org.apache.commons.cli.PatternOptionBuilderTest
Exception found converting v to desired type: Unable to parse the URL: foo://commons.apache.org
Exception found converting d to desired type: Unable to find the class: System.DateTime
Exception found converting x to desired type: For input string: "3,5"
Exception found converting i to desired type: java.lang.IllegalAccessException; Unable to create an instance of: java.util.Calendar
Exception found converting n to desired type: Unable to find the class: System.DateTime
Tests run: 9, Failures: 0, Errors: 0, Skipped: 0, Time elapsed: 0.059 sec - in org.apache.commons.cli.PatternOptionBuilderTest
Running org.apache.commons.cli.ApplicationTest
Tests run: 5, Failures: 0, Errors: 2, Skipped: 0, Time elapsed: 0.009 sec <<< FAILURE! - in org.apache.commons.cli.ApplicationTest
testNLT(org.apache.commons.cli.ApplicationTest)  Time elapsed: 0.001 sec  <<< ERROR!
java.lang.NullPointerException: null
	at org.apache.commons.cli.OptionValidator.validateOption(OptionValidator.java:10)
	at org.apache.commons.cli.Option.<init>(Option.java:146)
	at org.apache.commons.cli.Option.<init>(Option.java:113)
	at org.apache.commons.cli.OptionBuilder.create(OptionBuilder.java:376)
	at org.apache.commons.cli.OptionBuilder.create(OptionBuilder.java:357)
	at org.apache.commons.cli.ApplicationTest.testNLT(ApplicationTest.java:303)

testLs(org.apache.commons.cli.ApplicationTest)  Time elapsed: 0.001 sec  <<< ERROR!
java.lang.NullPointerException: null
	at org.apache.commons.cli.OptionValidator.validateOption(OptionValidator.java:10)
	at org.apache.commons.cli.Option.<init>(Option.java:146)
	at org.apache.commons.cli.Option.<init>(Option.java:113)
	at org.apache.commons.cli.OptionBuilder.create(OptionBuilder.java:376)
	at org.apache.commons.cli.OptionBuilder.create(OptionBuilder.java:357)
	at org.apache.commons.cli.ApplicationTest.testLs(ApplicationTest.java:52)

Running org.apache.commons.cli.OptionTest
Tests run: 9, Failures: 0, Errors: 2, Skipped: 0, Time elapsed: 0.009 sec <<< FAILURE! - in org.apache.commons.cli.OptionTest
testBuilderInsufficientParams1(org.apache.commons.cli.OptionTest)  Time elapsed: 0.001 sec  <<< ERROR!
java.lang.Exception: Unexpected exception, expected<java.lang.IllegalArgumentException> but was<java.lang.NullPointerException>
	at org.apache.commons.cli.OptionValidator.validateOption(OptionValidator.java:10)
	at org.apache.commons.cli.Option$Builder.<init>(Option.java:821)
	at org.apache.commons.cli.Option$Builder.<init>(Option.java:783)
	at org.apache.commons.cli.Option.builder(Option.java:766)
	at org.apache.commons.cli.Option.builder(Option.java:752)
	at org.apache.commons.cli.OptionTest.testBuilderInsufficientParams1(OptionTest.java:194)

testBuilderInsufficientParams2(org.apache.commons.cli.OptionTest)  Time elapsed: 0.003 sec  <<< ERROR!
java.lang.Exception: Unexpected exception, expected<java.lang.IllegalArgumentException> but was<java.lang.NullPointerException>
	at org.apache.commons.cli.OptionValidator.validateOption(OptionValidator.java:10)
	at org.apache.commons.cli.Option$Builder.<init>(Option.java:821)
	at org.apache.commons.cli.Option$Builder.<init>(Option.java:783)
	at org.apache.commons.cli.Option.builder(Option.java:766)
	at org.apache.commons.cli.OptionTest.testBuilderInsufficientParams2(OptionTest.java:200)

Running org.apache.commons.cli.bug.BugCLI252Test
Tests run: 60, Failures: 0, Errors: 13, Skipped: 0, Time elapsed: 0.052 sec <<< FAILURE! - in org.apache.commons.cli.bug.BugCLI252Test
testAmbiquousOptionName(org.apache.commons.cli.bug.BugCLI252Test)  Time elapsed: 0.001 sec  <<< ERROR!
java.lang.Exception: Unexpected exception, expected<org.apache.commons.cli.AmbiguousOptionException> but was<java.lang.NullPointerException>
	at org.apache.commons.cli.OptionValidator.validateOption(OptionValidator.java:10)
	at org.apache.commons.cli.Option$Builder.<init>(Option.java:821)
	at org.apache.commons.cli.Option$Builder.<init>(Option.java:783)
	at org.apache.commons.cli.Option.builder(Option.java:766)
	at org.apache.commons.cli.Option.builder(Option.java:752)
	at org.apache.commons.cli.bug.BugCLI252Test.getOptions(BugCLI252Test.java:37)
	at org.apache.commons.cli.bug.BugCLI252Test.testAmbiquousOptionName(BugCLI252Test.java:32)

testExactOptionNameMatch(org.apache.commons.cli.bug.BugCLI252Test)  Time elapsed: 0 sec  <<< ERROR!
java.lang.NullPointerException: null
	at org.apache.commons.cli.OptionValidator.validateOption(OptionValidator.java:10)
	at org.apache.commons.cli.Option$Builder.<init>(Option.java:821)
	at org.apache.commons.cli.Option$Builder.<init>(Option.java:783)
	at org.apache.commons.cli.Option.builder(Option.java:766)
	at org.apache.commons.cli.Option.builder(Option.java:752)
	at org.apache.commons.cli.bug.BugCLI252Test.getOptions(BugCLI252Test.java:37)
	at org.apache.commons.cli.bug.BugCLI252Test.testExactOptionNameMatch(BugCLI252Test.java:27)

testOptionGroupLong(org.apache.commons.cli.bug.BugCLI252Test)  Time elapsed: 0.002 sec  <<< ERROR!
java.lang.NullPointerException: null
	at org.apache.commons.cli.OptionValidator.validateOption(OptionValidator.java:10)
	at org.apache.commons.cli.Option.<init>(Option.java:146)
	at org.apache.commons.cli.Option.<init>(Option.java:113)
	at org.apache.commons.cli.OptionBuilder.create(OptionBuilder.java:376)
	at org.apache.commons.cli.OptionBuilder.create(OptionBuilder.java:357)
	at org.apache.commons.cli.ParserTestCase.testOptionGroupLong(ParserTestCase.java:798)
	at sun.reflect.NativeMethodAccessorImpl.invoke0(Native Method)
	at sun.reflect.NativeMethodAccessorImpl.invoke(NativeMethodAccessorImpl.java:57)
	at sun.reflect.DelegatingMethodAccessorImpl.invoke(DelegatingMethodAccessorImpl.java:43)
	at java.lang.reflect.Method.invoke(Method.java:606)
	at org.junit.runners.model.FrameworkMethod$1.runReflectiveCall(FrameworkMethod.java:50)
	at org.junit.internal.runners.model.ReflectiveCallable.run(ReflectiveCallable.java:12)
	at org.junit.runners.model.FrameworkMethod.invokeExplosively(FrameworkMethod.java:47)
	at org.junit.internal.runners.statements.InvokeMethod.evaluate(InvokeMethod.java:17)
	at org.junit.internal.runners.statements.RunBefores.evaluate(RunBefores.java:26)
	at org.junit.runners.ParentRunner.runLeaf(ParentRunner.java:325)
	at org.junit.runners.BlockJUnit4ClassRunner.runChild(BlockJUnit4ClassRunner.java:78)
	at org.junit.runners.BlockJUnit4ClassRunner.runChild(BlockJUnit4ClassRunner.java:57)
	at org.junit.runners.ParentRunner$3.run(ParentRunner.java:290)
	at org.junit.runners.ParentRunner$1.schedule(ParentRunner.java:71)
	at org.junit.runners.ParentRunner.runChildren(ParentRunner.java:288)
	at org.junit.runners.ParentRunner.access$000(ParentRunner.java:58)
	at org.junit.runners.ParentRunner$2.evaluate(ParentRunner.java:268)
	at org.junit.runners.ParentRunner.run(ParentRunner.java:363)
	at org.apache.maven.surefire.junit4.JUnit4Provider.execute(JUnit4Provider.java:283)
	at org.apache.maven.surefire.junit4.JUnit4Provider.executeWithRerun(JUnit4Provider.java:173)
	at org.apache.maven.surefire.junit4.JUnit4Provider.executeTestSet(JUnit4Provider.java:153)
	at org.apache.maven.surefire.junit4.JUnit4Provider.invoke(JUnit4Provider.java:128)
	at org.apache.maven.surefire.booter.ForkedBooter.invokeProviderInSameClassLoader(ForkedBooter.java:203)
	at org.apache.maven.surefire.booter.ForkedBooter.runSuitesInProcess(ForkedBooter.java:155)
	at org.apache.maven.surefire.booter.ForkedBooter.main(ForkedBooter.java:103)

testPartialLongOptionSingleDash(org.apache.commons.cli.bug.BugCLI252Test)  Time elapsed: 0.002 sec  <<< ERROR!
java.lang.NullPointerException: null
	at org.apache.commons.cli.OptionValidator.validateOption(OptionValidator.java:10)
	at org.apache.commons.cli.Option.<init>(Option.java:146)
	at org.apache.commons.cli.Option.<init>(Option.java:113)
	at org.apache.commons.cli.OptionBuilder.create(OptionBuilder.java:376)
	at org.apache.commons.cli.OptionBuilder.create(OptionBuilder.java:357)
	at org.apache.commons.cli.ParserTestCase.testPartialLongOptionSingleDash(ParserTestCase.java:656)
	at sun.reflect.NativeMethodAccessorImpl.invoke0(Native Method)
	at sun.reflect.NativeMethodAccessorImpl.invoke(NativeMethodAccessorImpl.java:57)
	at sun.reflect.DelegatingMethodAccessorImpl.invoke(DelegatingMethodAccessorImpl.java:43)
	at java.lang.reflect.Method.invoke(Method.java:606)
	at org.junit.runners.model.FrameworkMethod$1.runReflectiveCall(FrameworkMethod.java:50)
	at org.junit.internal.runners.model.ReflectiveCallable.run(ReflectiveCallable.java:12)
	at org.junit.runners.model.FrameworkMethod.invokeExplosively(FrameworkMethod.java:47)
	at org.junit.internal.runners.statements.InvokeMethod.evaluate(InvokeMethod.java:17)
	at org.junit.internal.runners.statements.RunBefores.evaluate(RunBefores.java:26)
	at org.junit.runners.ParentRunner.runLeaf(ParentRunner.java:325)
	at org.junit.runners.BlockJUnit4ClassRunner.runChild(BlockJUnit4ClassRunner.java:78)
	at org.junit.runners.BlockJUnit4ClassRunner.runChild(BlockJUnit4ClassRunner.java:57)
	at org.junit.runners.ParentRunner$3.run(ParentRunner.java:290)
	at org.junit.runners.ParentRunner$1.schedule(ParentRunner.java:71)
	at org.junit.runners.ParentRunner.runChildren(ParentRunner.java:288)
	at org.junit.runners.ParentRunner.access$000(ParentRunner.java:58)
	at org.junit.runners.ParentRunner$2.evaluate(ParentRunner.java:268)
	at org.junit.runners.ParentRunner.run(ParentRunner.java:363)
	at org.apache.maven.surefire.junit4.JUnit4Provider.execute(JUnit4Provider.java:283)
	at org.apache.maven.surefire.junit4.JUnit4Provider.executeWithRerun(JUnit4Provider.java:173)
	at org.apache.maven.surefire.junit4.JUnit4Provider.executeTestSet(JUnit4Provider.java:153)
	at org.apache.maven.surefire.junit4.JUnit4Provider.invoke(JUnit4Provider.java:128)
	at org.apache.maven.surefire.booter.ForkedBooter.invokeProviderInSameClassLoader(ForkedBooter.java:203)
	at org.apache.maven.surefire.booter.ForkedBooter.runSuitesInProcess(ForkedBooter.java:155)
	at org.apache.maven.surefire.booter.ForkedBooter.main(ForkedBooter.java:103)

testPropertyOptionSingularValue(org.apache.commons.cli.bug.BugCLI252Test)  Time elapsed: 0.002 sec  <<< ERROR!
java.lang.NullPointerException: null
	at org.apache.commons.cli.OptionValidator.validateOption(OptionValidator.java:10)
	at org.apache.commons.cli.Option.<init>(Option.java:146)
	at org.apache.commons.cli.Option.<init>(Option.java:113)
	at org.apache.commons.cli.OptionBuilder.create(OptionBuilder.java:376)
	at org.apache.commons.cli.OptionBuilder.create(OptionBuilder.java:357)
	at org.apache.commons.cli.ParserTestCase.testPropertyOptionSingularValue(ParserTestCase.java:944)
	at sun.reflect.NativeMethodAccessorImpl.invoke0(Native Method)
	at sun.reflect.NativeMethodAccessorImpl.invoke(NativeMethodAccessorImpl.java:57)
	at sun.reflect.DelegatingMethodAccessorImpl.invoke(DelegatingMethodAccessorImpl.java:43)
	at java.lang.reflect.Method.invoke(Method.java:606)
	at org.junit.runners.model.FrameworkMethod$1.runReflectiveCall(FrameworkMethod.java:50)
	at org.junit.internal.runners.model.ReflectiveCallable.run(ReflectiveCallable.java:12)
	at org.junit.runners.model.FrameworkMethod.invokeExplosively(FrameworkMethod.java:47)
	at org.junit.internal.runners.statements.InvokeMethod.evaluate(InvokeMethod.java:17)
	at org.junit.internal.runners.statements.RunBefores.evaluate(RunBefores.java:26)
	at org.junit.runners.ParentRunner.runLeaf(ParentRunner.java:325)
	at org.junit.runners.BlockJUnit4ClassRunner.runChild(BlockJUnit4ClassRunner.java:78)
	at org.junit.runners.BlockJUnit4ClassRunner.runChild(BlockJUnit4ClassRunner.java:57)
	at org.junit.runners.ParentRunner$3.run(ParentRunner.java:290)
	at org.junit.runners.ParentRunner$1.schedule(ParentRunner.java:71)
	at org.junit.runners.ParentRunner.runChildren(ParentRunner.java:288)
	at org.junit.runners.ParentRunner.access$000(ParentRunner.java:58)
	at org.junit.runners.ParentRunner$2.evaluate(ParentRunner.java:268)
	at org.junit.runners.ParentRunner.run(ParentRunner.java:363)
	at org.apache.maven.surefire.junit4.JUnit4Provider.execute(JUnit4Provider.java:283)
	at org.apache.maven.surefire.junit4.JUnit4Provider.executeWithRerun(JUnit4Provider.java:173)
	at org.apache.maven.surefire.junit4.JUnit4Provider.executeTestSet(JUnit4Provider.java:153)
	at org.apache.maven.surefire.junit4.JUnit4Provider.invoke(JUnit4Provider.java:128)
	at org.apache.maven.surefire.booter.ForkedBooter.invokeProviderInSameClassLoader(ForkedBooter.java:203)
	at org.apache.maven.surefire.booter.ForkedBooter.runSuitesInProcess(ForkedBooter.java:155)
	at org.apache.maven.surefire.booter.ForkedBooter.main(ForkedBooter.java:103)

testAmbiguousPartialLongOption1(org.apache.commons.cli.bug.BugCLI252Test)  Time elapsed: 0.002 sec  <<< ERROR!
java.lang.NullPointerException: null
	at org.apache.commons.cli.OptionValidator.validateOption(OptionValidator.java:10)
	at org.apache.commons.cli.Option.<init>(Option.java:146)
	at org.apache.commons.cli.Option.<init>(Option.java:113)
	at org.apache.commons.cli.OptionBuilder.create(OptionBuilder.java:376)
	at org.apache.commons.cli.OptionBuilder.create(OptionBuilder.java:357)
	at org.apache.commons.cli.ParserTestCase.testAmbiguousPartialLongOption1(ParserTestCase.java:552)
	at sun.reflect.NativeMethodAccessorImpl.invoke0(Native Method)
	at sun.reflect.NativeMethodAccessorImpl.invoke(NativeMethodAccessorImpl.java:57)
	at sun.reflect.DelegatingMethodAccessorImpl.invoke(DelegatingMethodAccessorImpl.java:43)
	at java.lang.reflect.Method.invoke(Method.java:606)
	at org.junit.runners.model.FrameworkMethod$1.runReflectiveCall(FrameworkMethod.java:50)
	at org.junit.internal.runners.model.ReflectiveCallable.run(ReflectiveCallable.java:12)
	at org.junit.runners.model.FrameworkMethod.invokeExplosively(FrameworkMethod.java:47)
	at org.junit.internal.runners.statements.InvokeMethod.evaluate(InvokeMethod.java:17)
	at org.junit.internal.runners.statements.RunBefores.evaluate(RunBefores.java:26)
	at org.junit.runners.ParentRunner.runLeaf(ParentRunner.java:325)
	at org.junit.runners.BlockJUnit4ClassRunner.runChild(BlockJUnit4ClassRunner.java:78)
	at org.junit.runners.BlockJUnit4ClassRunner.runChild(BlockJUnit4ClassRunner.java:57)
	at org.junit.runners.ParentRunner$3.run(ParentRunner.java:290)
	at org.junit.runners.ParentRunner$1.schedule(ParentRunner.java:71)
	at org.junit.runners.ParentRunner.runChildren(ParentRunner.java:288)
	at org.junit.runners.ParentRunner.access$000(ParentRunner.java:58)
	at org.junit.runners.ParentRunner$2.evaluate(ParentRunner.java:268)
	at org.junit.runners.ParentRunner.run(ParentRunner.java:363)
	at org.apache.maven.surefire.junit4.JUnit4Provider.execute(JUnit4Provider.java:283)
	at org.apache.maven.surefire.junit4.JUnit4Provider.executeWithRerun(JUnit4Provider.java:173)
	at org.apache.maven.surefire.junit4.JUnit4Provider.executeTestSet(JUnit4Provider.java:153)
	at org.apache.maven.surefire.junit4.JUnit4Provider.invoke(JUnit4Provider.java:128)
	at org.apache.maven.surefire.booter.ForkedBooter.invokeProviderInSameClassLoader(ForkedBooter.java:203)
	at org.apache.maven.surefire.booter.ForkedBooter.runSuitesInProcess(ForkedBooter.java:155)
	at org.apache.maven.surefire.booter.ForkedBooter.main(ForkedBooter.java:103)

testAmbiguousPartialLongOption2(org.apache.commons.cli.bug.BugCLI252Test)  Time elapsed: 0.001 sec  <<< ERROR!
java.lang.NullPointerException: null
	at org.apache.commons.cli.OptionValidator.validateOption(OptionValidator.java:10)
	at org.apache.commons.cli.Option.<init>(Option.java:146)
	at org.apache.commons.cli.Option.<init>(Option.java:113)
	at org.apache.commons.cli.OptionBuilder.create(OptionBuilder.java:376)
	at org.apache.commons.cli.OptionBuilder.create(OptionBuilder.java:357)
	at org.apache.commons.cli.ParserTestCase.testAmbiguousPartialLongOption2(ParserTestCase.java:578)
	at sun.reflect.NativeMethodAccessorImpl.invoke0(Native Method)
	at sun.reflect.NativeMethodAccessorImpl.invoke(NativeMethodAccessorImpl.java:57)
	at sun.reflect.DelegatingMethodAccessorImpl.invoke(DelegatingMethodAccessorImpl.java:43)
	at java.lang.reflect.Method.invoke(Method.java:606)
	at org.junit.runners.model.FrameworkMethod$1.runReflectiveCall(FrameworkMethod.java:50)
	at org.junit.internal.runners.model.ReflectiveCallable.run(ReflectiveCallable.java:12)
	at org.junit.runners.model.FrameworkMethod.invokeExplosively(FrameworkMethod.java:47)
	at org.junit.internal.runners.statements.InvokeMethod.evaluate(InvokeMethod.java:17)
	at org.junit.internal.runners.statements.RunBefores.evaluate(RunBefores.java:26)
	at org.junit.runners.ParentRunner.runLeaf(ParentRunner.java:325)
	at org.junit.runners.BlockJUnit4ClassRunner.runChild(BlockJUnit4ClassRunner.java:78)
	at org.junit.runners.BlockJUnit4ClassRunner.runChild(BlockJUnit4ClassRunner.java:57)
	at org.junit.runners.ParentRunner$3.run(ParentRunner.java:290)
	at org.junit.runners.ParentRunner$1.schedule(ParentRunner.java:71)
	at org.junit.runners.ParentRunner.runChildren(ParentRunner.java:288)
	at org.junit.runners.ParentRunner.access$000(ParentRunner.java:58)
	at org.junit.runners.ParentRunner$2.evaluate(ParentRunner.java:268)
	at org.junit.runners.ParentRunner.run(ParentRunner.java:363)
	at org.apache.maven.surefire.junit4.JUnit4Provider.execute(JUnit4Provider.java:283)
	at org.apache.maven.surefire.junit4.JUnit4Provider.executeWithRerun(JUnit4Provider.java:173)
	at org.apache.maven.surefire.junit4.JUnit4Provider.executeTestSet(JUnit4Provider.java:153)
	at org.apache.maven.surefire.junit4.JUnit4Provider.invoke(JUnit4Provider.java:128)
	at org.apache.maven.surefire.booter.ForkedBooter.invokeProviderInSameClassLoader(ForkedBooter.java:203)
	at org.apache.maven.surefire.booter.ForkedBooter.runSuitesInProcess(ForkedBooter.java:155)
	at org.apache.maven.surefire.booter.ForkedBooter.main(ForkedBooter.java:103)

testAmbiguousPartialLongOption3(org.apache.commons.cli.bug.BugCLI252Test)  Time elapsed: 0.002 sec  <<< ERROR!
java.lang.NullPointerException: null
	at org.apache.commons.cli.OptionValidator.validateOption(OptionValidator.java:10)
	at org.apache.commons.cli.Option.<init>(Option.java:146)
	at org.apache.commons.cli.Option.<init>(Option.java:113)
	at org.apache.commons.cli.OptionBuilder.create(OptionBuilder.java:376)
	at org.apache.commons.cli.OptionBuilder.create(OptionBuilder.java:357)
	at org.apache.commons.cli.ParserTestCase.testAmbiguousPartialLongOption3(ParserTestCase.java:604)
	at sun.reflect.NativeMethodAccessorImpl.invoke0(Native Method)
	at sun.reflect.NativeMethodAccessorImpl.invoke(NativeMethodAccessorImpl.java:57)
	at sun.reflect.DelegatingMethodAccessorImpl.invoke(DelegatingMethodAccessorImpl.java:43)
	at java.lang.reflect.Method.invoke(Method.java:606)
	at org.junit.runners.model.FrameworkMethod$1.runReflectiveCall(FrameworkMethod.java:50)
	at org.junit.internal.runners.model.ReflectiveCallable.run(ReflectiveCallable.java:12)
	at org.junit.runners.model.FrameworkMethod.invokeExplosively(FrameworkMethod.java:47)
	at org.junit.internal.runners.statements.InvokeMethod.evaluate(InvokeMethod.java:17)
	at org.junit.internal.runners.statements.RunBefores.evaluate(RunBefores.java:26)
	at org.junit.runners.ParentRunner.runLeaf(ParentRunner.java:325)
	at org.junit.runners.BlockJUnit4ClassRunner.runChild(BlockJUnit4ClassRunner.java:78)
	at org.junit.runners.BlockJUnit4ClassRunner.runChild(BlockJUnit4ClassRunner.java:57)
	at org.junit.runners.ParentRunner$3.run(ParentRunner.java:290)
	at org.junit.runners.ParentRunner$1.schedule(ParentRunner.java:71)
	at org.junit.runners.ParentRunner.runChildren(ParentRunner.java:288)
	at org.junit.runners.ParentRunner.access$000(ParentRunner.java:58)
	at org.junit.runners.ParentRunner$2.evaluate(ParentRunner.java:268)
	at org.junit.runners.ParentRunner.run(ParentRunner.java:363)
	at org.apache.maven.surefire.junit4.JUnit4Provider.execute(JUnit4Provider.java:283)
	at org.apache.maven.surefire.junit4.JUnit4Provider.executeWithRerun(JUnit4Provider.java:173)
	at org.apache.maven.surefire.junit4.JUnit4Provider.executeTestSet(JUnit4Provider.java:153)
	at org.apache.maven.surefire.junit4.JUnit4Provider.invoke(JUnit4Provider.java:128)
	at org.apache.maven.surefire.booter.ForkedBooter.invokeProviderInSameClassLoader(ForkedBooter.java:203)
	at org.apache.maven.surefire.booter.ForkedBooter.runSuitesInProcess(ForkedBooter.java:155)
	at org.apache.maven.surefire.booter.ForkedBooter.main(ForkedBooter.java:103)

testAmbiguousPartialLongOption4(org.apache.commons.cli.bug.BugCLI252Test)  Time elapsed: 0.001 sec  <<< ERROR!
java.lang.NullPointerException: null
	at org.apache.commons.cli.OptionValidator.validateOption(OptionValidator.java:10)
	at org.apache.commons.cli.Option.<init>(Option.java:146)
	at org.apache.commons.cli.Option.<init>(Option.java:113)
	at org.apache.commons.cli.OptionBuilder.create(OptionBuilder.java:376)
	at org.apache.commons.cli.OptionBuilder.create(OptionBuilder.java:357)
	at org.apache.commons.cli.ParserTestCase.testAmbiguousPartialLongOption4(ParserTestCase.java:630)
	at sun.reflect.NativeMethodAccessorImpl.invoke0(Native Method)
	at sun.reflect.NativeMethodAccessorImpl.invoke(NativeMethodAccessorImpl.java:57)
	at sun.reflect.DelegatingMethodAccessorImpl.invoke(DelegatingMethodAccessorImpl.java:43)
	at java.lang.reflect.Method.invoke(Method.java:606)
	at org.junit.runners.model.FrameworkMethod$1.runReflectiveCall(FrameworkMethod.java:50)
	at org.junit.internal.runners.model.ReflectiveCallable.run(ReflectiveCallable.java:12)
	at org.junit.runners.model.FrameworkMethod.invokeExplosively(FrameworkMethod.java:47)
	at org.junit.internal.runners.statements.InvokeMethod.evaluate(InvokeMethod.java:17)
	at org.junit.internal.runners.statements.RunBefores.evaluate(RunBefores.java:26)
	at org.junit.runners.ParentRunner.runLeaf(ParentRunner.java:325)
	at org.junit.runners.BlockJUnit4ClassRunner.runChild(BlockJUnit4ClassRunner.java:78)
	at org.junit.runners.BlockJUnit4ClassRunner.runChild(BlockJUnit4ClassRunner.java:57)
	at org.junit.runners.ParentRunner$3.run(ParentRunner.java:290)
	at org.junit.runners.ParentRunner$1.schedule(ParentRunner.java:71)
	at org.junit.runners.ParentRunner.runChildren(ParentRunner.java:288)
	at org.junit.runners.ParentRunner.access$000(ParentRunner.java:58)
	at org.junit.runners.ParentRunner$2.evaluate(ParentRunner.java:268)
	at org.junit.runners.ParentRunner.run(ParentRunner.java:363)
	at org.apache.maven.surefire.junit4.JUnit4Provider.execute(JUnit4Provider.java:283)
	at org.apache.maven.surefire.junit4.JUnit4Provider.executeWithRerun(JUnit4Provider.java:173)
	at org.apache.maven.surefire.junit4.JUnit4Provider.executeTestSet(JUnit4Provider.java:153)
	at org.apache.maven.surefire.junit4.JUnit4Provider.invoke(JUnit4Provider.java:128)
	at org.apache.maven.surefire.booter.ForkedBooter.invokeProviderInSameClassLoader(ForkedBooter.java:203)
	at org.apache.maven.surefire.booter.ForkedBooter.runSuitesInProcess(ForkedBooter.java:155)
	at org.apache.maven.surefire.booter.ForkedBooter.main(ForkedBooter.java:103)

testUnambiguousPartialLongOption1(org.apache.commons.cli.bug.BugCLI252Test)  Time elapsed: 0.001 sec  <<< ERROR!
java.lang.NullPointerException: null
	at org.apache.commons.cli.OptionValidator.validateOption(OptionValidator.java:10)
	at org.apache.commons.cli.Option.<init>(Option.java:146)
	at org.apache.commons.cli.Option.<init>(Option.java:113)
	at org.apache.commons.cli.OptionBuilder.create(OptionBuilder.java:376)
	at org.apache.commons.cli.OptionBuilder.create(OptionBuilder.java:357)
	at org.apache.commons.cli.ParserTestCase.testUnambiguousPartialLongOption1(ParserTestCase.java:494)
	at sun.reflect.NativeMethodAccessorImpl.invoke0(Native Method)
	at sun.reflect.NativeMethodAccessorImpl.invoke(NativeMethodAccessorImpl.java:57)
	at sun.reflect.DelegatingMethodAccessorImpl.invoke(DelegatingMethodAccessorImpl.java:43)
	at java.lang.reflect.Method.invoke(Method.java:606)
	at org.junit.runners.model.FrameworkMethod$1.runReflectiveCall(FrameworkMethod.java:50)
	at org.junit.internal.runners.model.ReflectiveCallable.run(ReflectiveCallable.java:12)
	at org.junit.runners.model.FrameworkMethod.invokeExplosively(FrameworkMethod.java:47)
	at org.junit.internal.runners.statements.InvokeMethod.evaluate(InvokeMethod.java:17)
	at org.junit.internal.runners.statements.RunBefores.evaluate(RunBefores.java:26)
	at org.junit.runners.ParentRunner.runLeaf(ParentRunner.java:325)
	at org.junit.runners.BlockJUnit4ClassRunner.runChild(BlockJUnit4ClassRunner.java:78)
	at org.junit.runners.BlockJUnit4ClassRunner.runChild(BlockJUnit4ClassRunner.java:57)
	at org.junit.runners.ParentRunner$3.run(ParentRunner.java:290)
	at org.junit.runners.ParentRunner$1.schedule(ParentRunner.java:71)
	at org.junit.runners.ParentRunner.runChildren(ParentRunner.java:288)
	at org.junit.runners.ParentRunner.access$000(ParentRunner.java:58)
	at org.junit.runners.ParentRunner$2.evaluate(ParentRunner.java:268)
	at org.junit.runners.ParentRunner.run(ParentRunner.java:363)
	at org.apache.maven.surefire.junit4.JUnit4Provider.execute(JUnit4Provider.java:283)
	at org.apache.maven.surefire.junit4.JUnit4Provider.executeWithRerun(JUnit4Provider.java:173)
	at org.apache.maven.surefire.junit4.JUnit4Provider.executeTestSet(JUnit4Provider.java:153)
	at org.apache.maven.surefire.junit4.JUnit4Provider.invoke(JUnit4Provider.java:128)
	at org.apache.maven.surefire.booter.ForkedBooter.invokeProviderInSameClassLoader(ForkedBooter.java:203)
	at org.apache.maven.surefire.booter.ForkedBooter.runSuitesInProcess(ForkedBooter.java:155)
	at org.apache.maven.surefire.booter.ForkedBooter.main(ForkedBooter.java:103)

testUnambiguousPartialLongOption2(org.apache.commons.cli.bug.BugCLI252Test)  Time elapsed: 0 sec  <<< ERROR!
java.lang.NullPointerException: null
	at org.apache.commons.cli.OptionValidator.validateOption(OptionValidator.java:10)
	at org.apache.commons.cli.Option.<init>(Option.java:146)
	at org.apache.commons.cli.Option.<init>(Option.java:113)
	at org.apache.commons.cli.OptionBuilder.create(OptionBuilder.java:376)
	at org.apache.commons.cli.OptionBuilder.create(OptionBuilder.java:357)
	at org.apache.commons.cli.ParserTestCase.testUnambiguousPartialLongOption2(ParserTestCase.java:508)
	at sun.reflect.NativeMethodAccessorImpl.invoke0(Native Method)
	at sun.reflect.NativeMethodAccessorImpl.invoke(NativeMethodAccessorImpl.java:57)
	at sun.reflect.DelegatingMethodAccessorImpl.invoke(DelegatingMethodAccessorImpl.java:43)
	at java.lang.reflect.Method.invoke(Method.java:606)
	at org.junit.runners.model.FrameworkMethod$1.runReflectiveCall(FrameworkMethod.java:50)
	at org.junit.internal.runners.model.ReflectiveCallable.run(ReflectiveCallable.java:12)
	at org.junit.runners.model.FrameworkMethod.invokeExplosively(FrameworkMethod.java:47)
	at org.junit.internal.runners.statements.InvokeMethod.evaluate(InvokeMethod.java:17)
	at org.junit.internal.runners.statements.RunBefores.evaluate(RunBefores.java:26)
	at org.junit.runners.ParentRunner.runLeaf(ParentRunner.java:325)
	at org.junit.runners.BlockJUnit4ClassRunner.runChild(BlockJUnit4ClassRunner.java:78)
	at org.junit.runners.BlockJUnit4ClassRunner.runChild(BlockJUnit4ClassRunner.java:57)
	at org.junit.runners.ParentRunner$3.run(ParentRunner.java:290)
	at org.junit.runners.ParentRunner$1.schedule(ParentRunner.java:71)
	at org.junit.runners.ParentRunner.runChildren(ParentRunner.java:288)
	at org.junit.runners.ParentRunner.access$000(ParentRunner.java:58)
	at org.junit.runners.ParentRunner$2.evaluate(ParentRunner.java:268)
	at org.junit.runners.ParentRunner.run(ParentRunner.java:363)
	at org.apache.maven.surefire.junit4.JUnit4Provider.execute(JUnit4Provider.java:283)
	at org.apache.maven.surefire.junit4.JUnit4Provider.executeWithRerun(JUnit4Provider.java:173)
	at org.apache.maven.surefire.junit4.JUnit4Provider.executeTestSet(JUnit4Provider.java:153)
	at org.apache.maven.surefire.junit4.JUnit4Provider.invoke(JUnit4Provider.java:128)
	at org.apache.maven.surefire.booter.ForkedBooter.invokeProviderInSameClassLoader(ForkedBooter.java:203)
	at org.apache.maven.surefire.booter.ForkedBooter.runSuitesInProcess(ForkedBooter.java:155)
	at org.apache.maven.surefire.booter.ForkedBooter.main(ForkedBooter.java:103)

testUnambiguousPartialLongOption3(org.apache.commons.cli.bug.BugCLI252Test)  Time elapsed: 0 sec  <<< ERROR!
java.lang.NullPointerException: null
	at org.apache.commons.cli.OptionValidator.validateOption(OptionValidator.java:10)
	at org.apache.commons.cli.Option.<init>(Option.java:146)
	at org.apache.commons.cli.Option.<init>(Option.java:113)
	at org.apache.commons.cli.OptionBuilder.create(OptionBuilder.java:376)
	at org.apache.commons.cli.OptionBuilder.create(OptionBuilder.java:357)
	at org.apache.commons.cli.ParserTestCase.testUnambiguousPartialLongOption3(ParserTestCase.java:522)
	at sun.reflect.NativeMethodAccessorImpl.invoke0(Native Method)
	at sun.reflect.NativeMethodAccessorImpl.invoke(NativeMethodAccessorImpl.java:57)
	at sun.reflect.DelegatingMethodAccessorImpl.invoke(DelegatingMethodAccessorImpl.java:43)
	at java.lang.reflect.Method.invoke(Method.java:606)
	at org.junit.runners.model.FrameworkMethod$1.runReflectiveCall(FrameworkMethod.java:50)
	at org.junit.internal.runners.model.ReflectiveCallable.run(ReflectiveCallable.java:12)
	at org.junit.runners.model.FrameworkMethod.invokeExplosively(FrameworkMethod.java:47)
	at org.junit.internal.runners.statements.InvokeMethod.evaluate(InvokeMethod.java:17)
	at org.junit.internal.runners.statements.RunBefores.evaluate(RunBefores.java:26)
	at org.junit.runners.ParentRunner.runLeaf(ParentRunner.java:325)
	at org.junit.runners.BlockJUnit4ClassRunner.runChild(BlockJUnit4ClassRunner.java:78)
	at org.junit.runners.BlockJUnit4ClassRunner.runChild(BlockJUnit4ClassRunner.java:57)
	at org.junit.runners.ParentRunner$3.run(ParentRunner.java:290)
	at org.junit.runners.ParentRunner$1.schedule(ParentRunner.java:71)
	at org.junit.runners.ParentRunner.runChildren(ParentRunner.java:288)
	at org.junit.runners.ParentRunner.access$000(ParentRunner.java:58)
	at org.junit.runners.ParentRunner$2.evaluate(ParentRunner.java:268)
	at org.junit.runners.ParentRunner.run(ParentRunner.java:363)
	at org.apache.maven.surefire.junit4.JUnit4Provider.execute(JUnit4Provider.java:283)
	at org.apache.maven.surefire.junit4.JUnit4Provider.executeWithRerun(JUnit4Provider.java:173)
	at org.apache.maven.surefire.junit4.JUnit4Provider.executeTestSet(JUnit4Provider.java:153)
	at org.apache.maven.surefire.junit4.JUnit4Provider.invoke(JUnit4Provider.java:128)
	at org.apache.maven.surefire.booter.ForkedBooter.invokeProviderInSameClassLoader(ForkedBooter.java:203)
	at org.apache.maven.surefire.booter.ForkedBooter.runSuitesInProcess(ForkedBooter.java:155)
	at org.apache.maven.surefire.booter.ForkedBooter.main(ForkedBooter.java:103)

testUnambiguousPartialLongOption4(org.apache.commons.cli.bug.BugCLI252Test)  Time elapsed: 0.001 sec  <<< ERROR!
java.lang.NullPointerException: null
	at org.apache.commons.cli.OptionValidator.validateOption(OptionValidator.java:10)
	at org.apache.commons.cli.Option.<init>(Option.java:146)
	at org.apache.commons.cli.Option.<init>(Option.java:113)
	at org.apache.commons.cli.OptionBuilder.create(OptionBuilder.java:376)
	at org.apache.commons.cli.OptionBuilder.create(OptionBuilder.java:357)
	at org.apache.commons.cli.ParserTestCase.testUnambiguousPartialLongOption4(ParserTestCase.java:537)
	at sun.reflect.NativeMethodAccessorImpl.invoke0(Native Method)
	at sun.reflect.NativeMethodAccessorImpl.invoke(NativeMethodAccessorImpl.java:57)
	at sun.reflect.DelegatingMethodAccessorImpl.invoke(DelegatingMethodAccessorImpl.java:43)
	at java.lang.reflect.Method.invoke(Method.java:606)
	at org.junit.runners.model.FrameworkMethod$1.runReflectiveCall(FrameworkMethod.java:50)
	at org.junit.internal.runners.model.ReflectiveCallable.run(ReflectiveCallable.java:12)
	at org.junit.runners.model.FrameworkMethod.invokeExplosively(FrameworkMethod.java:47)
	at org.junit.internal.runners.statements.InvokeMethod.evaluate(InvokeMethod.java:17)
	at org.junit.internal.runners.statements.RunBefores.evaluate(RunBefores.java:26)
	at org.junit.runners.ParentRunner.runLeaf(ParentRunner.java:325)
	at org.junit.runners.BlockJUnit4ClassRunner.runChild(BlockJUnit4ClassRunner.java:78)
	at org.junit.runners.BlockJUnit4ClassRunner.runChild(BlockJUnit4ClassRunner.java:57)
	at org.junit.runners.ParentRunner$3.run(ParentRunner.java:290)
	at org.junit.runners.ParentRunner$1.schedule(ParentRunner.java:71)
	at org.junit.runners.ParentRunner.runChildren(ParentRunner.java:288)
	at org.junit.runners.ParentRunner.access$000(ParentRunner.java:58)
	at org.junit.runners.ParentRunner$2.evaluate(ParentRunner.java:268)
	at org.junit.runners.ParentRunner.run(ParentRunner.java:363)
	at org.apache.maven.surefire.junit4.JUnit4Provider.execute(JUnit4Provider.java:283)
	at org.apache.maven.surefire.junit4.JUnit4Provider.executeWithRerun(JUnit4Provider.java:173)
	at org.apache.maven.surefire.junit4.JUnit4Provider.executeTestSet(JUnit4Provider.java:153)
	at org.apache.maven.surefire.junit4.JUnit4Provider.invoke(JUnit4Provider.java:128)
	at org.apache.maven.surefire.booter.ForkedBooter.invokeProviderInSameClassLoader(ForkedBooter.java:203)
	at org.apache.maven.surefire.booter.ForkedBooter.runSuitesInProcess(ForkedBooter.java:155)
	at org.apache.maven.surefire.booter.ForkedBooter.main(ForkedBooter.java:103)

Running org.apache.commons.cli.bug.BugCLI162Test
Tests run: 4, Failures: 0, Errors: 1, Skipped: 0, Time elapsed: 0 sec <<< FAILURE! - in org.apache.commons.cli.bug.BugCLI162Test
testPrintHelpLongLines(org.apache.commons.cli.bug.BugCLI162Test)  Time elapsed: 0 sec  <<< ERROR!
java.lang.NullPointerException: null
	at org.apache.commons.cli.OptionValidator.validateOption(OptionValidator.java:10)
	at org.apache.commons.cli.Option.<init>(Option.java:146)
	at org.apache.commons.cli.bug.BugCLI162Test.testPrintHelpLongLines(BugCLI162Test.java:243)

Running org.apache.commons.cli.bug.BugCLI71Test
Tests run: 4, Failures: 0, Errors: 0, Skipped: 0, Time elapsed: 0 sec - in org.apache.commons.cli.bug.BugCLI71Test
Running org.apache.commons.cli.bug.BugCLI18Test
Tests run: 1, Failures: 0, Errors: 1, Skipped: 0, Time elapsed: 0 sec <<< FAILURE! - in org.apache.commons.cli.bug.BugCLI18Test
testCLI18(org.apache.commons.cli.bug.BugCLI18Test)  Time elapsed: 0 sec  <<< ERROR!
java.lang.NullPointerException: null
	at org.apache.commons.cli.OptionValidator.validateOption(OptionValidator.java:10)
	at org.apache.commons.cli.Option.<init>(Option.java:146)
	at org.apache.commons.cli.bug.BugCLI18Test.testCLI18(BugCLI18Test.java:38)

Running org.apache.commons.cli.bug.BugCLI133Test
Tests run: 1, Failures: 0, Errors: 0, Skipped: 0, Time elapsed: 0 sec - in org.apache.commons.cli.bug.BugCLI133Test
Running org.apache.commons.cli.bug.BugCLI13Test
Tests run: 1, Failures: 0, Errors: 0, Skipped: 0, Time elapsed: 0.001 sec - in org.apache.commons.cli.bug.BugCLI13Test
Running org.apache.commons.cli.bug.BugCLI148Test
Tests run: 2, Failures: 0, Errors: 0, Skipped: 0, Time elapsed: 0 sec - in org.apache.commons.cli.bug.BugCLI148Test
Running org.apache.commons.cli.bug.BugsTest
Tests run: 12, Failures: 0, Errors: 1, Skipped: 0, Time elapsed: 0.001 sec <<< FAILURE! - in org.apache.commons.cli.bug.BugsTest
test11457(org.apache.commons.cli.bug.BugsTest)  Time elapsed: 0 sec  <<< ERROR!
java.lang.NullPointerException: null
	at org.apache.commons.cli.OptionValidator.validateOption(OptionValidator.java:10)
	at org.apache.commons.cli.Option.<init>(Option.java:146)
	at org.apache.commons.cli.Option.<init>(Option.java:113)
	at org.apache.commons.cli.OptionBuilder.create(OptionBuilder.java:376)
	at org.apache.commons.cli.OptionBuilder.create(OptionBuilder.java:357)
	at org.apache.commons.cli.bug.BugsTest.test11457(BugsTest.java:51)

Running org.apache.commons.cli.HelpFormatterTest
Tests run: 25, Failures: 0, Errors: 4, Skipped: 0, Time elapsed: 0.008 sec <<< FAILURE! - in org.apache.commons.cli.HelpFormatterTest
testUsageWithLongOptSeparator(org.apache.commons.cli.HelpFormatterTest)  Time elapsed: 0 sec  <<< ERROR!
java.lang.NullPointerException: null
	at org.apache.commons.cli.OptionValidator.validateOption(OptionValidator.java:10)
	at org.apache.commons.cli.Option$Builder.<init>(Option.java:821)
	at org.apache.commons.cli.Option$Builder.<init>(Option.java:783)
	at org.apache.commons.cli.Option.builder(Option.java:766)
	at org.apache.commons.cli.Option.builder(Option.java:752)
	at org.apache.commons.cli.HelpFormatterTest.testUsageWithLongOptSeparator(HelpFormatterTest.java:599)

testHelpWithLongOptSeparator(org.apache.commons.cli.HelpFormatterTest)  Time elapsed: 0 sec  <<< ERROR!
java.lang.NullPointerException: null
	at org.apache.commons.cli.OptionValidator.validateOption(OptionValidator.java:10)
	at org.apache.commons.cli.Option$Builder.<init>(Option.java:821)
	at org.apache.commons.cli.Option$Builder.<init>(Option.java:783)
	at org.apache.commons.cli.Option.builder(Option.java:766)
	at org.apache.commons.cli.Option.builder(Option.java:752)
	at org.apache.commons.cli.HelpFormatterTest.testHelpWithLongOptSeparator(HelpFormatterTest.java:572)

testOptionWithoutShortFormat(org.apache.commons.cli.HelpFormatterTest)  Time elapsed: 0 sec  <<< ERROR!
java.lang.NullPointerException: null
	at org.apache.commons.cli.OptionValidator.validateOption(OptionValidator.java:10)
	at org.apache.commons.cli.Option.<init>(Option.java:146)
	at org.apache.commons.cli.HelpFormatterTest.testOptionWithoutShortFormat(HelpFormatterTest.java:480)

testOptionWithoutShortFormat2(org.apache.commons.cli.HelpFormatterTest)  Time elapsed: 0 sec  <<< ERROR!
java.lang.NullPointerException: null
	at org.apache.commons.cli.OptionValidator.validateOption(OptionValidator.java:10)
	at org.apache.commons.cli.Option$Builder.<init>(Option.java:821)
	at org.apache.commons.cli.Option$Builder.<init>(Option.java:783)
	at org.apache.commons.cli.Option.builder(Option.java:766)
	at org.apache.commons.cli.Option.builder(Option.java:752)
	at org.apache.commons.cli.HelpFormatterTest.testOptionWithoutShortFormat2(HelpFormatterTest.java:528)

Running org.apache.commons.cli.OptionBuilderTest
Tests run: 9, Failures: 3, Errors: 0, Skipped: 0, Time elapsed: 0.002 sec <<< FAILURE! - in org.apache.commons.cli.OptionBuilderTest
testBuilderIsResettedAlways(org.apache.commons.cli.OptionBuilderTest)  Time elapsed: 0 sec  <<< FAILURE!
java.lang.AssertionError: IllegalArgumentException expected
	at org.junit.Assert.fail(Assert.java:88)
	at org.apache.commons.cli.OptionBuilderTest.testBuilderIsResettedAlways(OptionBuilderTest.java:181)

testIllegalOptions(org.apache.commons.cli.OptionBuilderTest)  Time elapsed: 0.001 sec  <<< FAILURE!
java.lang.AssertionError: IllegalArgumentException not caught
	at org.junit.Assert.fail(Assert.java:88)
	at org.apache.commons.cli.OptionBuilderTest.testIllegalOptions(OptionBuilderTest.java:135)

testSpecialOptChars(org.apache.commons.cli.OptionBuilderTest)  Time elapsed: 0 sec  <<< FAILURE!
java.lang.AssertionError: IllegalArgumentException not caught
	at org.junit.Assert.fail(Assert.java:88)
	at org.apache.commons.cli.OptionBuilderTest.testSpecialOptChars(OptionBuilderTest.java:115)

Running org.apache.commons.cli.PosixParserTest
Tests run: 58, Failures: 0, Errors: 9, Skipped: 0, Time elapsed: 0.027 sec <<< FAILURE! - in org.apache.commons.cli.PosixParserTest
testOptionGroupLong(org.apache.commons.cli.PosixParserTest)  Time elapsed: 0.001 sec  <<< ERROR!
java.lang.NullPointerException: null
	at org.apache.commons.cli.OptionValidator.validateOption(OptionValidator.java:10)
	at org.apache.commons.cli.Option.<init>(Option.java:146)
	at org.apache.commons.cli.Option.<init>(Option.java:113)
	at org.apache.commons.cli.OptionBuilder.create(OptionBuilder.java:376)
	at org.apache.commons.cli.OptionBuilder.create(OptionBuilder.java:357)
	at org.apache.commons.cli.ParserTestCase.testOptionGroupLong(ParserTestCase.java:798)
	at sun.reflect.NativeMethodAccessorImpl.invoke0(Native Method)
	at sun.reflect.NativeMethodAccessorImpl.invoke(NativeMethodAccessorImpl.java:57)
	at sun.reflect.DelegatingMethodAccessorImpl.invoke(DelegatingMethodAccessorImpl.java:43)
	at java.lang.reflect.Method.invoke(Method.java:606)
	at org.junit.runners.model.FrameworkMethod$1.runReflectiveCall(FrameworkMethod.java:50)
	at org.junit.internal.runners.model.ReflectiveCallable.run(ReflectiveCallable.java:12)
	at org.junit.runners.model.FrameworkMethod.invokeExplosively(FrameworkMethod.java:47)
	at org.junit.internal.runners.statements.InvokeMethod.evaluate(InvokeMethod.java:17)
	at org.junit.internal.runners.statements.RunBefores.evaluate(RunBefores.java:26)
	at org.junit.runners.ParentRunner.runLeaf(ParentRunner.java:325)
	at org.junit.runners.BlockJUnit4ClassRunner.runChild(BlockJUnit4ClassRunner.java:78)
	at org.junit.runners.BlockJUnit4ClassRunner.runChild(BlockJUnit4ClassRunner.java:57)
	at org.junit.runners.ParentRunner$3.run(ParentRunner.java:290)
	at org.junit.runners.ParentRunner$1.schedule(ParentRunner.java:71)
	at org.junit.runners.ParentRunner.runChildren(ParentRunner.java:288)
	at org.junit.runners.ParentRunner.access$000(ParentRunner.java:58)
	at org.junit.runners.ParentRunner$2.evaluate(ParentRunner.java:268)
	at org.junit.runners.ParentRunner.run(ParentRunner.java:363)
	at org.apache.maven.surefire.junit4.JUnit4Provider.execute(JUnit4Provider.java:283)
	at org.apache.maven.surefire.junit4.JUnit4Provider.executeWithRerun(JUnit4Provider.java:173)
	at org.apache.maven.surefire.junit4.JUnit4Provider.executeTestSet(JUnit4Provider.java:153)
	at org.apache.maven.surefire.junit4.JUnit4Provider.invoke(JUnit4Provider.java:128)
	at org.apache.maven.surefire.booter.ForkedBooter.invokeProviderInSameClassLoader(ForkedBooter.java:203)
	at org.apache.maven.surefire.booter.ForkedBooter.runSuitesInProcess(ForkedBooter.java:155)
	at org.apache.maven.surefire.booter.ForkedBooter.main(ForkedBooter.java:103)

testPartialLongOptionSingleDash(org.apache.commons.cli.PosixParserTest)  Time elapsed: 0.001 sec  <<< ERROR!
java.lang.NullPointerException: null
	at org.apache.commons.cli.OptionValidator.validateOption(OptionValidator.java:10)
	at org.apache.commons.cli.Option.<init>(Option.java:146)
	at org.apache.commons.cli.Option.<init>(Option.java:113)
	at org.apache.commons.cli.OptionBuilder.create(OptionBuilder.java:376)
	at org.apache.commons.cli.OptionBuilder.create(OptionBuilder.java:357)
	at org.apache.commons.cli.ParserTestCase.testPartialLongOptionSingleDash(ParserTestCase.java:656)
	at sun.reflect.NativeMethodAccessorImpl.invoke0(Native Method)
	at sun.reflect.NativeMethodAccessorImpl.invoke(NativeMethodAccessorImpl.java:57)
	at sun.reflect.DelegatingMethodAccessorImpl.invoke(DelegatingMethodAccessorImpl.java:43)
	at java.lang.reflect.Method.invoke(Method.java:606)
	at org.junit.runners.model.FrameworkMethod$1.runReflectiveCall(FrameworkMethod.java:50)
	at org.junit.internal.runners.model.ReflectiveCallable.run(ReflectiveCallable.java:12)
	at org.junit.runners.model.FrameworkMethod.invokeExplosively(FrameworkMethod.java:47)
	at org.junit.internal.runners.statements.InvokeMethod.evaluate(InvokeMethod.java:17)
	at org.junit.internal.runners.statements.RunBefores.evaluate(RunBefores.java:26)
	at org.junit.runners.ParentRunner.runLeaf(ParentRunner.java:325)
	at org.junit.runners.BlockJUnit4ClassRunner.runChild(BlockJUnit4ClassRunner.java:78)
	at org.junit.runners.BlockJUnit4ClassRunner.runChild(BlockJUnit4ClassRunner.java:57)
	at org.junit.runners.ParentRunner$3.run(ParentRunner.java:290)
	at org.junit.runners.ParentRunner$1.schedule(ParentRunner.java:71)
	at org.junit.runners.ParentRunner.runChildren(ParentRunner.java:288)
	at org.junit.runners.ParentRunner.access$000(ParentRunner.java:58)
	at org.junit.runners.ParentRunner$2.evaluate(ParentRunner.java:268)
	at org.junit.runners.ParentRunner.run(ParentRunner.java:363)
	at org.apache.maven.surefire.junit4.JUnit4Provider.execute(JUnit4Provider.java:283)
	at org.apache.maven.surefire.junit4.JUnit4Provider.executeWithRerun(JUnit4Provider.java:173)
	at org.apache.maven.surefire.junit4.JUnit4Provider.executeTestSet(JUnit4Provider.java:153)
	at org.apache.maven.surefire.junit4.JUnit4Provider.invoke(JUnit4Provider.java:128)
	at org.apache.maven.surefire.booter.ForkedBooter.invokeProviderInSameClassLoader(ForkedBooter.java:203)
	at org.apache.maven.surefire.booter.ForkedBooter.runSuitesInProcess(ForkedBooter.java:155)
	at org.apache.maven.surefire.booter.ForkedBooter.main(ForkedBooter.java:103)

testPropertyOptionSingularValue(org.apache.commons.cli.PosixParserTest)  Time elapsed: 0 sec  <<< ERROR!
java.lang.NullPointerException: null
	at org.apache.commons.cli.OptionValidator.validateOption(OptionValidator.java:10)
	at org.apache.commons.cli.Option.<init>(Option.java:146)
	at org.apache.commons.cli.Option.<init>(Option.java:113)
	at org.apache.commons.cli.OptionBuilder.create(OptionBuilder.java:376)
	at org.apache.commons.cli.OptionBuilder.create(OptionBuilder.java:357)
	at org.apache.commons.cli.ParserTestCase.testPropertyOptionSingularValue(ParserTestCase.java:944)
	at sun.reflect.NativeMethodAccessorImpl.invoke0(Native Method)
	at sun.reflect.NativeMethodAccessorImpl.invoke(NativeMethodAccessorImpl.java:57)
	at sun.reflect.DelegatingMethodAccessorImpl.invoke(DelegatingMethodAccessorImpl.java:43)
	at java.lang.reflect.Method.invoke(Method.java:606)
	at org.junit.runners.model.FrameworkMethod$1.runReflectiveCall(FrameworkMethod.java:50)
	at org.junit.internal.runners.model.ReflectiveCallable.run(ReflectiveCallable.java:12)
	at org.junit.runners.model.FrameworkMethod.invokeExplosively(FrameworkMethod.java:47)
	at org.junit.internal.runners.statements.InvokeMethod.evaluate(InvokeMethod.java:17)
	at org.junit.internal.runners.statements.RunBefores.evaluate(RunBefores.java:26)
	at org.junit.runners.ParentRunner.runLeaf(ParentRunner.java:325)
	at org.junit.runners.BlockJUnit4ClassRunner.runChild(BlockJUnit4ClassRunner.java:78)
	at org.junit.runners.BlockJUnit4ClassRunner.runChild(BlockJUnit4ClassRunner.java:57)
	at org.junit.runners.ParentRunner$3.run(ParentRunner.java:290)
	at org.junit.runners.ParentRunner$1.schedule(ParentRunner.java:71)
	at org.junit.runners.ParentRunner.runChildren(ParentRunner.java:288)
	at org.junit.runners.ParentRunner.access$000(ParentRunner.java:58)
	at org.junit.runners.ParentRunner$2.evaluate(ParentRunner.java:268)
	at org.junit.runners.ParentRunner.run(ParentRunner.java:363)
	at org.apache.maven.surefire.junit4.JUnit4Provider.execute(JUnit4Provider.java:283)
	at org.apache.maven.surefire.junit4.JUnit4Provider.executeWithRerun(JUnit4Provider.java:173)
	at org.apache.maven.surefire.junit4.JUnit4Provider.executeTestSet(JUnit4Provider.java:153)
	at org.apache.maven.surefire.junit4.JUnit4Provider.invoke(JUnit4Provider.java:128)
	at org.apache.maven.surefire.booter.ForkedBooter.invokeProviderInSameClassLoader(ForkedBooter.java:203)
	at org.apache.maven.surefire.booter.ForkedBooter.runSuitesInProcess(ForkedBooter.java:155)
	at org.apache.maven.surefire.booter.ForkedBooter.main(ForkedBooter.java:103)

testAmbiguousPartialLongOption1(org.apache.commons.cli.PosixParserTest)  Time elapsed: 0 sec  <<< ERROR!
java.lang.NullPointerException: null
	at org.apache.commons.cli.OptionValidator.validateOption(OptionValidator.java:10)
	at org.apache.commons.cli.Option.<init>(Option.java:146)
	at org.apache.commons.cli.Option.<init>(Option.java:113)
	at org.apache.commons.cli.OptionBuilder.create(OptionBuilder.java:376)
	at org.apache.commons.cli.OptionBuilder.create(OptionBuilder.java:357)
	at org.apache.commons.cli.ParserTestCase.testAmbiguousPartialLongOption1(ParserTestCase.java:552)
	at sun.reflect.NativeMethodAccessorImpl.invoke0(Native Method)
	at sun.reflect.NativeMethodAccessorImpl.invoke(NativeMethodAccessorImpl.java:57)
	at sun.reflect.DelegatingMethodAccessorImpl.invoke(DelegatingMethodAccessorImpl.java:43)
	at java.lang.reflect.Method.invoke(Method.java:606)
	at org.junit.runners.model.FrameworkMethod$1.runReflectiveCall(FrameworkMethod.java:50)
	at org.junit.internal.runners.model.ReflectiveCallable.run(ReflectiveCallable.java:12)
	at org.junit.runners.model.FrameworkMethod.invokeExplosively(FrameworkMethod.java:47)
	at org.junit.internal.runners.statements.InvokeMethod.evaluate(InvokeMethod.java:17)
	at org.junit.internal.runners.statements.RunBefores.evaluate(RunBefores.java:26)
	at org.junit.runners.ParentRunner.runLeaf(ParentRunner.java:325)
	at org.junit.runners.BlockJUnit4ClassRunner.runChild(BlockJUnit4ClassRunner.java:78)
	at org.junit.runners.BlockJUnit4ClassRunner.runChild(BlockJUnit4ClassRunner.java:57)
	at org.junit.runners.ParentRunner$3.run(ParentRunner.java:290)
	at org.junit.runners.ParentRunner$1.schedule(ParentRunner.java:71)
	at org.junit.runners.ParentRunner.runChildren(ParentRunner.java:288)
	at org.junit.runners.ParentRunner.access$000(ParentRunner.java:58)
	at org.junit.runners.ParentRunner$2.evaluate(ParentRunner.java:268)
	at org.junit.runners.ParentRunner.run(ParentRunner.java:363)
	at org.apache.maven.surefire.junit4.JUnit4Provider.execute(JUnit4Provider.java:283)
	at org.apache.maven.surefire.junit4.JUnit4Provider.executeWithRerun(JUnit4Provider.java:173)
	at org.apache.maven.surefire.junit4.JUnit4Provider.executeTestSet(JUnit4Provider.java:153)
	at org.apache.maven.surefire.junit4.JUnit4Provider.invoke(JUnit4Provider.java:128)
	at org.apache.maven.surefire.booter.ForkedBooter.invokeProviderInSameClassLoader(ForkedBooter.java:203)
	at org.apache.maven.surefire.booter.ForkedBooter.runSuitesInProcess(ForkedBooter.java:155)
	at org.apache.maven.surefire.booter.ForkedBooter.main(ForkedBooter.java:103)

testAmbiguousPartialLongOption2(org.apache.commons.cli.PosixParserTest)  Time elapsed: 0.001 sec  <<< ERROR!
java.lang.NullPointerException: null
	at org.apache.commons.cli.OptionValidator.validateOption(OptionValidator.java:10)
	at org.apache.commons.cli.Option.<init>(Option.java:146)
	at org.apache.commons.cli.Option.<init>(Option.java:113)
	at org.apache.commons.cli.OptionBuilder.create(OptionBuilder.java:376)
	at org.apache.commons.cli.OptionBuilder.create(OptionBuilder.java:357)
	at org.apache.commons.cli.ParserTestCase.testAmbiguousPartialLongOption2(ParserTestCase.java:578)
	at sun.reflect.NativeMethodAccessorImpl.invoke0(Native Method)
	at sun.reflect.NativeMethodAccessorImpl.invoke(NativeMethodAccessorImpl.java:57)
	at sun.reflect.DelegatingMethodAccessorImpl.invoke(DelegatingMethodAccessorImpl.java:43)
	at java.lang.reflect.Method.invoke(Method.java:606)
	at org.junit.runners.model.FrameworkMethod$1.runReflectiveCall(FrameworkMethod.java:50)
	at org.junit.internal.runners.model.ReflectiveCallable.run(ReflectiveCallable.java:12)
	at org.junit.runners.model.FrameworkMethod.invokeExplosively(FrameworkMethod.java:47)
	at org.junit.internal.runners.statements.InvokeMethod.evaluate(InvokeMethod.java:17)
	at org.junit.internal.runners.statements.RunBefores.evaluate(RunBefores.java:26)
	at org.junit.runners.ParentRunner.runLeaf(ParentRunner.java:325)
	at org.junit.runners.BlockJUnit4ClassRunner.runChild(BlockJUnit4ClassRunner.java:78)
	at org.junit.runners.BlockJUnit4ClassRunner.runChild(BlockJUnit4ClassRunner.java:57)
	at org.junit.runners.ParentRunner$3.run(ParentRunner.java:290)
	at org.junit.runners.ParentRunner$1.schedule(ParentRunner.java:71)
	at org.junit.runners.ParentRunner.runChildren(ParentRunner.java:288)
	at org.junit.runners.ParentRunner.access$000(ParentRunner.java:58)
	at org.junit.runners.ParentRunner$2.evaluate(ParentRunner.java:268)
	at org.junit.runners.ParentRunner.run(ParentRunner.java:363)
	at org.apache.maven.surefire.junit4.JUnit4Provider.execute(JUnit4Provider.java:283)
	at org.apache.maven.surefire.junit4.JUnit4Provider.executeWithRerun(JUnit4Provider.java:173)
	at org.apache.maven.surefire.junit4.JUnit4Provider.executeTestSet(JUnit4Provider.java:153)
	at org.apache.maven.surefire.junit4.JUnit4Provider.invoke(JUnit4Provider.java:128)
	at org.apache.maven.surefire.booter.ForkedBooter.invokeProviderInSameClassLoader(ForkedBooter.java:203)
	at org.apache.maven.surefire.booter.ForkedBooter.runSuitesInProcess(ForkedBooter.java:155)
	at org.apache.maven.surefire.booter.ForkedBooter.main(ForkedBooter.java:103)

testAmbiguousPartialLongOption3(org.apache.commons.cli.PosixParserTest)  Time elapsed: 0 sec  <<< ERROR!
java.lang.NullPointerException: null
	at org.apache.commons.cli.OptionValidator.validateOption(OptionValidator.java:10)
	at org.apache.commons.cli.Option.<init>(Option.java:146)
	at org.apache.commons.cli.Option.<init>(Option.java:113)
	at org.apache.commons.cli.OptionBuilder.create(OptionBuilder.java:376)
	at org.apache.commons.cli.OptionBuilder.create(OptionBuilder.java:357)
	at org.apache.commons.cli.ParserTestCase.testAmbiguousPartialLongOption3(ParserTestCase.java:604)
	at sun.reflect.NativeMethodAccessorImpl.invoke0(Native Method)
	at sun.reflect.NativeMethodAccessorImpl.invoke(NativeMethodAccessorImpl.java:57)
	at sun.reflect.DelegatingMethodAccessorImpl.invoke(DelegatingMethodAccessorImpl.java:43)
	at java.lang.reflect.Method.invoke(Method.java:606)
	at org.junit.runners.model.FrameworkMethod$1.runReflectiveCall(FrameworkMethod.java:50)
	at org.junit.internal.runners.model.ReflectiveCallable.run(ReflectiveCallable.java:12)
	at org.junit.runners.model.FrameworkMethod.invokeExplosively(FrameworkMethod.java:47)
	at org.junit.internal.runners.statements.InvokeMethod.evaluate(InvokeMethod.java:17)
	at org.junit.internal.runners.statements.RunBefores.evaluate(RunBefores.java:26)
	at org.junit.runners.ParentRunner.runLeaf(ParentRunner.java:325)
	at org.junit.runners.BlockJUnit4ClassRunner.runChild(BlockJUnit4ClassRunner.java:78)
	at org.junit.runners.BlockJUnit4ClassRunner.runChild(BlockJUnit4ClassRunner.java:57)
	at org.junit.runners.ParentRunner$3.run(ParentRunner.java:290)
	at org.junit.runners.ParentRunner$1.schedule(ParentRunner.java:71)
	at org.junit.runners.ParentRunner.runChildren(ParentRunner.java:288)
	at org.junit.runners.ParentRunner.access$000(ParentRunner.java:58)
	at org.junit.runners.ParentRunner$2.evaluate(ParentRunner.java:268)
	at org.junit.runners.ParentRunner.run(ParentRunner.java:363)
	at org.apache.maven.surefire.junit4.JUnit4Provider.execute(JUnit4Provider.java:283)
	at org.apache.maven.surefire.junit4.JUnit4Provider.executeWithRerun(JUnit4Provider.java:173)
	at org.apache.maven.surefire.junit4.JUnit4Provider.executeTestSet(JUnit4Provider.java:153)
	at org.apache.maven.surefire.junit4.JUnit4Provider.invoke(JUnit4Provider.java:128)
	at org.apache.maven.surefire.booter.ForkedBooter.invokeProviderInSameClassLoader(ForkedBooter.java:203)
	at org.apache.maven.surefire.booter.ForkedBooter.runSuitesInProcess(ForkedBooter.java:155)
	at org.apache.maven.surefire.booter.ForkedBooter.main(ForkedBooter.java:103)

testUnambiguousPartialLongOption1(org.apache.commons.cli.PosixParserTest)  Time elapsed: 0.001 sec  <<< ERROR!
java.lang.NullPointerException: null
	at org.apache.commons.cli.OptionValidator.validateOption(OptionValidator.java:10)
	at org.apache.commons.cli.Option.<init>(Option.java:146)
	at org.apache.commons.cli.Option.<init>(Option.java:113)
	at org.apache.commons.cli.OptionBuilder.create(OptionBuilder.java:376)
	at org.apache.commons.cli.OptionBuilder.create(OptionBuilder.java:357)
	at org.apache.commons.cli.ParserTestCase.testUnambiguousPartialLongOption1(ParserTestCase.java:494)
	at sun.reflect.NativeMethodAccessorImpl.invoke0(Native Method)
	at sun.reflect.NativeMethodAccessorImpl.invoke(NativeMethodAccessorImpl.java:57)
	at sun.reflect.DelegatingMethodAccessorImpl.invoke(DelegatingMethodAccessorImpl.java:43)
	at java.lang.reflect.Method.invoke(Method.java:606)
	at org.junit.runners.model.FrameworkMethod$1.runReflectiveCall(FrameworkMethod.java:50)
	at org.junit.internal.runners.model.ReflectiveCallable.run(ReflectiveCallable.java:12)
	at org.junit.runners.model.FrameworkMethod.invokeExplosively(FrameworkMethod.java:47)
	at org.junit.internal.runners.statements.InvokeMethod.evaluate(InvokeMethod.java:17)
	at org.junit.internal.runners.statements.RunBefores.evaluate(RunBefores.java:26)
	at org.junit.runners.ParentRunner.runLeaf(ParentRunner.java:325)
	at org.junit.runners.BlockJUnit4ClassRunner.runChild(BlockJUnit4ClassRunner.java:78)
	at org.junit.runners.BlockJUnit4ClassRunner.runChild(BlockJUnit4ClassRunner.java:57)
	at org.junit.runners.ParentRunner$3.run(ParentRunner.java:290)
	at org.junit.runners.ParentRunner$1.schedule(ParentRunner.java:71)
	at org.junit.runners.ParentRunner.runChildren(ParentRunner.java:288)
	at org.junit.runners.ParentRunner.access$000(ParentRunner.java:58)
	at org.junit.runners.ParentRunner$2.evaluate(ParentRunner.java:268)
	at org.junit.runners.ParentRunner.run(ParentRunner.java:363)
	at org.apache.maven.surefire.junit4.JUnit4Provider.execute(JUnit4Provider.java:283)
	at org.apache.maven.surefire.junit4.JUnit4Provider.executeWithRerun(JUnit4Provider.java:173)
	at org.apache.maven.surefire.junit4.JUnit4Provider.executeTestSet(JUnit4Provider.java:153)
	at org.apache.maven.surefire.junit4.JUnit4Provider.invoke(JUnit4Provider.java:128)
	at org.apache.maven.surefire.booter.ForkedBooter.invokeProviderInSameClassLoader(ForkedBooter.java:203)
	at org.apache.maven.surefire.booter.ForkedBooter.runSuitesInProcess(ForkedBooter.java:155)
	at org.apache.maven.surefire.booter.ForkedBooter.main(ForkedBooter.java:103)

testUnambiguousPartialLongOption2(org.apache.commons.cli.PosixParserTest)  Time elapsed: 0 sec  <<< ERROR!
java.lang.NullPointerException: null
	at org.apache.commons.cli.OptionValidator.validateOption(OptionValidator.java:10)
	at org.apache.commons.cli.Option.<init>(Option.java:146)
	at org.apache.commons.cli.Option.<init>(Option.java:113)
	at org.apache.commons.cli.OptionBuilder.create(OptionBuilder.java:376)
	at org.apache.commons.cli.OptionBuilder.create(OptionBuilder.java:357)
	at org.apache.commons.cli.ParserTestCase.testUnambiguousPartialLongOption2(ParserTestCase.java:508)
	at sun.reflect.NativeMethodAccessorImpl.invoke0(Native Method)
	at sun.reflect.NativeMethodAccessorImpl.invoke(NativeMethodAccessorImpl.java:57)
	at sun.reflect.DelegatingMethodAccessorImpl.invoke(DelegatingMethodAccessorImpl.java:43)
	at java.lang.reflect.Method.invoke(Method.java:606)
	at org.junit.runners.model.FrameworkMethod$1.runReflectiveCall(FrameworkMethod.java:50)
	at org.junit.internal.runners.model.ReflectiveCallable.run(ReflectiveCallable.java:12)
	at org.junit.runners.model.FrameworkMethod.invokeExplosively(FrameworkMethod.java:47)
	at org.junit.internal.runners.statements.InvokeMethod.evaluate(InvokeMethod.java:17)
	at org.junit.internal.runners.statements.RunBefores.evaluate(RunBefores.java:26)
	at org.junit.runners.ParentRunner.runLeaf(ParentRunner.java:325)
	at org.junit.runners.BlockJUnit4ClassRunner.runChild(BlockJUnit4ClassRunner.java:78)
	at org.junit.runners.BlockJUnit4ClassRunner.runChild(BlockJUnit4ClassRunner.java:57)
	at org.junit.runners.ParentRunner$3.run(ParentRunner.java:290)
	at org.junit.runners.ParentRunner$1.schedule(ParentRunner.java:71)
	at org.junit.runners.ParentRunner.runChildren(ParentRunner.java:288)
	at org.junit.runners.ParentRunner.access$000(ParentRunner.java:58)
	at org.junit.runners.ParentRunner$2.evaluate(ParentRunner.java:268)
	at org.junit.runners.ParentRunner.run(ParentRunner.java:363)
	at org.apache.maven.surefire.junit4.JUnit4Provider.execute(JUnit4Provider.java:283)
	at org.apache.maven.surefire.junit4.JUnit4Provider.executeWithRerun(JUnit4Provider.java:173)
	at org.apache.maven.surefire.junit4.JUnit4Provider.executeTestSet(JUnit4Provider.java:153)
	at org.apache.maven.surefire.junit4.JUnit4Provider.invoke(JUnit4Provider.java:128)
	at org.apache.maven.surefire.booter.ForkedBooter.invokeProviderInSameClassLoader(ForkedBooter.java:203)
	at org.apache.maven.surefire.booter.ForkedBooter.runSuitesInProcess(ForkedBooter.java:155)
	at org.apache.maven.surefire.booter.ForkedBooter.main(ForkedBooter.java:103)

testUnambiguousPartialLongOption3(org.apache.commons.cli.PosixParserTest)  Time elapsed: 0.001 sec  <<< ERROR!
java.lang.NullPointerException: null
	at org.apache.commons.cli.OptionValidator.validateOption(OptionValidator.java:10)
	at org.apache.commons.cli.Option.<init>(Option.java:146)
	at org.apache.commons.cli.Option.<init>(Option.java:113)
	at org.apache.commons.cli.OptionBuilder.create(OptionBuilder.java:376)
	at org.apache.commons.cli.OptionBuilder.create(OptionBuilder.java:357)
	at org.apache.commons.cli.ParserTestCase.testUnambiguousPartialLongOption3(ParserTestCase.java:522)
	at sun.reflect.NativeMethodAccessorImpl.invoke0(Native Method)
	at sun.reflect.NativeMethodAccessorImpl.invoke(NativeMethodAccessorImpl.java:57)
	at sun.reflect.DelegatingMethodAccessorImpl.invoke(DelegatingMethodAccessorImpl.java:43)
	at java.lang.reflect.Method.invoke(Method.java:606)
	at org.junit.runners.model.FrameworkMethod$1.runReflectiveCall(FrameworkMethod.java:50)
	at org.junit.internal.runners.model.ReflectiveCallable.run(ReflectiveCallable.java:12)
	at org.junit.runners.model.FrameworkMethod.invokeExplosively(FrameworkMethod.java:47)
	at org.junit.internal.runners.statements.InvokeMethod.evaluate(InvokeMethod.java:17)
	at org.junit.internal.runners.statements.RunBefores.evaluate(RunBefores.java:26)
	at org.junit.runners.ParentRunner.runLeaf(ParentRunner.java:325)
	at org.junit.runners.BlockJUnit4ClassRunner.runChild(BlockJUnit4ClassRunner.java:78)
	at org.junit.runners.BlockJUnit4ClassRunner.runChild(BlockJUnit4ClassRunner.java:57)
	at org.junit.runners.ParentRunner$3.run(ParentRunner.java:290)
	at org.junit.runners.ParentRunner$1.schedule(ParentRunner.java:71)
	at org.junit.runners.ParentRunner.runChildren(ParentRunner.java:288)
	at org.junit.runners.ParentRunner.access$000(ParentRunner.java:58)
	at org.junit.runners.ParentRunner$2.evaluate(ParentRunner.java:268)
	at org.junit.runners.ParentRunner.run(ParentRunner.java:363)
	at org.apache.maven.surefire.junit4.JUnit4Provider.execute(JUnit4Provider.java:283)
	at org.apache.maven.surefire.junit4.JUnit4Provider.executeWithRerun(JUnit4Provider.java:173)
	at org.apache.maven.surefire.junit4.JUnit4Provider.executeTestSet(JUnit4Provider.java:153)
	at org.apache.maven.surefire.junit4.JUnit4Provider.invoke(JUnit4Provider.java:128)
	at org.apache.maven.surefire.booter.ForkedBooter.invokeProviderInSameClassLoader(ForkedBooter.java:203)
	at org.apache.maven.surefire.booter.ForkedBooter.runSuitesInProcess(ForkedBooter.java:155)
	at org.apache.maven.surefire.booter.ForkedBooter.main(ForkedBooter.java:103)

Running org.apache.commons.cli.UtilTest
Tests run: 2, Failures: 0, Errors: 0, Skipped: 0, Time elapsed: 0 sec - in org.apache.commons.cli.UtilTest
Running org.apache.commons.cli.OptionGroupTest
Tests run: 13, Failures: 0, Errors: 13, Skipped: 0, Time elapsed: 0.003 sec <<< FAILURE! - in org.apache.commons.cli.OptionGroupTest
testTwoOptionsFromDifferentGroup(org.apache.commons.cli.OptionGroupTest)  Time elapsed: 0 sec  <<< ERROR!
java.lang.NullPointerException: null
	at org.apache.commons.cli.OptionValidator.validateOption(OptionValidator.java:10)
	at org.apache.commons.cli.Option.<init>(Option.java:146)
	at org.apache.commons.cli.OptionGroupTest.setUp(OptionGroupTest.java:54)

testNoOptionsExtraArgs(org.apache.commons.cli.OptionGroupTest)  Time elapsed: 0 sec  <<< ERROR!
java.lang.NullPointerException: null
	at org.apache.commons.cli.OptionValidator.validateOption(OptionValidator.java:10)
	at org.apache.commons.cli.Option.<init>(Option.java:146)
	at org.apache.commons.cli.OptionGroupTest.setUp(OptionGroupTest.java:54)

testGetNames(org.apache.commons.cli.OptionGroupTest)  Time elapsed: 0 sec  <<< ERROR!
java.lang.NullPointerException: null
	at org.apache.commons.cli.OptionValidator.validateOption(OptionValidator.java:10)
	at org.apache.commons.cli.Option.<init>(Option.java:146)
	at org.apache.commons.cli.OptionGroupTest.setUp(OptionGroupTest.java:54)

testTwoValidOptions(org.apache.commons.cli.OptionGroupTest)  Time elapsed: 0 sec  <<< ERROR!
java.lang.NullPointerException: null
	at org.apache.commons.cli.OptionValidator.validateOption(OptionValidator.java:10)
	at org.apache.commons.cli.Option.<init>(Option.java:146)
	at org.apache.commons.cli.OptionGroupTest.setUp(OptionGroupTest.java:54)

testSingleOption(org.apache.commons.cli.OptionGroupTest)  Time elapsed: 0 sec  <<< ERROR!
java.lang.NullPointerException: null
	at org.apache.commons.cli.OptionValidator.validateOption(OptionValidator.java:10)
	at org.apache.commons.cli.Option.<init>(Option.java:146)
	at org.apache.commons.cli.OptionGroupTest.setUp(OptionGroupTest.java:54)

testToString(org.apache.commons.cli.OptionGroupTest)  Time elapsed: 0 sec  <<< ERROR!
java.lang.NullPointerException: null
	at org.apache.commons.cli.OptionValidator.validateOption(OptionValidator.java:10)
	at org.apache.commons.cli.Option.<init>(Option.java:146)
	at org.apache.commons.cli.OptionGroupTest.setUp(OptionGroupTest.java:54)

testTwoOptionsFromGroup(org.apache.commons.cli.OptionGroupTest)  Time elapsed: 0 sec  <<< ERROR!
java.lang.NullPointerException: null
	at org.apache.commons.cli.OptionValidator.validateOption(OptionValidator.java:10)
	at org.apache.commons.cli.Option.<init>(Option.java:146)
	at org.apache.commons.cli.OptionGroupTest.setUp(OptionGroupTest.java:54)

testTwoValidLongOptions(org.apache.commons.cli.OptionGroupTest)  Time elapsed: 0 sec  <<< ERROR!
java.lang.NullPointerException: null
	at org.apache.commons.cli.OptionValidator.validateOption(OptionValidator.java:10)
	at org.apache.commons.cli.Option.<init>(Option.java:146)
	at org.apache.commons.cli.OptionGroupTest.setUp(OptionGroupTest.java:54)

testSingleOptionFromGroup(org.apache.commons.cli.OptionGroupTest)  Time elapsed: 0 sec  <<< ERROR!
java.lang.NullPointerException: null
	at org.apache.commons.cli.OptionValidator.validateOption(OptionValidator.java:10)
	at org.apache.commons.cli.Option.<init>(Option.java:146)
	at org.apache.commons.cli.OptionGroupTest.setUp(OptionGroupTest.java:54)

testTwoOptionsFromGroupWithProperties(org.apache.commons.cli.OptionGroupTest)  Time elapsed: 0 sec  <<< ERROR!
java.lang.NullPointerException: null
	at org.apache.commons.cli.OptionValidator.validateOption(OptionValidator.java:10)
	at org.apache.commons.cli.Option.<init>(Option.java:146)
	at org.apache.commons.cli.OptionGroupTest.setUp(OptionGroupTest.java:54)

testTwoLongOptionsFromGroup(org.apache.commons.cli.OptionGroupTest)  Time elapsed: 0 sec  <<< ERROR!
java.lang.NullPointerException: null
	at org.apache.commons.cli.OptionValidator.validateOption(OptionValidator.java:10)
	at org.apache.commons.cli.Option.<init>(Option.java:146)
	at org.apache.commons.cli.OptionGroupTest.setUp(OptionGroupTest.java:54)

testSingleLongOption(org.apache.commons.cli.OptionGroupTest)  Time elapsed: 0 sec  <<< ERROR!
java.lang.NullPointerException: null
	at org.apache.commons.cli.OptionValidator.validateOption(OptionValidator.java:10)
	at org.apache.commons.cli.Option.<init>(Option.java:146)
	at org.apache.commons.cli.OptionGroupTest.setUp(OptionGroupTest.java:54)

testValidLongOnlyOptions(org.apache.commons.cli.OptionGroupTest)  Time elapsed: 0.001 sec  <<< ERROR!
java.lang.NullPointerException: null
	at org.apache.commons.cli.OptionValidator.validateOption(OptionValidator.java:10)
	at org.apache.commons.cli.Option.<init>(Option.java:146)
	at org.apache.commons.cli.OptionGroupTest.setUp(OptionGroupTest.java:54)

Running org.apache.commons.cli.CommandLineTest
Tests run: 3, Failures: 0, Errors: 1, Skipped: 0, Time elapsed: 0 sec <<< FAILURE! - in org.apache.commons.cli.CommandLineTest
testGetOptionProperties(org.apache.commons.cli.CommandLineTest)  Time elapsed: 0 sec  <<< ERROR!
java.lang.NullPointerException: null
	at org.apache.commons.cli.OptionValidator.validateOption(OptionValidator.java:10)
	at org.apache.commons.cli.Option.<init>(Option.java:146)
	at org.apache.commons.cli.Option.<init>(Option.java:113)
	at org.apache.commons.cli.OptionBuilder.create(OptionBuilder.java:376)
	at org.apache.commons.cli.OptionBuilder.create(OptionBuilder.java:357)
	at org.apache.commons.cli.CommandLineTest.testGetOptionProperties(CommandLineTest.java:37)

Running org.apache.commons.cli.BasicParserTest
Tests run: 58, Failures: 0, Errors: 2, Skipped: 0, Time elapsed: 0.029 sec <<< FAILURE! - in org.apache.commons.cli.BasicParserTest
testOptionGroupLong(org.apache.commons.cli.BasicParserTest)  Time elapsed: 0 sec  <<< ERROR!
java.lang.NullPointerException: null
	at org.apache.commons.cli.OptionValidator.validateOption(OptionValidator.java:10)
	at org.apache.commons.cli.Option.<init>(Option.java:146)
	at org.apache.commons.cli.Option.<init>(Option.java:113)
	at org.apache.commons.cli.OptionBuilder.create(OptionBuilder.java:376)
	at org.apache.commons.cli.OptionBuilder.create(OptionBuilder.java:357)
	at org.apache.commons.cli.ParserTestCase.testOptionGroupLong(ParserTestCase.java:798)
	at sun.reflect.NativeMethodAccessorImpl.invoke0(Native Method)
	at sun.reflect.NativeMethodAccessorImpl.invoke(NativeMethodAccessorImpl.java:57)
	at sun.reflect.DelegatingMethodAccessorImpl.invoke(DelegatingMethodAccessorImpl.java:43)
	at java.lang.reflect.Method.invoke(Method.java:606)
	at org.junit.runners.model.FrameworkMethod$1.runReflectiveCall(FrameworkMethod.java:50)
	at org.junit.internal.runners.model.ReflectiveCallable.run(ReflectiveCallable.java:12)
	at org.junit.runners.model.FrameworkMethod.invokeExplosively(FrameworkMethod.java:47)
	at org.junit.internal.runners.statements.InvokeMethod.evaluate(InvokeMethod.java:17)
	at org.junit.internal.runners.statements.RunBefores.evaluate(RunBefores.java:26)
	at org.junit.runners.ParentRunner.runLeaf(ParentRunner.java:325)
	at org.junit.runners.BlockJUnit4ClassRunner.runChild(BlockJUnit4ClassRunner.java:78)
	at org.junit.runners.BlockJUnit4ClassRunner.runChild(BlockJUnit4ClassRunner.java:57)
	at org.junit.runners.ParentRunner$3.run(ParentRunner.java:290)
	at org.junit.runners.ParentRunner$1.schedule(ParentRunner.java:71)
	at org.junit.runners.ParentRunner.runChildren(ParentRunner.java:288)
	at org.junit.runners.ParentRunner.access$000(ParentRunner.java:58)
	at org.junit.runners.ParentRunner$2.evaluate(ParentRunner.java:268)
	at org.junit.runners.ParentRunner.run(ParentRunner.java:363)
	at org.apache.maven.surefire.junit4.JUnit4Provider.execute(JUnit4Provider.java:283)
	at org.apache.maven.surefire.junit4.JUnit4Provider.executeWithRerun(JUnit4Provider.java:173)
	at org.apache.maven.surefire.junit4.JUnit4Provider.executeTestSet(JUnit4Provider.java:153)
	at org.apache.maven.surefire.junit4.JUnit4Provider.invoke(JUnit4Provider.java:128)
	at org.apache.maven.surefire.booter.ForkedBooter.invokeProviderInSameClassLoader(ForkedBooter.java:203)
	at org.apache.maven.surefire.booter.ForkedBooter.runSuitesInProcess(ForkedBooter.java:155)
	at org.apache.maven.surefire.booter.ForkedBooter.main(ForkedBooter.java:103)

testPropertyOptionSingularValue(org.apache.commons.cli.BasicParserTest)  Time elapsed: 0 sec  <<< ERROR!
java.lang.NullPointerException: null
	at org.apache.commons.cli.OptionValidator.validateOption(OptionValidator.java:10)
	at org.apache.commons.cli.Option.<init>(Option.java:146)
	at org.apache.commons.cli.Option.<init>(Option.java:113)
	at org.apache.commons.cli.OptionBuilder.create(OptionBuilder.java:376)
	at org.apache.commons.cli.OptionBuilder.create(OptionBuilder.java:357)
	at org.apache.commons.cli.ParserTestCase.testPropertyOptionSingularValue(ParserTestCase.java:944)
	at sun.reflect.NativeMethodAccessorImpl.invoke0(Native Method)
	at sun.reflect.NativeMethodAccessorImpl.invoke(NativeMethodAccessorImpl.java:57)
	at sun.reflect.DelegatingMethodAccessorImpl.invoke(DelegatingMethodAccessorImpl.java:43)
	at java.lang.reflect.Method.invoke(Method.java:606)
	at org.junit.runners.model.FrameworkMethod$1.runReflectiveCall(FrameworkMethod.java:50)
	at org.junit.internal.runners.model.ReflectiveCallable.run(ReflectiveCallable.java:12)
	at org.junit.runners.model.FrameworkMethod.invokeExplosively(FrameworkMethod.java:47)
	at org.junit.internal.runners.statements.InvokeMethod.evaluate(InvokeMethod.java:17)
	at org.junit.internal.runners.statements.RunBefores.evaluate(RunBefores.java:26)
	at org.junit.runners.ParentRunner.runLeaf(ParentRunner.java:325)
	at org.junit.runners.BlockJUnit4ClassRunner.runChild(BlockJUnit4ClassRunner.java:78)
	at org.junit.runners.BlockJUnit4ClassRunner.runChild(BlockJUnit4ClassRunner.java:57)
	at org.junit.runners.ParentRunner$3.run(ParentRunner.java:290)
	at org.junit.runners.ParentRunner$1.schedule(ParentRunner.java:71)
	at org.junit.runners.ParentRunner.runChildren(ParentRunner.java:288)
	at org.junit.runners.ParentRunner.access$000(ParentRunner.java:58)
	at org.junit.runners.ParentRunner$2.evaluate(ParentRunner.java:268)
	at org.junit.runners.ParentRunner.run(ParentRunner.java:363)
	at org.apache.maven.surefire.junit4.JUnit4Provider.execute(JUnit4Provider.java:283)
	at org.apache.maven.surefire.junit4.JUnit4Provider.executeWithRerun(JUnit4Provider.java:173)
	at org.apache.maven.surefire.junit4.JUnit4Provider.executeTestSet(JUnit4Provider.java:153)
	at org.apache.maven.surefire.junit4.JUnit4Provider.invoke(JUnit4Provider.java:128)
	at org.apache.maven.surefire.booter.ForkedBooter.invokeProviderInSameClassLoader(ForkedBooter.java:203)
	at org.apache.maven.surefire.booter.ForkedBooter.runSuitesInProcess(ForkedBooter.java:155)
	at org.apache.maven.surefire.booter.ForkedBooter.main(ForkedBooter.java:103)

Running org.apache.commons.cli.ValueTest
Tests run: 12, Failures: 0, Errors: 12, Skipped: 0, Time elapsed: 0.004 sec <<< FAILURE! - in org.apache.commons.cli.ValueTest
testShortOptionalArgValues(org.apache.commons.cli.ValueTest)  Time elapsed: 0 sec  <<< ERROR!
java.lang.NullPointerException: null
	at org.apache.commons.cli.OptionValidator.validateOption(OptionValidator.java:10)
	at org.apache.commons.cli.Option.<init>(Option.java:146)
	at org.apache.commons.cli.Option.<init>(Option.java:113)
	at org.apache.commons.cli.OptionBuilder.create(OptionBuilder.java:376)
	at org.apache.commons.cli.OptionBuilder.create(OptionBuilder.java:357)
	at org.apache.commons.cli.ValueTest.setUp(ValueTest.java:43)

testLongOptionalArgValue(org.apache.commons.cli.ValueTest)  Time elapsed: 0 sec  <<< ERROR!
java.lang.NullPointerException: null
	at org.apache.commons.cli.OptionValidator.validateOption(OptionValidator.java:10)
	at org.apache.commons.cli.Option.<init>(Option.java:146)
	at org.apache.commons.cli.Option.<init>(Option.java:113)
	at org.apache.commons.cli.OptionBuilder.create(OptionBuilder.java:376)
	at org.apache.commons.cli.OptionBuilder.create(OptionBuilder.java:357)
	at org.apache.commons.cli.ValueTest.setUp(ValueTest.java:43)

testShortOptionalArgNoValue(org.apache.commons.cli.ValueTest)  Time elapsed: 0 sec  <<< ERROR!
java.lang.NullPointerException: null
	at org.apache.commons.cli.OptionValidator.validateOption(OptionValidator.java:10)
	at org.apache.commons.cli.Option.<init>(Option.java:146)
	at org.apache.commons.cli.Option.<init>(Option.java:113)
	at org.apache.commons.cli.OptionBuilder.create(OptionBuilder.java:376)
	at org.apache.commons.cli.OptionBuilder.create(OptionBuilder.java:357)
	at org.apache.commons.cli.ValueTest.setUp(ValueTest.java:43)

testLongWithArg(org.apache.commons.cli.ValueTest)  Time elapsed: 0 sec  <<< ERROR!
java.lang.NullPointerException: null
	at org.apache.commons.cli.OptionValidator.validateOption(OptionValidator.java:10)
	at org.apache.commons.cli.Option.<init>(Option.java:146)
	at org.apache.commons.cli.Option.<init>(Option.java:113)
	at org.apache.commons.cli.OptionBuilder.create(OptionBuilder.java:376)
	at org.apache.commons.cli.OptionBuilder.create(OptionBuilder.java:357)
	at org.apache.commons.cli.ValueTest.setUp(ValueTest.java:43)

testLongOptionalNArgValues(org.apache.commons.cli.ValueTest)  Time elapsed: 0 sec  <<< ERROR!
java.lang.NullPointerException: null
	at org.apache.commons.cli.OptionValidator.validateOption(OptionValidator.java:10)
	at org.apache.commons.cli.Option.<init>(Option.java:146)
	at org.apache.commons.cli.Option.<init>(Option.java:113)
	at org.apache.commons.cli.OptionBuilder.create(OptionBuilder.java:376)
	at org.apache.commons.cli.OptionBuilder.create(OptionBuilder.java:357)
	at org.apache.commons.cli.ValueTest.setUp(ValueTest.java:43)

testShortWithArg(org.apache.commons.cli.ValueTest)  Time elapsed: 0 sec  <<< ERROR!
java.lang.NullPointerException: null
	at org.apache.commons.cli.OptionValidator.validateOption(OptionValidator.java:10)
	at org.apache.commons.cli.Option.<init>(Option.java:146)
	at org.apache.commons.cli.Option.<init>(Option.java:113)
	at org.apache.commons.cli.OptionBuilder.create(OptionBuilder.java:376)
	at org.apache.commons.cli.OptionBuilder.create(OptionBuilder.java:357)
	at org.apache.commons.cli.ValueTest.setUp(ValueTest.java:43)

testLongOptionalArgValues(org.apache.commons.cli.ValueTest)  Time elapsed: 0 sec  <<< ERROR!
java.lang.NullPointerException: null
	at org.apache.commons.cli.OptionValidator.validateOption(OptionValidator.java:10)
	at org.apache.commons.cli.Option.<init>(Option.java:146)
	at org.apache.commons.cli.Option.<init>(Option.java:113)
	at org.apache.commons.cli.OptionBuilder.create(OptionBuilder.java:376)
	at org.apache.commons.cli.OptionBuilder.create(OptionBuilder.java:357)
	at org.apache.commons.cli.ValueTest.setUp(ValueTest.java:43)

testShortOptionalNArgValues(org.apache.commons.cli.ValueTest)  Time elapsed: 0 sec  <<< ERROR!
java.lang.NullPointerException: null
	at org.apache.commons.cli.OptionValidator.validateOption(OptionValidator.java:10)
	at org.apache.commons.cli.Option.<init>(Option.java:146)
	at org.apache.commons.cli.Option.<init>(Option.java:113)
	at org.apache.commons.cli.OptionBuilder.create(OptionBuilder.java:376)
	at org.apache.commons.cli.OptionBuilder.create(OptionBuilder.java:357)
	at org.apache.commons.cli.ValueTest.setUp(ValueTest.java:43)

testLongNoArg(org.apache.commons.cli.ValueTest)  Time elapsed: 0 sec  <<< ERROR!
java.lang.NullPointerException: null
	at org.apache.commons.cli.OptionValidator.validateOption(OptionValidator.java:10)
	at org.apache.commons.cli.Option.<init>(Option.java:146)
	at org.apache.commons.cli.Option.<init>(Option.java:113)
	at org.apache.commons.cli.OptionBuilder.create(OptionBuilder.java:376)
	at org.apache.commons.cli.OptionBuilder.create(OptionBuilder.java:357)
	at org.apache.commons.cli.ValueTest.setUp(ValueTest.java:43)

testShortNoArg(org.apache.commons.cli.ValueTest)  Time elapsed: 0 sec  <<< ERROR!
java.lang.NullPointerException: null
	at org.apache.commons.cli.OptionValidator.validateOption(OptionValidator.java:10)
	at org.apache.commons.cli.Option.<init>(Option.java:146)
	at org.apache.commons.cli.Option.<init>(Option.java:113)
	at org.apache.commons.cli.OptionBuilder.create(OptionBuilder.java:376)
	at org.apache.commons.cli.OptionBuilder.create(OptionBuilder.java:357)
	at org.apache.commons.cli.ValueTest.setUp(ValueTest.java:43)

testLongOptionalNoValue(org.apache.commons.cli.ValueTest)  Time elapsed: 0.001 sec  <<< ERROR!
java.lang.NullPointerException: null
	at org.apache.commons.cli.OptionValidator.validateOption(OptionValidator.java:10)
	at org.apache.commons.cli.Option.<init>(Option.java:146)
	at org.apache.commons.cli.Option.<init>(Option.java:113)
	at org.apache.commons.cli.OptionBuilder.create(OptionBuilder.java:376)
	at org.apache.commons.cli.OptionBuilder.create(OptionBuilder.java:357)
	at org.apache.commons.cli.ValueTest.setUp(ValueTest.java:43)

testShortOptionalArgValue(org.apache.commons.cli.ValueTest)  Time elapsed: 0 sec  <<< ERROR!
java.lang.NullPointerException: null
	at org.apache.commons.cli.OptionValidator.validateOption(OptionValidator.java:10)
	at org.apache.commons.cli.Option.<init>(Option.java:146)
	at org.apache.commons.cli.Option.<init>(Option.java:113)
	at org.apache.commons.cli.OptionBuilder.create(OptionBuilder.java:376)
	at org.apache.commons.cli.OptionBuilder.create(OptionBuilder.java:357)
	at org.apache.commons.cli.ValueTest.setUp(ValueTest.java:43)


Results :

Failed tests: 
  OptionBuilderTest.testBuilderIsResettedAlways:181 IllegalArgumentException expected
  OptionBuilderTest.testIllegalOptions:135 IllegalArgumentException not caught
  OptionBuilderTest.testSpecialOptChars:115 IllegalArgumentException not caught

Tests in error: 
  ApplicationTest.testLs:52 » NullPointer
  ApplicationTest.testNLT:303 » NullPointer
  BasicParserTest>ParserTestCase.testOptionGroupLong:798 » NullPointer
  BasicParserTest>ParserTestCase.testPropertyOptionSingularValue:944 » NullPointer
  CommandLineTest.testGetOptionProperties:37 » NullPointer
  DefaultParserTest>ParserTestCase.testAmbiguousPartialLongOption1:552 » NullPointer
  DefaultParserTest>ParserTestCase.testAmbiguousPartialLongOption2:578 » NullPointer
  DefaultParserTest>ParserTestCase.testAmbiguousPartialLongOption3:604 » NullPointer
  DefaultParserTest>ParserTestCase.testAmbiguousPartialLongOption4:630 » NullPointer
  DefaultParserTest>ParserTestCase.testOptionGroupLong:798 » NullPointer
  DefaultParserTest>ParserTestCase.testPartialLongOptionSingleDash:656 » NullPointer
  DefaultParserTest>ParserTestCase.testPropertyOptionSingularValue:944 » NullPointer
  DefaultParserTest>ParserTestCase.testUnambiguousPartialLongOption1:494 » NullPointer
  DefaultParserTest>ParserTestCase.testUnambiguousPartialLongOption2:508 » NullPointer
  DefaultParserTest>ParserTestCase.testUnambiguousPartialLongOption3:522 » NullPointer
  DefaultParserTest>ParserTestCase.testUnambiguousPartialLongOption4:537 » NullPointer
  GnuParserTest>ParserTestCase.testOptionGroupLong:798 » NullPointer
  GnuParserTest>ParserTestCase.testPropertyOptionSingularValue:944 » NullPointer
  HelpFormatterTest.testHelpWithLongOptSeparator:572 » NullPointer
  HelpFormatterTest.testOptionWithoutShortFormat:480 » NullPointer
  HelpFormatterTest.testOptionWithoutShortFormat2:528 » NullPointer
  HelpFormatterTest.testUsageWithLongOptSeparator:599 » NullPointer
  OptionGroupTest.setUp:54 » NullPointer
  OptionGroupTest.setUp:54 » NullPointer
  OptionGroupTest.setUp:54 » NullPointer
  OptionGroupTest.setUp:54 » NullPointer
  OptionGroupTest.setUp:54 » NullPointer
  OptionGroupTest.setUp:54 » NullPointer
  OptionGroupTest.setUp:54 » NullPointer
  OptionGroupTest.setUp:54 » NullPointer
  OptionGroupTest.setUp:54 » NullPointer
  OptionGroupTest.setUp:54 » NullPointer
  OptionGroupTest.setUp:54 » NullPointer
  OptionGroupTest.setUp:54 » NullPointer
  OptionGroupTest.setUp:54 » NullPointer
  OptionTest.testBuilderInsufficientParams1 »  Unexpected exception, expected<ja...
  OptionTest.testBuilderInsufficientParams2 »  Unexpected exception, expected<ja...
  OptionsTest.testGetMatchingOpts:178 » NullPointer
  OptionsTest.testHelpOptions:79 » NullPointer
  PosixParserTest>ParserTestCase.testAmbiguousPartialLongOption1:552 » NullPointer
  PosixParserTest>ParserTestCase.testAmbiguousPartialLongOption2:578 » NullPointer
  PosixParserTest>ParserTestCase.testAmbiguousPartialLongOption3:604 » NullPointer
  PosixParserTest>ParserTestCase.testOptionGroupLong:798 » NullPointer
  PosixParserTest>ParserTestCase.testPartialLongOptionSingleDash:656 » NullPointer
  PosixParserTest>ParserTestCase.testPropertyOptionSingularValue:944 » NullPointer
  PosixParserTest>ParserTestCase.testUnambiguousPartialLongOption1:494 » NullPointer
  PosixParserTest>ParserTestCase.testUnambiguousPartialLongOption2:508 » NullPointer
  PosixParserTest>ParserTestCase.testUnambiguousPartialLongOption3:522 » NullPointer
  ValueTest.setUp:43 » NullPointer
  ValueTest.setUp:43 » NullPointer
  ValueTest.setUp:43 » NullPointer
  ValueTest.setUp:43 » NullPointer
  ValueTest.setUp:43 » NullPointer
  ValueTest.setUp:43 » NullPointer
  ValueTest.setUp:43 » NullPointer
  ValueTest.setUp:43 » NullPointer
  ValueTest.setUp:43 » NullPointer
  ValueTest.setUp:43 » NullPointer
  ValueTest.setUp:43 » NullPointer
  ValueTest.setUp:43 » NullPointer
  BugCLI162Test.testPrintHelpLongLines:243 » NullPointer
  BugCLI18Test.testCLI18:38 » NullPointer
  BugCLI252Test>ParserTestCase.testAmbiguousPartialLongOption1:552 » NullPointer
  BugCLI252Test>ParserTestCase.testAmbiguousPartialLongOption2:578 » NullPointer
  BugCLI252Test>ParserTestCase.testAmbiguousPartialLongOption3:604 » NullPointer
  BugCLI252Test>ParserTestCase.testAmbiguousPartialLongOption4:630 » NullPointer
  BugCLI252Test.testAmbiquousOptionName »  Unexpected exception, expected<org.ap...
  BugCLI252Test.testExactOptionNameMatch:27->getOptions:37 » NullPointer
  BugCLI252Test>ParserTestCase.testOptionGroupLong:798 » NullPointer
  BugCLI252Test>ParserTestCase.testPartialLongOptionSingleDash:656 » NullPointer
  BugCLI252Test>ParserTestCase.testPropertyOptionSingularValue:944 » NullPointer
  BugCLI252Test>ParserTestCase.testUnambiguousPartialLongOption1:494 » NullPointer
  BugCLI252Test>ParserTestCase.testUnambiguousPartialLongOption2:508 » NullPointer
  BugCLI252Test>ParserTestCase.testUnambiguousPartialLongOption3:522 » NullPointer
  BugCLI252Test>ParserTestCase.testUnambiguousPartialLongOption4:537 » NullPointer
  BugsTest.test11457:51 » NullPointer


Tests run: 424, Failures: 3, Errors: 76, Skipped: 0

[INFO] ------------------------------------------------------------------------
[INFO] BUILD FAILURE
[INFO] ------------------------------------------------------------------------
[INFO] Total time: 8.753s
[INFO] Finished at: Sun Aug 02 04:03:46 BST 2015
[INFO] Final Memory: 23M/291M
[INFO] ------------------------------------------------------------------------
[ERROR] Failed to execute goal org.apache.maven.plugins:maven-surefire-plugin:2.18:test (default-test) on project commons-cli: There are test failures.
[ERROR] 
[ERROR] Please refer to /home/perham/Study/LittleDarwin/Cases/commons-cli-1.3.1-src/target/surefire-reports for the individual test results.
[ERROR] -> [Help 1]
[ERROR] 
[ERROR] To see the full stack trace of the errors, re-run Maven with the -e switch.
[ERROR] Re-run Maven using the -X switch to enable full debug logging.
[ERROR] 
[ERROR] For more information about the errors and possible solutions, please read the following articles:
[ERROR] [Help 1] http://cwiki.apache.org/confluence/display/MAVEN/MojoFailureException
