[INFO] Scanning for projects...
[INFO]                                                                         
[INFO] ------------------------------------------------------------------------
[INFO] Building Apache Commons CLI 1.3.1
[INFO] ------------------------------------------------------------------------
[INFO] 
[INFO] --- maven-enforcer-plugin:1.3.1:enforce (enforce-maven-3) @ commons-cli ---
[INFO] 
[INFO] --- build-helper-maven-plugin:1.8:parse-version (parse-version) @ commons-cli ---
[INFO] 
[INFO] --- maven-antrun-plugin:1.7:run (javadoc.resources) @ commons-cli ---
[INFO] Executing tasks

main:
[INFO] Executed tasks
[INFO] 
[INFO] --- maven-remote-resources-plugin:1.5:process (default) @ commons-cli ---
[INFO] 
[INFO] --- buildnumber-maven-plugin:1.3:create (default) @ commons-cli ---
[INFO] Executing: /bin/sh -c cd /home/perham/Study/LittleDarwin/Cases/commons-cli-1.3.1-src && svn --non-interactive info
[INFO] Working directory: /home/perham/Study/LittleDarwin/Cases/commons-cli-1.3.1-src
[INFO] Storing buildNumber: ?????? at timestamp: 1438482505052
[INFO] Executing: /bin/sh -c cd /home/perham/Study/LittleDarwin/Cases/commons-cli-1.3.1-src && svn --non-interactive info
[INFO] Working directory: /home/perham/Study/LittleDarwin/Cases/commons-cli-1.3.1-src
[INFO] Storing buildScmBranch: UNKNOWN_BRANCH
[INFO] 
[INFO] --- maven-resources-plugin:2.7:resources (default-resources) @ commons-cli ---
[INFO] Using 'iso-8859-1' encoding to copy filtered resources.
[INFO] skip non existing resourceDirectory /home/perham/Study/LittleDarwin/Cases/commons-cli-1.3.1-src/src/main/resources
[INFO] Copying 2 resources to META-INF
[INFO] 
[INFO] --- maven-compiler-plugin:3.2:compile (default-compile) @ commons-cli ---
[INFO] Changes detected - recompiling the module!
[INFO] Compiling 23 source files to /home/perham/Study/LittleDarwin/Cases/commons-cli-1.3.1-src/target/classes
[INFO] /home/perham/Study/LittleDarwin/Cases/commons-cli-1.3.1-src/src/main/java/org/apache/commons/cli/Parser.java: Some input files use unchecked or unsafe operations.
[INFO] /home/perham/Study/LittleDarwin/Cases/commons-cli-1.3.1-src/src/main/java/org/apache/commons/cli/Parser.java: Recompile with -Xlint:unchecked for details.
[INFO] 
[INFO] --- maven-bundle-plugin:2.5.3:manifest (bundle-manifest) @ commons-cli ---
[INFO] 
[INFO] --- animal-sniffer-maven-plugin:1.13:check (checkAPIcompatibility) @ commons-cli ---
[INFO] Checking unresolved references to org.codehaus.mojo.signature:java15:1.0
[INFO] 
[INFO] --- maven-resources-plugin:2.7:testResources (default-testResources) @ commons-cli ---
[INFO] Using 'iso-8859-1' encoding to copy filtered resources.
[INFO] Copying 0 resource
[INFO] Copying 2 resources to META-INF
[INFO] 
[INFO] --- maven-compiler-plugin:3.2:testCompile (default-testCompile) @ commons-cli ---
[INFO] Nothing to compile - all classes are up to date
[INFO] 
[INFO] --- jacoco-maven-plugin:0.7.2.201409121644:prepare-agent (prepare-agent) @ commons-cli ---
[INFO] argLine set to -javaagent:/home/perham/.m2/repository/org/jacoco/org.jacoco.agent/0.7.2.201409121644/org.jacoco.agent-0.7.2.201409121644-runtime.jar=destfile=/home/perham/Study/LittleDarwin/Cases/commons-cli-1.3.1-src/target/jacoco.exec
[INFO] 
[INFO] --- maven-surefire-plugin:2.18:test (default-test) @ commons-cli ---
[INFO] Surefire report directory: /home/perham/Study/LittleDarwin/Cases/commons-cli-1.3.1-src/target/surefire-reports

-------------------------------------------------------
 T E S T S
-------------------------------------------------------
Running org.apache.commons.cli.ArgumentIsOptionTest
Tests run: 3, Failures: 0, Errors: 0, Skipped: 0, Time elapsed: 0.009 sec - in org.apache.commons.cli.ArgumentIsOptionTest
Running org.apache.commons.cli.DefaultParserTest
Tests run: 58, Failures: 0, Errors: 0, Skipped: 0, Time elapsed: 0.066 sec - in org.apache.commons.cli.DefaultParserTest
Running org.apache.commons.cli.ValuesTest
Tests run: 7, Failures: 0, Errors: 0, Skipped: 0, Time elapsed: 0.01 sec - in org.apache.commons.cli.ValuesTest
Running org.apache.commons.cli.OptionsTest
Tests run: 10, Failures: 0, Errors: 0, Skipped: 0, Time elapsed: 0.002 sec - in org.apache.commons.cli.OptionsTest
Running org.apache.commons.cli.GnuParserTest
Tests run: 58, Failures: 0, Errors: 0, Skipped: 0, Time elapsed: 0.045 sec - in org.apache.commons.cli.GnuParserTest
Running org.apache.commons.cli.PatternOptionBuilderTest
Exception found converting v to desired type: Unable to parse the URL: foo://commons.apache.org
Exception found converting d to desired type: Unable to find the class: System.DateTime
Exception found converting x to desired type: For input string: "3,5"
Exception found converting i to desired type: java.lang.IllegalAccessException; Unable to create an instance of: java.util.Calendar
Exception found converting n to desired type: Unable to find the class: System.DateTime
Tests run: 9, Failures: 0, Errors: 0, Skipped: 0, Time elapsed: 0.071 sec - in org.apache.commons.cli.PatternOptionBuilderTest
Running org.apache.commons.cli.ApplicationTest
Tests run: 5, Failures: 1, Errors: 0, Skipped: 0, Time elapsed: 0.024 sec <<< FAILURE! - in org.apache.commons.cli.ApplicationTest
testMan(org.apache.commons.cli.ApplicationTest)  Time elapsed: 0.023 sec  <<< FAILURE!
org.junit.ComparisonFailure: expected:<[]usage: man [-c|-f|-k...> but was:<[
]usage: man [-c|-f|-k...>
	at org.junit.Assert.assertEquals(Assert.java:115)
	at org.junit.Assert.assertEquals(Assert.java:144)
	at org.apache.commons.cli.ApplicationTest.testMan(ApplicationTest.java:229)

Running org.apache.commons.cli.OptionTest
Tests run: 9, Failures: 0, Errors: 0, Skipped: 0, Time elapsed: 0 sec - in org.apache.commons.cli.OptionTest
Running org.apache.commons.cli.bug.BugCLI252Test
Tests run: 60, Failures: 0, Errors: 0, Skipped: 0, Time elapsed: 0.026 sec - in org.apache.commons.cli.bug.BugCLI252Test
Running org.apache.commons.cli.bug.BugCLI162Test
Tests run: 4, Failures: 4, Errors: 0, Skipped: 0, Time elapsed: 0.002 sec <<< FAILURE! - in org.apache.commons.cli.bug.BugCLI162Test
testInfiniteLoop(org.apache.commons.cli.bug.BugCLI162Test)  Time elapsed: 0 sec  <<< FAILURE!
org.junit.ComparisonFailure: expected:<[]usage: app
 -h,--hel...> but was:<[
]usage: app
 -h,--hel...>
	at org.junit.Assert.assertEquals(Assert.java:115)
	at org.junit.Assert.assertEquals(Assert.java:144)
	at org.apache.commons.cli.bug.BugCLI162Test.testInfiniteLoop(BugCLI162Test.java:63)

testLongLineChunkingIndentIgnored(org.apache.commons.cli.bug.BugCLI162Test)  Time elapsed: 0 sec  <<< FAILURE!
org.junit.ComparisonFailure: Long arguments did not split as expected expected:<[usage:
       org.apache.comm
       ons.cli.bug.Bug
       CLI162Test
Header
-x,--extralongarg
 This description is
 Long.]
Footer
> but was:<[
usage:
       org.apache.comm
       ons.cli.bug.Bug
       CLI162Test

Header
-x,--extralongarg
 This description is
 Long.
]
Footer
>
	at org.junit.Assert.assertEquals(Assert.java:115)
	at org.apache.commons.cli.bug.BugCLI162Test.testLongLineChunkingIndentIgnored(BugCLI162Test.java:360)

testLongLineChunking(org.apache.commons.cli.bug.BugCLI162Test)  Time elapsed: 0 sec  <<< FAILURE!
org.junit.ComparisonFailure: Long arguments did not split as expected expected:<[usage:
       org.apache.commons.cli.bug.B
       ugCLI162Test
Header
-x,--extralongarg     This
                      description
                      has
                      ReallyLongVal
                      uesThatAreLon
                      gerThanTheWid
                      thOfTheColumn
                      s and also
                      other
                      ReallyLongVal
                      uesThatAreHug
                      erAndBiggerTh
                      anTheWidthOfT
                      heColumnsBob,
                      yes.]
Footer
> but was:<[
usage:
       org.apache.commons.cli.bug.B
       ugCLI162Test

Header
-x,--extralongarg     This
                      description
                      has
                      ReallyLongVal
                      uesThatAreLon
                      gerThanTheWid
                      thOfTheColumn
                      s and also
                      other
                      ReallyLongVal
                      uesThatAreHug
                      erAndBiggerTh
                      anTheWidthOfT
                      heColumnsBob,
                      yes.
]
Footer
>
	at org.junit.Assert.assertEquals(Assert.java:115)
	at org.apache.commons.cli.bug.BugCLI162Test.testLongLineChunking(BugCLI162Test.java:342)

testPrintHelpLongLines(org.apache.commons.cli.bug.BugCLI162Test)  Time elapsed: 0.001 sec  <<< FAILURE!
org.junit.ComparisonFailure: expected:<[]usage: org.apache.co...> but was:<[
]usage: org.apache.co...>
	at org.junit.Assert.assertEquals(Assert.java:115)
	at org.junit.Assert.assertEquals(Assert.java:144)
	at org.apache.commons.cli.bug.BugCLI162Test.testPrintHelpLongLines(BugCLI162Test.java:310)

Running org.apache.commons.cli.bug.BugCLI71Test
Tests run: 4, Failures: 0, Errors: 0, Skipped: 0, Time elapsed: 0.001 sec - in org.apache.commons.cli.bug.BugCLI71Test
Running org.apache.commons.cli.bug.BugCLI18Test
Tests run: 1, Failures: 0, Errors: 0, Skipped: 0, Time elapsed: 0 sec - in org.apache.commons.cli.bug.BugCLI18Test
Running org.apache.commons.cli.bug.BugCLI133Test
Tests run: 1, Failures: 0, Errors: 0, Skipped: 0, Time elapsed: 0 sec - in org.apache.commons.cli.bug.BugCLI133Test
Running org.apache.commons.cli.bug.BugCLI13Test
Tests run: 1, Failures: 0, Errors: 0, Skipped: 0, Time elapsed: 0.001 sec - in org.apache.commons.cli.bug.BugCLI13Test
Running org.apache.commons.cli.bug.BugCLI148Test
Tests run: 2, Failures: 0, Errors: 0, Skipped: 0, Time elapsed: 0.001 sec - in org.apache.commons.cli.bug.BugCLI148Test
Running org.apache.commons.cli.bug.BugsTest
Tests run: 12, Failures: 1, Errors: 0, Skipped: 0, Time elapsed: 0.001 sec <<< FAILURE! - in org.apache.commons.cli.bug.BugsTest
test13666(org.apache.commons.cli.bug.BugsTest)  Time elapsed: 0 sec  <<< FAILURE!
org.junit.ComparisonFailure: expected:<[]usage: dir
 -d <arg>...> but was:<[
]usage: dir
 -d <arg>...>
	at org.junit.Assert.assertEquals(Assert.java:115)
	at org.junit.Assert.assertEquals(Assert.java:144)
	at org.apache.commons.cli.bug.BugsTest.test13666(BugsTest.java:257)

Running org.apache.commons.cli.HelpFormatterTest
Tests run: 25, Failures: 12, Errors: 0, Skipped: 0, Time elapsed: 0.042 sec <<< FAILURE! - in org.apache.commons.cli.HelpFormatterTest
testIndentedHeaderAndFooter(org.apache.commons.cli.HelpFormatterTest)  Time elapsed: 0.001 sec  <<< FAILURE!
org.junit.ComparisonFailure: expected:<[usage: foobar
  Header1
  Header2]

  Footer1
  Footer...> but was:<[
usage: foobar

  Header1
  Header2
]

  Footer1
  Footer...>
	at org.junit.Assert.assertEquals(Assert.java:115)
	at org.junit.Assert.assertEquals(Assert.java:144)
	at org.apache.commons.cli.HelpFormatterTest.testIndentedHeaderAndFooter(HelpFormatterTest.java:464)

testPrintSortedUsageWithNullComparator(org.apache.commons.cli.HelpFormatterTest)  Time elapsed: 0.001 sec  <<< FAILURE!
org.junit.ComparisonFailure: expected:<[]usage: app [-c] [-b]...> but was:<[
]usage: app [-c] [-b]...>
	at org.junit.Assert.assertEquals(Assert.java:115)
	at org.junit.Assert.assertEquals(Assert.java:144)
	at org.apache.commons.cli.HelpFormatterTest.testPrintSortedUsageWithNullComparator(HelpFormatterTest.java:317)

testPrintRequiredOptionGroupUsage(org.apache.commons.cli.HelpFormatterTest)  Time elapsed: 0.001 sec  <<< FAILURE!
org.junit.ComparisonFailure: expected:<[]usage: app -a | -b |...> but was:<[
]usage: app -a | -b |...>
	at org.junit.Assert.assertEquals(Assert.java:115)
	at org.junit.Assert.assertEquals(Assert.java:144)
	at org.apache.commons.cli.HelpFormatterTest.testPrintRequiredOptionGroupUsage(HelpFormatterTest.java:356)

testHelpWithLongOptSeparator(org.apache.commons.cli.HelpFormatterTest)  Time elapsed: 0.001 sec  <<< FAILURE!
org.junit.ComparisonFailure: expected:<[usage: create
header
     --age=<arg>    the age
  -f <arg>          the file
  -s,--size=<SIZE>  the size]
footer
> but was:<[
usage: create

header
     --age=<arg>    the age
  -f <arg>          the file
  -s,--size=<SIZE>  the size
]
footer
>
	at org.junit.Assert.assertEquals(Assert.java:115)
	at org.junit.Assert.assertEquals(Assert.java:144)
	at org.apache.commons.cli.HelpFormatterTest.testHelpWithLongOptSeparator(HelpFormatterTest.java:583)

testPrintUsage(org.apache.commons.cli.HelpFormatterTest)  Time elapsed: 0.001 sec  <<< FAILURE!
org.junit.ComparisonFailure: expected:<[]usage: app [-a] [-b]...> but was:<[
]usage: app [-a] [-b]...>
	at org.junit.Assert.assertEquals(Assert.java:115)
	at org.junit.Assert.assertEquals(Assert.java:144)
	at org.apache.commons.cli.HelpFormatterTest.testPrintUsage(HelpFormatterTest.java:275)

testPrintSortedUsage(org.apache.commons.cli.HelpFormatterTest)  Time elapsed: 0.003 sec  <<< FAILURE!
org.junit.ComparisonFailure: expected:<[]usage: app [-c] [-b]...> but was:<[
]usage: app [-c] [-b]...>
	at org.junit.Assert.assertEquals(Assert.java:115)
	at org.junit.Assert.assertEquals(Assert.java:144)
	at org.apache.commons.cli.HelpFormatterTest.testPrintSortedUsage(HelpFormatterTest.java:300)

testDefaultArgName(org.apache.commons.cli.HelpFormatterTest)  Time elapsed: 0.001 sec  <<< FAILURE!
org.junit.ComparisonFailure: expected:<[]usage: app -f <argum...> but was:<[
]usage: app -f <argum...>
	at org.junit.Assert.assertEquals(Assert.java:115)
	at org.junit.Assert.assertEquals(Assert.java:144)
	at org.apache.commons.cli.HelpFormatterTest.testDefaultArgName(HelpFormatterTest.java:391)

testHeaderStartingWithLineSeparator(org.apache.commons.cli.HelpFormatterTest)  Time elapsed: 0 sec  <<< FAILURE!
org.junit.ComparisonFailure: expected:<[usage: foobar

Header]

Footer
> but was:<[
usage: foobar


Header
]

Footer
>
	at org.junit.Assert.assertEquals(Assert.java:115)
	at org.junit.Assert.assertEquals(Assert.java:144)
	at org.apache.commons.cli.HelpFormatterTest.testHeaderStartingWithLineSeparator(HelpFormatterTest.java:444)

testOptionWithoutShortFormat(org.apache.commons.cli.HelpFormatterTest)  Time elapsed: 0 sec  <<< FAILURE!
org.junit.ComparisonFailure: expected:<[]usage: foobar [-a] [...> but was:<[
]usage: foobar [-a] [...>
	at org.junit.Assert.assertEquals(Assert.java:115)
	at org.junit.Assert.assertEquals(Assert.java:144)
	at org.apache.commons.cli.HelpFormatterTest.testOptionWithoutShortFormat(HelpFormatterTest.java:486)

testPrintOptionGroupUsage(org.apache.commons.cli.HelpFormatterTest)  Time elapsed: 0.001 sec  <<< FAILURE!
org.junit.ComparisonFailure: expected:<[]usage: app [-a | -b ...> but was:<[
]usage: app [-a | -b ...>
	at org.junit.Assert.assertEquals(Assert.java:115)
	at org.junit.Assert.assertEquals(Assert.java:144)
	at org.apache.commons.cli.HelpFormatterTest.testPrintOptionGroupUsage(HelpFormatterTest.java:336)

testPrintOptionWithEmptyArgNameUsage(org.apache.commons.cli.HelpFormatterTest)  Time elapsed: 0 sec  <<< FAILURE!
org.junit.ComparisonFailure: expected:<[]usage: app -f
> but was:<[
]usage: app -f
>
	at org.junit.Assert.assertEquals(Assert.java:115)
	at org.junit.Assert.assertEquals(Assert.java:144)
	at org.apache.commons.cli.HelpFormatterTest.testPrintOptionWithEmptyArgNameUsage(HelpFormatterTest.java:374)

testOptionWithoutShortFormat2(org.apache.commons.cli.HelpFormatterTest)  Time elapsed: 0 sec  <<< FAILURE!
org.junit.ComparisonFailure: expected:<[usage: commandline [-a <arg>] [--config <arg>] [-h] [-l <arg>] [-n] [-r <arg>]
       [-s <arg>] [-t] [-v]
header
  -a,--age <arg>      Age (in days) of cache item before being recomputed
     --config <arg>   Use the specified configuration file
  -h,--help           print this message
  -l,--limit <arg>    Set time limit for execution, in mintues
  -n,--new            Create NLT cache entries only for new items
  -r,--results <arg>  Number of results per item
  -s,--server <arg>   The NLT server address
  -t,--tracker        Create NLT cache entries only for tracker items
  -v,--version        print version information]
footer
> but was:<[
usage: commandline [-a <arg>] [--config <arg>] [-h] [-l <arg>] [-n] [-r <arg>]
       [-s <arg>] [-t] [-v]

header
  -a,--age <arg>      Age (in days) of cache item before being recomputed
     --config <arg>   Use the specified configuration file
  -h,--help           print this message
  -l,--limit <arg>    Set time limit for execution, in mintues
  -n,--new            Create NLT cache entries only for new items
  -r,--results <arg>  Number of results per item
  -s,--server <arg>   The NLT server address
  -t,--tracker        Create NLT cache entries only for tracker items
  -v,--version        print version information
]
footer
>
	at org.junit.Assert.assertEquals(Assert.java:115)
	at org.junit.Assert.assertEquals(Assert.java:144)
	at org.apache.commons.cli.HelpFormatterTest.testOptionWithoutShortFormat2(HelpFormatterTest.java:549)

Running org.apache.commons.cli.OptionBuilderTest
Tests run: 9, Failures: 0, Errors: 0, Skipped: 0, Time elapsed: 0 sec - in org.apache.commons.cli.OptionBuilderTest
Running org.apache.commons.cli.PosixParserTest
Tests run: 58, Failures: 0, Errors: 0, Skipped: 0, Time elapsed: 0.022 sec - in org.apache.commons.cli.PosixParserTest
Running org.apache.commons.cli.UtilTest
Tests run: 2, Failures: 0, Errors: 0, Skipped: 0, Time elapsed: 0 sec - in org.apache.commons.cli.UtilTest
Running org.apache.commons.cli.OptionGroupTest
Tests run: 13, Failures: 0, Errors: 0, Skipped: 0, Time elapsed: 0.009 sec - in org.apache.commons.cli.OptionGroupTest
Running org.apache.commons.cli.CommandLineTest
Tests run: 3, Failures: 0, Errors: 0, Skipped: 0, Time elapsed: 0 sec - in org.apache.commons.cli.CommandLineTest
Running org.apache.commons.cli.BasicParserTest
Tests run: 58, Failures: 0, Errors: 0, Skipped: 0, Time elapsed: 0.035 sec - in org.apache.commons.cli.BasicParserTest
Running org.apache.commons.cli.ValueTest
Tests run: 12, Failures: 0, Errors: 0, Skipped: 0, Time elapsed: 0.007 sec - in org.apache.commons.cli.ValueTest

Results :

Failed tests: 
  ApplicationTest.testMan:229 expected:<[]usage: man [-c|-f|-k...> but was:<[
]usage: man [-c|-f|-k...>
  HelpFormatterTest.testDefaultArgName:391 expected:<[]usage: app -f <argum...> but was:<[
]usage: app -f <argum...>
  HelpFormatterTest.testHeaderStartingWithLineSeparator:444 expected:<[usage: foobar

Header]

Footer
> but was:<[
usage: foobar


Header
]

Footer
>
  HelpFormatterTest.testHelpWithLongOptSeparator:583 expected:<[usage: create
header
     --age=<arg>    the age
  -f <arg>          the file
  -s,--size=<SIZE>  the size]
footer
> but was:<[
usage: create

header
     --age=<arg>    the age
  -f <arg>          the file
  -s,--size=<SIZE>  the size
]
footer
>
  HelpFormatterTest.testIndentedHeaderAndFooter:464 expected:<[usage: foobar
  Header1
  Header2]

  Footer1
  Footer...> but was:<[
usage: foobar

  Header1
  Header2
]

  Footer1
  Footer...>
  HelpFormatterTest.testOptionWithoutShortFormat:486 expected:<[]usage: foobar [-a] [...> but was:<[
]usage: foobar [-a] [...>
  HelpFormatterTest.testOptionWithoutShortFormat2:549 expected:<[usage: commandline [-a <arg>] [--config <arg>] [-h] [-l <arg>] [-n] [-r <arg>]
       [-s <arg>] [-t] [-v]
header
  -a,--age <arg>      Age (in days) of cache item before being recomputed
     --config <arg>   Use the specified configuration file
  -h,--help           print this message
  -l,--limit <arg>    Set time limit for execution, in mintues
  -n,--new            Create NLT cache entries only for new items
  -r,--results <arg>  Number of results per item
  -s,--server <arg>   The NLT server address
  -t,--tracker        Create NLT cache entries only for tracker items
  -v,--version        print version information]
footer
> but was:<[
usage: commandline [-a <arg>] [--config <arg>] [-h] [-l <arg>] [-n] [-r <arg>]
       [-s <arg>] [-t] [-v]

header
  -a,--age <arg>      Age (in days) of cache item before being recomputed
     --config <arg>   Use the specified configuration file
  -h,--help           print this message
  -l,--limit <arg>    Set time limit for execution, in mintues
  -n,--new            Create NLT cache entries only for new items
  -r,--results <arg>  Number of results per item
  -s,--server <arg>   The NLT server address
  -t,--tracker        Create NLT cache entries only for tracker items
  -v,--version        print version information
]
footer
>
  HelpFormatterTest.testPrintOptionGroupUsage:336 expected:<[]usage: app [-a | -b ...> but was:<[
]usage: app [-a | -b ...>
  HelpFormatterTest.testPrintOptionWithEmptyArgNameUsage:374 expected:<[]usage: app -f
> but was:<[
]usage: app -f
>
  HelpFormatterTest.testPrintRequiredOptionGroupUsage:356 expected:<[]usage: app -a | -b |...> but was:<[
]usage: app -a | -b |...>
  HelpFormatterTest.testPrintSortedUsage:300 expected:<[]usage: app [-c] [-b]...> but was:<[
]usage: app [-c] [-b]...>
  HelpFormatterTest.testPrintSortedUsageWithNullComparator:317 expected:<[]usage: app [-c] [-b]...> but was:<[
]usage: app [-c] [-b]...>
  HelpFormatterTest.testPrintUsage:275 expected:<[]usage: app [-a] [-b]...> but was:<[
]usage: app [-a] [-b]...>
  BugCLI162Test.testInfiniteLoop:63 expected:<[]usage: app
 -h,--hel...> but was:<[
]usage: app
 -h,--hel...>
  BugCLI162Test.testLongLineChunking:342 Long arguments did not split as expected expected:<[usage:
       org.apache.commons.cli.bug.B
       ugCLI162Test
Header
-x,--extralongarg     This
                      description
                      has
                      ReallyLongVal
                      uesThatAreLon
                      gerThanTheWid
                      thOfTheColumn
                      s and also
                      other
                      ReallyLongVal
                      uesThatAreHug
                      erAndBiggerTh
                      anTheWidthOfT
                      heColumnsBob,
                      yes.]
Footer
> but was:<[
usage:
       org.apache.commons.cli.bug.B
       ugCLI162Test

Header
-x,--extralongarg     This
                      description
                      has
                      ReallyLongVal
                      uesThatAreLon
                      gerThanTheWid
                      thOfTheColumn
                      s and also
                      other
                      ReallyLongVal
                      uesThatAreHug
                      erAndBiggerTh
                      anTheWidthOfT
                      heColumnsBob,
                      yes.
]
Footer
>
  BugCLI162Test.testLongLineChunkingIndentIgnored:360 Long arguments did not split as expected expected:<[usage:
       org.apache.comm
       ons.cli.bug.Bug
       CLI162Test
Header
-x,--extralongarg
 This description is
 Long.]
Footer
> but was:<[
usage:
       org.apache.comm
       ons.cli.bug.Bug
       CLI162Test

Header
-x,--extralongarg
 This description is
 Long.
]
Footer
>
  BugCLI162Test.testPrintHelpLongLines:310 expected:<[]usage: org.apache.co...> but was:<[
]usage: org.apache.co...>
  BugsTest.test13666:257 expected:<[]usage: dir
 -d <arg>...> but was:<[
]usage: dir
 -d <arg>...>



Tests run: 424, Failures: 18, Errors: 0, Skipped: 0

[INFO] ------------------------------------------------------------------------
[INFO] BUILD FAILURE
[INFO] ------------------------------------------------------------------------
[INFO] Total time: 9.928s
[INFO] Finished at: Sun Aug 02 03:28:31 BST 2015
[INFO] Final Memory: 22M/344M
[INFO] ------------------------------------------------------------------------
[ERROR] Failed to execute goal org.apache.maven.plugins:maven-surefire-plugin:2.18:test (default-test) on project commons-cli: There are test failures.
[ERROR] 
[ERROR] Please refer to /home/perham/Study/LittleDarwin/Cases/commons-cli-1.3.1-src/target/surefire-reports for the individual test results.
[ERROR] -> [Help 1]
[ERROR] 
[ERROR] To see the full stack trace of the errors, re-run Maven with the -e switch.
[ERROR] Re-run Maven using the -X switch to enable full debug logging.
[ERROR] 
[ERROR] For more information about the errors and possible solutions, please read the following articles:
[ERROR] [Help 1] http://cwiki.apache.org/confluence/display/MAVEN/MojoFailureException
