[INFO] Scanning for projects...
[INFO]                                                                         
[INFO] ------------------------------------------------------------------------
[INFO] Building Apache Commons CLI 1.3.1
[INFO] ------------------------------------------------------------------------
[INFO] 
[INFO] --- maven-enforcer-plugin:1.3.1:enforce (enforce-maven-3) @ commons-cli ---
[INFO] 
[INFO] --- build-helper-maven-plugin:1.8:parse-version (parse-version) @ commons-cli ---
[INFO] 
[INFO] --- maven-antrun-plugin:1.7:run (javadoc.resources) @ commons-cli ---
[INFO] Executing tasks

main:
[INFO] Executed tasks
[INFO] 
[INFO] --- maven-remote-resources-plugin:1.5:process (default) @ commons-cli ---
[INFO] 
[INFO] --- buildnumber-maven-plugin:1.3:create (default) @ commons-cli ---
[INFO] Executing: /bin/sh -c cd /home/perham/Study/LittleDarwin/Cases/commons-cli-1.3.1-src && svn --non-interactive info
[INFO] Working directory: /home/perham/Study/LittleDarwin/Cases/commons-cli-1.3.1-src
[INFO] Storing buildNumber: ?????? at timestamp: 1438481054521
[INFO] Executing: /bin/sh -c cd /home/perham/Study/LittleDarwin/Cases/commons-cli-1.3.1-src && svn --non-interactive info
[INFO] Working directory: /home/perham/Study/LittleDarwin/Cases/commons-cli-1.3.1-src
[INFO] Storing buildScmBranch: UNKNOWN_BRANCH
[INFO] 
[INFO] --- maven-resources-plugin:2.7:resources (default-resources) @ commons-cli ---
[INFO] Using 'iso-8859-1' encoding to copy filtered resources.
[INFO] skip non existing resourceDirectory /home/perham/Study/LittleDarwin/Cases/commons-cli-1.3.1-src/src/main/resources
[INFO] Copying 2 resources to META-INF
[INFO] 
[INFO] --- maven-compiler-plugin:3.2:compile (default-compile) @ commons-cli ---
[INFO] Changes detected - recompiling the module!
[INFO] Compiling 23 source files to /home/perham/Study/LittleDarwin/Cases/commons-cli-1.3.1-src/target/classes
[INFO] /home/perham/Study/LittleDarwin/Cases/commons-cli-1.3.1-src/src/main/java/org/apache/commons/cli/Parser.java: Some input files use unchecked or unsafe operations.
[INFO] /home/perham/Study/LittleDarwin/Cases/commons-cli-1.3.1-src/src/main/java/org/apache/commons/cli/Parser.java: Recompile with -Xlint:unchecked for details.
[INFO] 
[INFO] --- maven-bundle-plugin:2.5.3:manifest (bundle-manifest) @ commons-cli ---
[INFO] 
[INFO] --- animal-sniffer-maven-plugin:1.13:check (checkAPIcompatibility) @ commons-cli ---
[INFO] Checking unresolved references to org.codehaus.mojo.signature:java15:1.0
[INFO] 
[INFO] --- maven-resources-plugin:2.7:testResources (default-testResources) @ commons-cli ---
[INFO] Using 'iso-8859-1' encoding to copy filtered resources.
[INFO] Copying 0 resource
[INFO] Copying 2 resources to META-INF
[INFO] 
[INFO] --- maven-compiler-plugin:3.2:testCompile (default-testCompile) @ commons-cli ---
[INFO] Nothing to compile - all classes are up to date
[INFO] 
[INFO] --- jacoco-maven-plugin:0.7.2.201409121644:prepare-agent (prepare-agent) @ commons-cli ---
[INFO] argLine set to -javaagent:/home/perham/.m2/repository/org/jacoco/org.jacoco.agent/0.7.2.201409121644/org.jacoco.agent-0.7.2.201409121644-runtime.jar=destfile=/home/perham/Study/LittleDarwin/Cases/commons-cli-1.3.1-src/target/jacoco.exec
[INFO] 
[INFO] --- maven-surefire-plugin:2.18:test (default-test) @ commons-cli ---
[INFO] Surefire report directory: /home/perham/Study/LittleDarwin/Cases/commons-cli-1.3.1-src/target/surefire-reports

-------------------------------------------------------
 T E S T S
-------------------------------------------------------
Running org.apache.commons.cli.ArgumentIsOptionTest
Tests run: 3, Failures: 0, Errors: 0, Skipped: 0, Time elapsed: 0.014 sec - in org.apache.commons.cli.ArgumentIsOptionTest
Running org.apache.commons.cli.DefaultParserTest
Tests run: 58, Failures: 0, Errors: 0, Skipped: 0, Time elapsed: 0.124 sec - in org.apache.commons.cli.DefaultParserTest
Running org.apache.commons.cli.ValuesTest
Tests run: 7, Failures: 0, Errors: 0, Skipped: 0, Time elapsed: 0.022 sec - in org.apache.commons.cli.ValuesTest
Running org.apache.commons.cli.OptionsTest
Tests run: 10, Failures: 0, Errors: 0, Skipped: 0, Time elapsed: 0.001 sec - in org.apache.commons.cli.OptionsTest
Running org.apache.commons.cli.GnuParserTest
Tests run: 58, Failures: 0, Errors: 0, Skipped: 0, Time elapsed: 0.046 sec - in org.apache.commons.cli.GnuParserTest
Running org.apache.commons.cli.PatternOptionBuilderTest
Exception found converting v to desired type: Unable to parse the URL: foo://commons.apache.org
Exception found converting d to desired type: Unable to find the class: System.DateTime
Exception found converting x to desired type: For input string: "3,5"
Exception found converting i to desired type: java.lang.IllegalAccessException; Unable to create an instance of: java.util.Calendar
Exception found converting n to desired type: Unable to find the class: System.DateTime
Tests run: 9, Failures: 0, Errors: 0, Skipped: 0, Time elapsed: 0.034 sec - in org.apache.commons.cli.PatternOptionBuilderTest
Running org.apache.commons.cli.ApplicationTest
Tests run: 5, Failures: 0, Errors: 1, Skipped: 0, Time elapsed: 0.03 sec <<< FAILURE! - in org.apache.commons.cli.ApplicationTest
testMan(org.apache.commons.cli.ApplicationTest)  Time elapsed: 0.029 sec  <<< ERROR!
java.lang.StringIndexOutOfBoundsException: String index out of range: 57
	at java.lang.String.charAt(String.java:658)
	at org.apache.commons.cli.HelpFormatter.rtrim(HelpFormatter.java:174)
	at org.apache.commons.cli.HelpFormatter.renderWrappedText(HelpFormatter.java:141)
	at org.apache.commons.cli.HelpFormatter.renderWrappedTextBlock(HelpFormatter.java:155)
	at org.apache.commons.cli.HelpFormatter.printWrapped(HelpFormatter.java:108)
	at org.apache.commons.cli.HelpFormatter.printUsage(HelpFormatter.java:102)
	at org.apache.commons.cli.HelpFormatter.printHelp(HelpFormatter.java:70)
	at org.apache.commons.cli.ApplicationTest.testMan(ApplicationTest.java:228)

Running org.apache.commons.cli.OptionTest
Tests run: 9, Failures: 0, Errors: 0, Skipped: 0, Time elapsed: 0.001 sec - in org.apache.commons.cli.OptionTest
Running org.apache.commons.cli.bug.BugCLI252Test
Tests run: 60, Failures: 0, Errors: 0, Skipped: 0, Time elapsed: 0.032 sec - in org.apache.commons.cli.bug.BugCLI252Test
Running org.apache.commons.cli.bug.BugCLI162Test
Tests run: 4, Failures: 0, Errors: 4, Skipped: 0, Time elapsed: 0.001 sec <<< FAILURE! - in org.apache.commons.cli.bug.BugCLI162Test
testInfiniteLoop(org.apache.commons.cli.bug.BugCLI162Test)  Time elapsed: 0 sec  <<< ERROR!
java.lang.StringIndexOutOfBoundsException: String index out of range: 11
	at java.lang.String.charAt(String.java:658)
	at org.apache.commons.cli.HelpFormatter.rtrim(HelpFormatter.java:174)
	at org.apache.commons.cli.HelpFormatter.renderWrappedText(HelpFormatter.java:139)
	at org.apache.commons.cli.HelpFormatter.renderWrappedTextBlock(HelpFormatter.java:155)
	at org.apache.commons.cli.HelpFormatter.printWrapped(HelpFormatter.java:108)
	at org.apache.commons.cli.HelpFormatter.printUsage(HelpFormatter.java:102)
	at org.apache.commons.cli.HelpFormatter.printHelp(HelpFormatter.java:70)
	at org.apache.commons.cli.HelpFormatter.printHelp(HelpFormatter.java:67)
	at org.apache.commons.cli.bug.BugCLI162Test.testInfiniteLoop(BugCLI162Test.java:54)

testLongLineChunkingIndentIgnored(org.apache.commons.cli.bug.BugCLI162Test)  Time elapsed: 0 sec  <<< ERROR!
java.lang.StringIndexOutOfBoundsException: String index out of range: 7
	at java.lang.String.charAt(String.java:658)
	at org.apache.commons.cli.HelpFormatter.rtrim(HelpFormatter.java:174)
	at org.apache.commons.cli.HelpFormatter.renderWrappedText(HelpFormatter.java:141)
	at org.apache.commons.cli.HelpFormatter.renderWrappedTextBlock(HelpFormatter.java:155)
	at org.apache.commons.cli.HelpFormatter.printWrapped(HelpFormatter.java:108)
	at org.apache.commons.cli.HelpFormatter.printUsage(HelpFormatter.java:102)
	at org.apache.commons.cli.HelpFormatter.printHelp(HelpFormatter.java:70)
	at org.apache.commons.cli.HelpFormatter.printHelp(HelpFormatter.java:67)
	at org.apache.commons.cli.bug.BugCLI162Test.testLongLineChunkingIndentIgnored(BugCLI162Test.java:350)

testLongLineChunking(org.apache.commons.cli.bug.BugCLI162Test)  Time elapsed: 0 sec  <<< ERROR!
java.lang.StringIndexOutOfBoundsException: String index out of range: 7
	at java.lang.String.charAt(String.java:658)
	at org.apache.commons.cli.HelpFormatter.rtrim(HelpFormatter.java:174)
	at org.apache.commons.cli.HelpFormatter.renderWrappedText(HelpFormatter.java:141)
	at org.apache.commons.cli.HelpFormatter.renderWrappedTextBlock(HelpFormatter.java:155)
	at org.apache.commons.cli.HelpFormatter.printWrapped(HelpFormatter.java:108)
	at org.apache.commons.cli.HelpFormatter.printUsage(HelpFormatter.java:102)
	at org.apache.commons.cli.HelpFormatter.printHelp(HelpFormatter.java:70)
	at org.apache.commons.cli.HelpFormatter.printHelp(HelpFormatter.java:67)
	at org.apache.commons.cli.bug.BugCLI162Test.testLongLineChunking(BugCLI162Test.java:321)

testPrintHelpLongLines(org.apache.commons.cli.bug.BugCLI162Test)  Time elapsed: 0 sec  <<< ERROR!
java.lang.StringIndexOutOfBoundsException: String index out of range: 48
	at java.lang.String.charAt(String.java:658)
	at org.apache.commons.cli.HelpFormatter.rtrim(HelpFormatter.java:174)
	at org.apache.commons.cli.HelpFormatter.renderWrappedText(HelpFormatter.java:139)
	at org.apache.commons.cli.HelpFormatter.renderWrappedTextBlock(HelpFormatter.java:155)
	at org.apache.commons.cli.HelpFormatter.printWrapped(HelpFormatter.java:108)
	at org.apache.commons.cli.HelpFormatter.printUsage(HelpFormatter.java:102)
	at org.apache.commons.cli.HelpFormatter.printHelp(HelpFormatter.java:70)
	at org.apache.commons.cli.HelpFormatter.printHelp(HelpFormatter.java:67)
	at org.apache.commons.cli.bug.BugCLI162Test.testPrintHelpLongLines(BugCLI162Test.java:252)

Running org.apache.commons.cli.bug.BugCLI71Test
Tests run: 4, Failures: 0, Errors: 0, Skipped: 0, Time elapsed: 0 sec - in org.apache.commons.cli.bug.BugCLI71Test
Running org.apache.commons.cli.bug.BugCLI18Test
Tests run: 1, Failures: 0, Errors: 1, Skipped: 0, Time elapsed: 0 sec <<< FAILURE! - in org.apache.commons.cli.bug.BugCLI18Test
testCLI18(org.apache.commons.cli.bug.BugCLI18Test)  Time elapsed: 0 sec  <<< ERROR!
java.lang.StringIndexOutOfBoundsException: String index out of range: 32
	at java.lang.String.charAt(String.java:658)
	at org.apache.commons.cli.HelpFormatter.rtrim(HelpFormatter.java:174)
	at org.apache.commons.cli.HelpFormatter.renderWrappedText(HelpFormatter.java:139)
	at org.apache.commons.cli.HelpFormatter.renderWrappedTextBlock(HelpFormatter.java:155)
	at org.apache.commons.cli.HelpFormatter.printWrapped(HelpFormatter.java:108)
	at org.apache.commons.cli.HelpFormatter.printUsage(HelpFormatter.java:86)
	at org.apache.commons.cli.HelpFormatter.printHelp(HelpFormatter.java:69)
	at org.apache.commons.cli.bug.BugCLI18Test.testCLI18(BugCLI18Test.java:44)

Running org.apache.commons.cli.bug.BugCLI133Test
Tests run: 1, Failures: 0, Errors: 0, Skipped: 0, Time elapsed: 0 sec - in org.apache.commons.cli.bug.BugCLI133Test
Running org.apache.commons.cli.bug.BugCLI13Test
Tests run: 1, Failures: 0, Errors: 0, Skipped: 0, Time elapsed: 0 sec - in org.apache.commons.cli.bug.BugCLI13Test
Running org.apache.commons.cli.bug.BugCLI148Test
Tests run: 2, Failures: 0, Errors: 0, Skipped: 0, Time elapsed: 0 sec - in org.apache.commons.cli.bug.BugCLI148Test
Running org.apache.commons.cli.bug.BugsTest
Tests run: 12, Failures: 0, Errors: 1, Skipped: 0, Time elapsed: 0.001 sec <<< FAILURE! - in org.apache.commons.cli.bug.BugsTest
test13666(org.apache.commons.cli.bug.BugsTest)  Time elapsed: 0 sec  <<< ERROR!
java.lang.StringIndexOutOfBoundsException: String index out of range: 11
	at java.lang.String.charAt(String.java:658)
	at org.apache.commons.cli.HelpFormatter.rtrim(HelpFormatter.java:174)
	at org.apache.commons.cli.HelpFormatter.renderWrappedText(HelpFormatter.java:139)
	at org.apache.commons.cli.HelpFormatter.renderWrappedTextBlock(HelpFormatter.java:155)
	at org.apache.commons.cli.HelpFormatter.printWrapped(HelpFormatter.java:108)
	at org.apache.commons.cli.HelpFormatter.printUsage(HelpFormatter.java:102)
	at org.apache.commons.cli.HelpFormatter.printHelp(HelpFormatter.java:70)
	at org.apache.commons.cli.HelpFormatter.printHelp(HelpFormatter.java:65)
	at org.apache.commons.cli.HelpFormatter.printHelp(HelpFormatter.java:59)
	at org.apache.commons.cli.bug.BugsTest.test13666(BugsTest.java:255)

Running org.apache.commons.cli.HelpFormatterTest
Tests run: 25, Failures: 0, Errors: 22, Skipped: 0, Time elapsed: 0.019 sec <<< FAILURE! - in org.apache.commons.cli.HelpFormatterTest
testUsageWithLongOptSeparator(org.apache.commons.cli.HelpFormatterTest)  Time elapsed: 0 sec  <<< ERROR!
java.lang.StringIndexOutOfBoundsException: String index out of range: 51
	at java.lang.String.charAt(String.java:658)
	at org.apache.commons.cli.HelpFormatter.rtrim(HelpFormatter.java:174)
	at org.apache.commons.cli.HelpFormatter.renderWrappedText(HelpFormatter.java:139)
	at org.apache.commons.cli.HelpFormatter.renderWrappedTextBlock(HelpFormatter.java:155)
	at org.apache.commons.cli.HelpFormatter.printWrapped(HelpFormatter.java:108)
	at org.apache.commons.cli.HelpFormatter.printUsage(HelpFormatter.java:86)
	at org.apache.commons.cli.HelpFormatterTest.testUsageWithLongOptSeparator(HelpFormatterTest.java:606)

testRenderWrappedTextSingleLine(org.apache.commons.cli.HelpFormatterTest)  Time elapsed: 0 sec  <<< ERROR!
java.lang.StringIndexOutOfBoundsException: String index out of range: 10
	at java.lang.String.charAt(String.java:658)
	at org.apache.commons.cli.HelpFormatter.rtrim(HelpFormatter.java:174)
	at org.apache.commons.cli.HelpFormatter.renderWrappedText(HelpFormatter.java:141)
	at org.apache.commons.cli.HelpFormatterTest.testRenderWrappedTextSingleLine(HelpFormatterTest.java:90)

testIndentedHeaderAndFooter(org.apache.commons.cli.HelpFormatterTest)  Time elapsed: 0.001 sec  <<< ERROR!
java.lang.StringIndexOutOfBoundsException: String index out of range: 15
	at java.lang.String.charAt(String.java:658)
	at org.apache.commons.cli.HelpFormatter.rtrim(HelpFormatter.java:174)
	at org.apache.commons.cli.HelpFormatter.renderWrappedText(HelpFormatter.java:139)
	at org.apache.commons.cli.HelpFormatter.renderWrappedTextBlock(HelpFormatter.java:155)
	at org.apache.commons.cli.HelpFormatter.printWrapped(HelpFormatter.java:108)
	at org.apache.commons.cli.HelpFormatter.printUsage(HelpFormatter.java:86)
	at org.apache.commons.cli.HelpFormatter.printHelp(HelpFormatter.java:69)
	at org.apache.commons.cli.HelpFormatterTest.testIndentedHeaderAndFooter(HelpFormatterTest.java:462)

testPrintSortedUsageWithNullComparator(org.apache.commons.cli.HelpFormatterTest)  Time elapsed: 0.001 sec  <<< ERROR!
java.lang.StringIndexOutOfBoundsException: String index out of range: 26
	at java.lang.String.charAt(String.java:658)
	at org.apache.commons.cli.HelpFormatter.rtrim(HelpFormatter.java:174)
	at org.apache.commons.cli.HelpFormatter.renderWrappedText(HelpFormatter.java:139)
	at org.apache.commons.cli.HelpFormatter.renderWrappedTextBlock(HelpFormatter.java:155)
	at org.apache.commons.cli.HelpFormatter.printWrapped(HelpFormatter.java:108)
	at org.apache.commons.cli.HelpFormatter.printUsage(HelpFormatter.java:86)
	at org.apache.commons.cli.HelpFormatterTest.testPrintSortedUsageWithNullComparator(HelpFormatterTest.java:315)

testRtrim(org.apache.commons.cli.HelpFormatterTest)  Time elapsed: 0.001 sec  <<< ERROR!
java.lang.StringIndexOutOfBoundsException: String index out of range: 8
	at java.lang.String.charAt(String.java:658)
	at org.apache.commons.cli.HelpFormatter.rtrim(HelpFormatter.java:174)
	at org.apache.commons.cli.HelpFormatterTest.testRtrim(HelpFormatterTest.java:401)

testPrintRequiredOptionGroupUsage(org.apache.commons.cli.HelpFormatterTest)  Time elapsed: 0.001 sec  <<< ERROR!
java.lang.StringIndexOutOfBoundsException: String index out of range: 26
	at java.lang.String.charAt(String.java:658)
	at org.apache.commons.cli.HelpFormatter.rtrim(HelpFormatter.java:174)
	at org.apache.commons.cli.HelpFormatter.renderWrappedText(HelpFormatter.java:139)
	at org.apache.commons.cli.HelpFormatter.renderWrappedTextBlock(HelpFormatter.java:155)
	at org.apache.commons.cli.HelpFormatter.printWrapped(HelpFormatter.java:108)
	at org.apache.commons.cli.HelpFormatter.printUsage(HelpFormatter.java:86)
	at org.apache.commons.cli.HelpFormatterTest.testPrintRequiredOptionGroupUsage(HelpFormatterTest.java:354)

testHelpWithLongOptSeparator(org.apache.commons.cli.HelpFormatterTest)  Time elapsed: 0.001 sec  <<< ERROR!
java.lang.StringIndexOutOfBoundsException: String index out of range: 14
	at java.lang.String.charAt(String.java:658)
	at org.apache.commons.cli.HelpFormatter.rtrim(HelpFormatter.java:174)
	at org.apache.commons.cli.HelpFormatter.renderWrappedText(HelpFormatter.java:139)
	at org.apache.commons.cli.HelpFormatter.renderWrappedTextBlock(HelpFormatter.java:155)
	at org.apache.commons.cli.HelpFormatter.printWrapped(HelpFormatter.java:108)
	at org.apache.commons.cli.HelpFormatter.printUsage(HelpFormatter.java:102)
	at org.apache.commons.cli.HelpFormatter.printHelp(HelpFormatter.java:70)
	at org.apache.commons.cli.HelpFormatter.printHelp(HelpFormatter.java:67)
	at org.apache.commons.cli.HelpFormatterTest.testHelpWithLongOptSeparator(HelpFormatterTest.java:581)

testRenderWrappedTextSingleLinePadded(org.apache.commons.cli.HelpFormatterTest)  Time elapsed: 0 sec  <<< ERROR!
java.lang.StringIndexOutOfBoundsException: String index out of range: 10
	at java.lang.String.charAt(String.java:658)
	at org.apache.commons.cli.HelpFormatter.rtrim(HelpFormatter.java:174)
	at org.apache.commons.cli.HelpFormatter.renderWrappedText(HelpFormatter.java:141)
	at org.apache.commons.cli.HelpFormatterTest.testRenderWrappedTextSingleLinePadded(HelpFormatterTest.java:105)

testRenderWrappedTextMultiLine(org.apache.commons.cli.HelpFormatterTest)  Time elapsed: 0.001 sec  <<< ERROR!
java.lang.StringIndexOutOfBoundsException: String index out of range: 16
	at java.lang.String.charAt(String.java:658)
	at org.apache.commons.cli.HelpFormatter.rtrim(HelpFormatter.java:174)
	at org.apache.commons.cli.HelpFormatter.renderWrappedText(HelpFormatter.java:141)
	at org.apache.commons.cli.HelpFormatterTest.testRenderWrappedTextMultiLine(HelpFormatterTest.java:137)

testPrintUsage(org.apache.commons.cli.HelpFormatterTest)  Time elapsed: 0.001 sec  <<< ERROR!
java.lang.StringIndexOutOfBoundsException: String index out of range: 26
	at java.lang.String.charAt(String.java:658)
	at org.apache.commons.cli.HelpFormatter.rtrim(HelpFormatter.java:174)
	at org.apache.commons.cli.HelpFormatter.renderWrappedText(HelpFormatter.java:139)
	at org.apache.commons.cli.HelpFormatter.renderWrappedTextBlock(HelpFormatter.java:155)
	at org.apache.commons.cli.HelpFormatter.printWrapped(HelpFormatter.java:108)
	at org.apache.commons.cli.HelpFormatter.printUsage(HelpFormatter.java:86)
	at org.apache.commons.cli.HelpFormatterTest.testPrintUsage(HelpFormatterTest.java:273)

testPrintSortedUsage(org.apache.commons.cli.HelpFormatterTest)  Time elapsed: 0.001 sec  <<< ERROR!
java.lang.StringIndexOutOfBoundsException: String index out of range: 26
	at java.lang.String.charAt(String.java:658)
	at org.apache.commons.cli.HelpFormatter.rtrim(HelpFormatter.java:174)
	at org.apache.commons.cli.HelpFormatter.renderWrappedText(HelpFormatter.java:139)
	at org.apache.commons.cli.HelpFormatter.renderWrappedTextBlock(HelpFormatter.java:155)
	at org.apache.commons.cli.HelpFormatter.printWrapped(HelpFormatter.java:108)
	at org.apache.commons.cli.HelpFormatter.printUsage(HelpFormatter.java:86)
	at org.apache.commons.cli.HelpFormatterTest.testPrintSortedUsage(HelpFormatterTest.java:298)

testPrintOptions(org.apache.commons.cli.HelpFormatterTest)  Time elapsed: 0 sec  <<< ERROR!
java.lang.StringIndexOutOfBoundsException: String index out of range: 31
	at java.lang.String.charAt(String.java:658)
	at org.apache.commons.cli.HelpFormatter.rtrim(HelpFormatter.java:174)
	at org.apache.commons.cli.HelpFormatter.renderWrappedText(HelpFormatter.java:139)
	at org.apache.commons.cli.HelpFormatter.renderOptions(HelpFormatter.java:135)
	at org.apache.commons.cli.HelpFormatterTest.testPrintOptions(HelpFormatterTest.java:173)

testAutomaticUsage(org.apache.commons.cli.HelpFormatterTest)  Time elapsed: 0 sec  <<< ERROR!
java.lang.StringIndexOutOfBoundsException: String index out of range: 16
	at java.lang.String.charAt(String.java:658)
	at org.apache.commons.cli.HelpFormatter.rtrim(HelpFormatter.java:174)
	at org.apache.commons.cli.HelpFormatter.renderWrappedText(HelpFormatter.java:139)
	at org.apache.commons.cli.HelpFormatter.renderWrappedTextBlock(HelpFormatter.java:155)
	at org.apache.commons.cli.HelpFormatter.printWrapped(HelpFormatter.java:108)
	at org.apache.commons.cli.HelpFormatter.printUsage(HelpFormatter.java:86)
	at org.apache.commons.cli.HelpFormatterTest.testAutomaticUsage(HelpFormatterTest.java:244)

testDefaultArgName(org.apache.commons.cli.HelpFormatterTest)  Time elapsed: 0 sec  <<< ERROR!
java.lang.StringIndexOutOfBoundsException: String index out of range: 25
	at java.lang.String.charAt(String.java:658)
	at org.apache.commons.cli.HelpFormatter.rtrim(HelpFormatter.java:174)
	at org.apache.commons.cli.HelpFormatter.renderWrappedText(HelpFormatter.java:139)
	at org.apache.commons.cli.HelpFormatter.renderWrappedTextBlock(HelpFormatter.java:155)
	at org.apache.commons.cli.HelpFormatter.printWrapped(HelpFormatter.java:108)
	at org.apache.commons.cli.HelpFormatter.printUsage(HelpFormatter.java:86)
	at org.apache.commons.cli.HelpFormatterTest.testDefaultArgName(HelpFormatterTest.java:389)

testHeaderStartingWithLineSeparator(org.apache.commons.cli.HelpFormatterTest)  Time elapsed: 0 sec  <<< ERROR!
java.lang.StringIndexOutOfBoundsException: String index out of range: 15
	at java.lang.String.charAt(String.java:658)
	at org.apache.commons.cli.HelpFormatter.rtrim(HelpFormatter.java:174)
	at org.apache.commons.cli.HelpFormatter.renderWrappedText(HelpFormatter.java:139)
	at org.apache.commons.cli.HelpFormatter.renderWrappedTextBlock(HelpFormatter.java:155)
	at org.apache.commons.cli.HelpFormatter.printWrapped(HelpFormatter.java:108)
	at org.apache.commons.cli.HelpFormatter.printUsage(HelpFormatter.java:86)
	at org.apache.commons.cli.HelpFormatter.printHelp(HelpFormatter.java:69)
	at org.apache.commons.cli.HelpFormatterTest.testHeaderStartingWithLineSeparator(HelpFormatterTest.java:443)

testRenderWrappedTextWordCut(org.apache.commons.cli.HelpFormatterTest)  Time elapsed: 0 sec  <<< ERROR!
java.lang.StringIndexOutOfBoundsException: String index out of range: 8
	at java.lang.String.charAt(String.java:658)
	at org.apache.commons.cli.HelpFormatter.rtrim(HelpFormatter.java:174)
	at org.apache.commons.cli.HelpFormatter.renderWrappedText(HelpFormatter.java:141)
	at org.apache.commons.cli.HelpFormatterTest.testRenderWrappedTextWordCut(HelpFormatterTest.java:75)

testOptionWithoutShortFormat(org.apache.commons.cli.HelpFormatterTest)  Time elapsed: 0 sec  <<< ERROR!
java.lang.StringIndexOutOfBoundsException: String index out of range: 32
	at java.lang.String.charAt(String.java:658)
	at org.apache.commons.cli.HelpFormatter.rtrim(HelpFormatter.java:174)
	at org.apache.commons.cli.HelpFormatter.renderWrappedText(HelpFormatter.java:139)
	at org.apache.commons.cli.HelpFormatter.renderWrappedTextBlock(HelpFormatter.java:155)
	at org.apache.commons.cli.HelpFormatter.printWrapped(HelpFormatter.java:108)
	at org.apache.commons.cli.HelpFormatter.printUsage(HelpFormatter.java:86)
	at org.apache.commons.cli.HelpFormatter.printHelp(HelpFormatter.java:69)
	at org.apache.commons.cli.HelpFormatterTest.testOptionWithoutShortFormat(HelpFormatterTest.java:485)

testRenderWrappedTextMultiLinePadded(org.apache.commons.cli.HelpFormatterTest)  Time elapsed: 0 sec  <<< ERROR!
java.lang.StringIndexOutOfBoundsException: String index out of range: 16
	at java.lang.String.charAt(String.java:658)
	at org.apache.commons.cli.HelpFormatter.rtrim(HelpFormatter.java:174)
	at org.apache.commons.cli.HelpFormatter.renderWrappedText(HelpFormatter.java:141)
	at org.apache.commons.cli.HelpFormatterTest.testRenderWrappedTextMultiLinePadded(HelpFormatterTest.java:155)

testPrintOptionGroupUsage(org.apache.commons.cli.HelpFormatterTest)  Time elapsed: 0 sec  <<< ERROR!
java.lang.StringIndexOutOfBoundsException: String index out of range: 28
	at java.lang.String.charAt(String.java:658)
	at org.apache.commons.cli.HelpFormatter.rtrim(HelpFormatter.java:174)
	at org.apache.commons.cli.HelpFormatter.renderWrappedText(HelpFormatter.java:139)
	at org.apache.commons.cli.HelpFormatter.renderWrappedTextBlock(HelpFormatter.java:155)
	at org.apache.commons.cli.HelpFormatter.printWrapped(HelpFormatter.java:108)
	at org.apache.commons.cli.HelpFormatter.printUsage(HelpFormatter.java:86)
	at org.apache.commons.cli.HelpFormatterTest.testPrintOptionGroupUsage(HelpFormatterTest.java:334)

testPrintOptionWithEmptyArgNameUsage(org.apache.commons.cli.HelpFormatterTest)  Time elapsed: 0 sec  <<< ERROR!
java.lang.StringIndexOutOfBoundsException: String index out of range: 14
	at java.lang.String.charAt(String.java:658)
	at org.apache.commons.cli.HelpFormatter.rtrim(HelpFormatter.java:174)
	at org.apache.commons.cli.HelpFormatter.renderWrappedText(HelpFormatter.java:139)
	at org.apache.commons.cli.HelpFormatter.renderWrappedTextBlock(HelpFormatter.java:155)
	at org.apache.commons.cli.HelpFormatter.printWrapped(HelpFormatter.java:108)
	at org.apache.commons.cli.HelpFormatter.printUsage(HelpFormatter.java:86)
	at org.apache.commons.cli.HelpFormatterTest.testPrintOptionWithEmptyArgNameUsage(HelpFormatterTest.java:372)

testRenderWrappedTextSingleLinePadded2(org.apache.commons.cli.HelpFormatterTest)  Time elapsed: 0 sec  <<< ERROR!
java.lang.StringIndexOutOfBoundsException: String index out of range: 51
	at java.lang.String.charAt(String.java:658)
	at org.apache.commons.cli.HelpFormatter.rtrim(HelpFormatter.java:174)
	at org.apache.commons.cli.HelpFormatter.renderWrappedText(HelpFormatter.java:141)
	at org.apache.commons.cli.HelpFormatterTest.testRenderWrappedTextSingleLinePadded2(HelpFormatterTest.java:122)

testOptionWithoutShortFormat2(org.apache.commons.cli.HelpFormatterTest)  Time elapsed: 0.001 sec  <<< ERROR!
java.lang.StringIndexOutOfBoundsException: String index out of range: 79
	at java.lang.String.charAt(String.java:658)
	at org.apache.commons.cli.HelpFormatter.rtrim(HelpFormatter.java:174)
	at org.apache.commons.cli.HelpFormatter.renderWrappedText(HelpFormatter.java:141)
	at org.apache.commons.cli.HelpFormatter.renderWrappedTextBlock(HelpFormatter.java:155)
	at org.apache.commons.cli.HelpFormatter.printWrapped(HelpFormatter.java:108)
	at org.apache.commons.cli.HelpFormatter.printUsage(HelpFormatter.java:86)
	at org.apache.commons.cli.HelpFormatter.printHelp(HelpFormatter.java:69)
	at org.apache.commons.cli.HelpFormatterTest.testOptionWithoutShortFormat2(HelpFormatterTest.java:548)

Running org.apache.commons.cli.OptionBuilderTest
Tests run: 9, Failures: 0, Errors: 0, Skipped: 0, Time elapsed: 0.001 sec - in org.apache.commons.cli.OptionBuilderTest
Running org.apache.commons.cli.PosixParserTest
Tests run: 58, Failures: 0, Errors: 0, Skipped: 0, Time elapsed: 0.023 sec - in org.apache.commons.cli.PosixParserTest
Running org.apache.commons.cli.UtilTest
Tests run: 2, Failures: 0, Errors: 0, Skipped: 0, Time elapsed: 0 sec - in org.apache.commons.cli.UtilTest
Running org.apache.commons.cli.OptionGroupTest
Tests run: 13, Failures: 0, Errors: 0, Skipped: 0, Time elapsed: 0.007 sec - in org.apache.commons.cli.OptionGroupTest
Running org.apache.commons.cli.CommandLineTest
Tests run: 3, Failures: 0, Errors: 0, Skipped: 0, Time elapsed: 0.002 sec - in org.apache.commons.cli.CommandLineTest
Running org.apache.commons.cli.BasicParserTest
Tests run: 58, Failures: 0, Errors: 0, Skipped: 0, Time elapsed: 0.036 sec - in org.apache.commons.cli.BasicParserTest
Running org.apache.commons.cli.ValueTest
Tests run: 12, Failures: 0, Errors: 0, Skipped: 0, Time elapsed: 0.008 sec - in org.apache.commons.cli.ValueTest

Results :


Tests in error: 
  ApplicationTest.testMan:228 » StringIndexOutOfBounds String index out of range...
  HelpFormatterTest.testAutomaticUsage:244 » StringIndexOutOfBounds String index...
  HelpFormatterTest.testDefaultArgName:389 » StringIndexOutOfBounds String index...
  HelpFormatterTest.testHeaderStartingWithLineSeparator:443 » StringIndexOutOfBounds
  HelpFormatterTest.testHelpWithLongOptSeparator:581 » StringIndexOutOfBounds St...
  HelpFormatterTest.testIndentedHeaderAndFooter:462 » StringIndexOutOfBounds Str...
  HelpFormatterTest.testOptionWithoutShortFormat:485 » StringIndexOutOfBounds St...
  HelpFormatterTest.testOptionWithoutShortFormat2:548 » StringIndexOutOfBounds S...
  HelpFormatterTest.testPrintOptionGroupUsage:334 » StringIndexOutOfBounds Strin...
  HelpFormatterTest.testPrintOptionWithEmptyArgNameUsage:372 » StringIndexOutOfBounds
  HelpFormatterTest.testPrintOptions:173 » StringIndexOutOfBounds String index o...
  HelpFormatterTest.testPrintRequiredOptionGroupUsage:354 » StringIndexOutOfBounds
  HelpFormatterTest.testPrintSortedUsage:298 » StringIndexOutOfBounds String ind...
  HelpFormatterTest.testPrintSortedUsageWithNullComparator:315 » StringIndexOutOfBounds
  HelpFormatterTest.testPrintUsage:273 » StringIndexOutOfBounds String index out...
  HelpFormatterTest.testRenderWrappedTextMultiLine:137 » StringIndexOutOfBounds ...
  HelpFormatterTest.testRenderWrappedTextMultiLinePadded:155 » StringIndexOutOfBounds
  HelpFormatterTest.testRenderWrappedTextSingleLine:90 » StringIndexOutOfBounds ...
  HelpFormatterTest.testRenderWrappedTextSingleLinePadded:105 » StringIndexOutOfBounds
  HelpFormatterTest.testRenderWrappedTextSingleLinePadded2:122 » StringIndexOutOfBounds
  HelpFormatterTest.testRenderWrappedTextWordCut:75 » StringIndexOutOfBounds Str...
  HelpFormatterTest.testRtrim:401 » StringIndexOutOfBounds String index out of r...
  HelpFormatterTest.testUsageWithLongOptSeparator:606 » StringIndexOutOfBounds S...
  BugCLI162Test.testInfiniteLoop:54 » StringIndexOutOfBounds String index out of...
  BugCLI162Test.testLongLineChunking:321 » StringIndexOutOfBounds String index o...
  BugCLI162Test.testLongLineChunkingIndentIgnored:350 » StringIndexOutOfBounds S...
  BugCLI162Test.testPrintHelpLongLines:252 » StringIndexOutOfBounds String index...
  BugCLI18Test.testCLI18:44 » StringIndexOutOfBounds String index out of range: ...
  BugsTest.test13666:255 » StringIndexOutOfBounds String index out of range: 11


Tests run: 424, Failures: 0, Errors: 29, Skipped: 0

[INFO] ------------------------------------------------------------------------
[INFO] BUILD FAILURE
[INFO] ------------------------------------------------------------------------
[INFO] Total time: 9.873s
[INFO] Finished at: Sun Aug 02 03:04:21 BST 2015
[INFO] Final Memory: 22M/345M
[INFO] ------------------------------------------------------------------------
[ERROR] Failed to execute goal org.apache.maven.plugins:maven-surefire-plugin:2.18:test (default-test) on project commons-cli: There are test failures.
[ERROR] 
[ERROR] Please refer to /home/perham/Study/LittleDarwin/Cases/commons-cli-1.3.1-src/target/surefire-reports for the individual test results.
[ERROR] -> [Help 1]
[ERROR] 
[ERROR] To see the full stack trace of the errors, re-run Maven with the -e switch.
[ERROR] Re-run Maven using the -X switch to enable full debug logging.
[ERROR] 
[ERROR] For more information about the errors and possible solutions, please read the following articles:
[ERROR] [Help 1] http://cwiki.apache.org/confluence/display/MAVEN/MojoFailureException
