[INFO] Scanning for projects...
[INFO]                                                                         
[INFO] ------------------------------------------------------------------------
[INFO] Building Codec 3.3.0
[INFO] ------------------------------------------------------------------------
[INFO] 
[INFO] --- jacoco-maven-plugin:0.7.1.201405082137:prepare-agent (default) @ codec ---
[INFO] argLine set to -javaagent:/home/perham/.m2/repository/org/jacoco/org.jacoco.agent/0.7.1.201405082137/org.jacoco.agent-0.7.1.201405082137-runtime.jar=destfile=/home/perham/Study/LittleDarwin/Cases/codec-3.3.0/target/jacoco.exec
[INFO] 
[INFO] --- maven-resources-plugin:2.3:resources (default-resources) @ codec ---
[INFO] Using 'UTF-8' encoding to copy filtered resources.
[INFO] Copying 1 resource
[INFO] 
[INFO] --- maven-compiler-plugin:3.1:compile (default-compile) @ codec ---
[INFO] Changes detected - recompiling the module!
[INFO] Compiling 47 source files to /home/perham/Study/LittleDarwin/Cases/codec-3.3.0/target/classes
[WARNING] /home/perham/Study/LittleDarwin/Cases/codec-3.3.0/src/main/java/com/addthis/codec/jackson/CodecTypeIdResolver.java:[93,31] typeFromId(java.lang.String) in com.fasterxml.jackson.databind.jsontype.impl.TypeIdResolverBase has been deprecated
[WARNING] /home/perham/Study/LittleDarwin/Cases/codec-3.3.0/src/main/java/com/addthis/codec/binary/BufferIn.java:[35,28] readBytes(java.io.InputStream,int) in com.addthis.basis.util.Bytes has been deprecated
[WARNING] /home/perham/Study/LittleDarwin/Cases/codec-3.3.0/src/main/java/com/addthis/codec/binary/CodecBin2.java:[87,14] writeInt(int,java.io.OutputStream) in com.addthis.basis.util.Bytes has been deprecated
[WARNING] /home/perham/Study/LittleDarwin/Cases/codec-3.3.0/src/main/java/com/addthis/codec/binary/CodecBin2.java:[95,24] readInt(java.io.InputStream) in com.addthis.basis.util.Bytes has been deprecated
[WARNING] /home/perham/Study/LittleDarwin/Cases/codec-3.3.0/src/main/java/com/addthis/codec/binary/CodecBin2.java:[181,22] writeInt(int,java.io.OutputStream) in com.addthis.basis.util.Bytes has been deprecated
[WARNING] /home/perham/Study/LittleDarwin/Cases/codec-3.3.0/src/main/java/com/addthis/codec/binary/CodecBin2.java:[186,22] writeLong(long,java.io.OutputStream) in com.addthis.basis.util.Bytes has been deprecated
[WARNING] /home/perham/Study/LittleDarwin/Cases/codec-3.3.0/src/main/java/com/addthis/codec/binary/CodecBin2.java:[210,35] readInt(java.io.InputStream) in com.addthis.basis.util.Bytes has been deprecated
[WARNING] /home/perham/Study/LittleDarwin/Cases/codec-3.3.0/src/main/java/com/addthis/codec/binary/CodecBin2.java:[216,35] readLong(java.io.InputStream) in com.addthis.basis.util.Bytes has been deprecated
[WARNING] /home/perham/Study/LittleDarwin/Cases/codec-3.3.0/src/main/java/com/addthis/codec/binary/CodecBin2.java:[356,18] writeInt(int,java.io.OutputStream) in com.addthis.basis.util.Bytes has been deprecated
[WARNING] /home/perham/Study/LittleDarwin/Cases/codec-3.3.0/src/main/java/com/addthis/codec/binary/CodecBin2.java:[358,18] writeLong(long,java.io.OutputStream) in com.addthis.basis.util.Bytes has been deprecated
[WARNING] /home/perham/Study/LittleDarwin/Cases/codec-3.3.0/src/main/java/com/addthis/codec/binary/CodecBin2.java:[360,18] writeShort(short,java.io.OutputStream) in com.addthis.basis.util.Bytes has been deprecated
[WARNING] /home/perham/Study/LittleDarwin/Cases/codec-3.3.0/src/main/java/com/addthis/codec/binary/CodecBin2.java:[364,18] writeInt(int,java.io.OutputStream) in com.addthis.basis.util.Bytes has been deprecated
[WARNING] /home/perham/Study/LittleDarwin/Cases/codec-3.3.0/src/main/java/com/addthis/codec/binary/CodecBin2.java:[366,18] writeLong(long,java.io.OutputStream) in com.addthis.basis.util.Bytes has been deprecated
[WARNING] /home/perham/Study/LittleDarwin/Cases/codec-3.3.0/src/main/java/com/addthis/codec/binary/CodecBin2.java:[368,18] writeLong(long,java.io.OutputStream) in com.addthis.basis.util.Bytes has been deprecated
[WARNING] /home/perham/Study/LittleDarwin/Cases/codec-3.3.0/src/main/java/com/addthis/codec/binary/CodecBin2.java:[370,18] writeInt(int,java.io.OutputStream) in com.addthis.basis.util.Bytes has been deprecated
[WARNING] /home/perham/Study/LittleDarwin/Cases/codec-3.3.0/src/main/java/com/addthis/codec/binary/CodecBin2.java:[388,27] readInt(java.io.InputStream) in com.addthis.basis.util.Bytes has been deprecated
[WARNING] /home/perham/Study/LittleDarwin/Cases/codec-3.3.0/src/main/java/com/addthis/codec/binary/CodecBin2.java:[390,27] readLong(java.io.InputStream) in com.addthis.basis.util.Bytes has been deprecated
[WARNING] /home/perham/Study/LittleDarwin/Cases/codec-3.3.0/src/main/java/com/addthis/codec/binary/CodecBin2.java:[392,27] readShort(java.io.InputStream) in com.addthis.basis.util.Bytes has been deprecated
[WARNING] /home/perham/Study/LittleDarwin/Cases/codec-3.3.0/src/main/java/com/addthis/codec/binary/CodecBin2.java:[396,51] readLong(java.io.InputStream) in com.addthis.basis.util.Bytes has been deprecated
[WARNING] /home/perham/Study/LittleDarwin/Cases/codec-3.3.0/src/main/java/com/addthis/codec/binary/CodecBin2.java:[398,48] readInt(java.io.InputStream) in com.addthis.basis.util.Bytes has been deprecated
[WARNING] /home/perham/Study/LittleDarwin/Cases/codec-3.3.0/src/main/java/com/addthis/codec/binary/CodecBin2.java:[400,42] readLong(java.io.InputStream) in com.addthis.basis.util.Bytes has been deprecated
[WARNING] /home/perham/Study/LittleDarwin/Cases/codec-3.3.0/src/main/java/com/addthis/codec/binary/CodecBin2.java:[402,45] readInt(java.io.InputStream) in com.addthis.basis.util.Bytes has been deprecated
[WARNING] /home/perham/Study/LittleDarwin/Cases/codec-3.3.0/src/main/java/com/addthis/codec/binary/CodecBin2.java:[419,25] readCharString(java.io.InputStream) in com.addthis.basis.util.Bytes has been deprecated
[WARNING] /home/perham/Study/LittleDarwin/Cases/codec-3.3.0/src/main/java/com/addthis/codec/binary/CodecBin2.java:[421,25] readString(java.io.InputStream) in com.addthis.basis.util.Bytes has been deprecated
[WARNING] /home/perham/Study/LittleDarwin/Cases/codec-3.3.0/src/main/java/com/addthis/codec/binary/CodecBin2.java:[427,18] writeCharString(java.lang.String,java.io.OutputStream) in com.addthis.basis.util.Bytes has been deprecated
[WARNING] /home/perham/Study/LittleDarwin/Cases/codec-3.3.0/src/main/java/com/addthis/codec/binary/CodecBin2.java:[429,18] writeString(java.lang.String,java.io.OutputStream) in com.addthis.basis.util.Bytes has been deprecated
[WARNING] /home/perham/Study/LittleDarwin/Cases/codec-3.3.0/src/main/java/com/addthis/codec/jackson/CodecJackson.java: Some input files use unchecked or unsafe operations.
[WARNING] /home/perham/Study/LittleDarwin/Cases/codec-3.3.0/src/main/java/com/addthis/codec/jackson/CodecJackson.java: Recompile with -Xlint:unchecked for details.
[INFO] 
[INFO] --- maven-resources-plugin:2.3:testResources (default-testResources) @ codec ---
[INFO] Using 'UTF-8' encoding to copy filtered resources.
[INFO] Copying 10 resources
[INFO] 
[INFO] --- maven-compiler-plugin:3.1:testCompile (default-testCompile) @ codec ---
[INFO] Nothing to compile - all classes are up to date
[INFO] 
[INFO] --- maven-surefire-plugin:2.17:test (default-test) @ codec ---
[INFO] Surefire report directory: /home/perham/Study/LittleDarwin/Cases/codec-3.3.0/target/surefire-reports

-------------------------------------------------------
 T E S T S
-------------------------------------------------------
Running com.addthis.codec.jackson.WriteonlyPropertyIgnorerTest
Aug 02, 2015 2:24:56 AM org.hibernate.validator.internal.util.Version <clinit>
INFO: HV000001: Hibernate Validator 5.1.1.Final
Tests run: 1, Failures: 0, Errors: 0, Skipped: 0, Time elapsed: 3.119 sec - in com.addthis.codec.jackson.WriteonlyPropertyIgnorerTest
Running com.addthis.codec.CodecRWOnlyTest
{"read1":123,"read2":234,"write1":456,"write2":567}
r1:111,r2:222,w1:333,w2:444
Tests run: 1, Failures: 0, Errors: 0, Skipped: 0, Time elapsed: 0.015 sec - in com.addthis.codec.CodecRWOnlyTest
Running com.addthis.codec.json.CodecJSONTest
Tests run: 4, Failures: 0, Errors: 0, Skipped: 0, Time elapsed: 0.083 sec - in com.addthis.codec.json.CodecJSONTest
Running com.addthis.codec.config.FeatureTest
[main] INFO com.addthis.codec.config.FeatureTest - unresolved {
    # config/defaultgreeter.conf: 1
    "greet" : {}
}

[main] INFO com.addthis.codec.config.FeatureTest - resolved {
    # plugins/greet-complex.conf: 38
    "_class" : "simple",
    # plugins/greet-complex.conf: 39
    "suffix" : "! What a pleasant default-alias suffix we are having!",
    # greet default type : plugins/greet-complex.conf: 37
    "type" : "simple"
}

Tests run: 22, Failures: 0, Errors: 0, Skipped: 0, Time elapsed: 0.282 sec - in com.addthis.codec.config.FeatureTest
Running com.addthis.codec.CodecTest
Tests run: 6, Failures: 0, Errors: 0, Skipped: 0, Time elapsed: 0.005 sec - in com.addthis.codec.CodecTest
Running com.addthis.codec.CodecJsonBasicTest
Tests run: 5, Failures: 0, Errors: 0, Skipped: 0, Time elapsed: 0.207 sec - in com.addthis.codec.CodecJsonBasicTest
Running com.addthis.codec.CodecGenericsTest
[main] WARN com.addthis.codec.binary.CodecBin2 - skip native encode for {[Ljava.lang.String;@5a587f23=com.addthis.codec.CodecGenericsTest$D@28c6c7bd} / class java.util.HashMap
Tests run: 1, Failures: 0, Errors: 1, Skipped: 0, Time elapsed: 0.025 sec <<< FAILURE! - in com.addthis.codec.CodecGenericsTest
testAll(com.addthis.codec.CodecGenericsTest)  Time elapsed: 0.025 sec  <<< ERROR!
java.io.EOFException: null
	at com.addthis.basis.util.Bytes.readLength(Bytes.java:576)
	at com.addthis.codec.binary.CodecBin2.decodeField(CodecBin2.java:301)
	at com.addthis.codec.binary.CodecBin2.decodeObject(CodecBin2.java:164)
	at com.addthis.codec.binary.CodecBin2.decodeBytes(CodecBin2.java:97)
	at com.addthis.codec.binary.CodecBin2.decode(CodecBin2.java:77)
	at com.addthis.codec.CodecGenericsTest.test(CodecGenericsTest.java:48)
	at com.addthis.codec.CodecGenericsTest.testAll(CodecGenericsTest.java:35)

Running com.addthis.codec.CodecUtilTest
[main] INFO com.addthis.codec.CodecUtilTest - compareTest(abc,ab) sc(1) bc(1)
[main] INFO com.addthis.codec.CodecUtilTest - compareTest(abc,abc) sc(0) bc(0)
[main] INFO com.addthis.codec.CodecUtilTest - compareTest(abc,abcd) sc(-1) bc(-1)
[main] INFO com.addthis.codec.CodecUtilTest - compareTest(abc,def) sc(-3) bc(-3)
[main] INFO com.addthis.codec.CodecUtilTest - compareTest(def,abc) sc(3) bc(3)
[main] INFO com.addthis.codec.CodecUtilTest - compareTest(abcd,acbd) sc(-1) bc(-1)
Tests run: 1, Failures: 0, Errors: 0, Skipped: 0, Time elapsed: 0 sec - in com.addthis.codec.CodecUtilTest
Running com.addthis.codec.CodecBin2BasicTest
[main] WARN com.addthis.codec.binary.CodecBin2 - skip native encode for [com.addthis.codec.letters.B@3f465143] / class java.util.LinkedList
[main] WARN com.addthis.codec.binary.CodecBin2 - skip native encode for [jjj] / class java.util.LinkedList
[main] WARN com.addthis.codec.binary.CodecBin2 - skip native encode for {mmm=com.addthis.codec.letters.B@21812629} / class java.util.HashMap
[main] WARN com.addthis.codec.binary.CodecBin2 - skip native encode for {lll=111} / class java.util.HashMap
[main] WARN com.addthis.codec.binary.CodecBin2 - skip native encode for com.addthis.codec.letters.A@25f05eee / class com.addthis.codec.letters.A
[main] WARN com.addthis.codec.binary.CodecBin2 - skip native encode for FOO / class com.addthis.codec.letters.TheEnum
[main] WARN com.addthis.codec.binary.CodecBin2 - skip native encode for [com.addthis.codec.letters.B@47e86eb7] / class java.util.LinkedList
[main] WARN com.addthis.codec.binary.CodecBin2 - skip native encode for [jjj] / class java.util.LinkedList
[main] WARN com.addthis.codec.binary.CodecBin2 - skip native encode for {mmm=com.addthis.codec.letters.B@6cbcd542} / class java.util.HashMap
[main] WARN com.addthis.codec.binary.CodecBin2 - skip native encode for {lll=111} / class java.util.HashMap
[main] WARN com.addthis.codec.binary.CodecBin2 - skip native encode for com.addthis.codec.letters.A@615517d3 / class com.addthis.codec.letters.A
[main] WARN com.addthis.codec.binary.CodecBin2 - skip native encode for FOO / class com.addthis.codec.letters.TheEnum
[main] WARN com.addthis.codec.binary.CodecBin2 - skip native encode for [com.addthis.codec.letters.B@198f4f91] / class java.util.LinkedList
[main] WARN com.addthis.codec.binary.CodecBin2 - skip native encode for [jjj] / class java.util.LinkedList
[main] WARN com.addthis.codec.binary.CodecBin2 - skip native encode for {mmm=com.addthis.codec.letters.B@fb0c5b3} / class java.util.HashMap
[main] WARN com.addthis.codec.binary.CodecBin2 - skip native encode for {lll=111} / class java.util.HashMap
[main] WARN com.addthis.codec.binary.CodecBin2 - skip native encode for com.addthis.codec.letters.A@1e8372d1 / class com.addthis.codec.letters.A
[main] WARN com.addthis.codec.binary.CodecBin2 - skip native encode for FOO / class com.addthis.codec.letters.TheEnum
[main] WARN com.addthis.codec.binary.CodecBin2 - skip native encode for [com.addthis.codec.letters.B@47e706fd] / class java.util.LinkedList
[main] WARN com.addthis.codec.binary.CodecBin2 - skip native encode for [jjj] / class java.util.LinkedList
[main] WARN com.addthis.codec.binary.CodecBin2 - skip native encode for {mmm=com.addthis.codec.letters.B@107bf0ec} / class java.util.HashMap
[main] WARN com.addthis.codec.binary.CodecBin2 - skip native encode for {lll=111} / class java.util.HashMap
[main] WARN com.addthis.codec.binary.CodecBin2 - skip native encode for com.addthis.codec.letters.A@39061e68 / class com.addthis.codec.letters.A
[main] WARN com.addthis.codec.binary.CodecBin2 - skip native encode for FOO / class com.addthis.codec.letters.TheEnum
Tests run: 4, Failures: 0, Errors: 4, Skipped: 0, Time elapsed: 0.014 sec <<< FAILURE! - in com.addthis.codec.CodecBin2BasicTest
encodeDecode(com.addthis.codec.CodecBin2BasicTest)  Time elapsed: 0.003 sec  <<< ERROR!
java.lang.ClassNotFoundException:  
	at java.lang.Class.forName0(Native Method)
	at java.lang.Class.forName(Class.java:191)
	at com.addthis.codec.plugins.PluginMap.findAndValidateClass(PluginMap.java:270)
	at com.addthis.codec.plugins.PluginMap.getClass(PluginMap.java:222)
	at com.addthis.codec.reflection.CodableClassInfo.getClass(CodableClassInfo.java:168)
	at com.addthis.codec.binary.CodecBin2.decodeObject(CodecBin2.java:154)
	at com.addthis.codec.binary.CodecBin2.decodeObject(CodecBin2.java:141)
	at com.addthis.codec.binary.CodecBin2.decodeField(CodecBin2.java:335)
	at com.addthis.codec.binary.CodecBin2.decodeObject(CodecBin2.java:164)
	at com.addthis.codec.binary.CodecBin2.decodeBytes(CodecBin2.java:97)
	at com.addthis.codec.binary.CodecBin2.decode(CodecBin2.java:77)
	at com.addthis.codec.CodecBasicTests.setup(CodecBasicTests.java:88)
	at sun.reflect.NativeMethodAccessorImpl.invoke0(Native Method)
	at sun.reflect.NativeMethodAccessorImpl.invoke(NativeMethodAccessorImpl.java:57)
	at sun.reflect.DelegatingMethodAccessorImpl.invoke(DelegatingMethodAccessorImpl.java:43)
	at java.lang.reflect.Method.invoke(Method.java:606)
	at org.junit.runners.model.FrameworkMethod$1.runReflectiveCall(FrameworkMethod.java:47)
	at org.junit.internal.runners.model.ReflectiveCallable.run(ReflectiveCallable.java:12)
	at org.junit.runners.model.FrameworkMethod.invokeExplosively(FrameworkMethod.java:44)
	at org.junit.internal.runners.statements.RunBefores.evaluate(RunBefores.java:24)
	at org.junit.runners.ParentRunner.runLeaf(ParentRunner.java:271)
	at org.junit.runners.BlockJUnit4ClassRunner.runChild(BlockJUnit4ClassRunner.java:70)
	at org.junit.runners.BlockJUnit4ClassRunner.runChild(BlockJUnit4ClassRunner.java:50)
	at org.junit.runners.ParentRunner$3.run(ParentRunner.java:238)
	at org.junit.runners.ParentRunner$1.schedule(ParentRunner.java:63)
	at org.junit.runners.ParentRunner.runChildren(ParentRunner.java:236)
	at org.junit.runners.ParentRunner.access$000(ParentRunner.java:53)
	at org.junit.runners.ParentRunner$2.evaluate(ParentRunner.java:229)
	at org.junit.runners.ParentRunner.run(ParentRunner.java:309)
	at org.apache.maven.surefire.junit4.JUnit4Provider.execute(JUnit4Provider.java:264)
	at org.apache.maven.surefire.junit4.JUnit4Provider.executeTestSet(JUnit4Provider.java:153)
	at org.apache.maven.surefire.junit4.JUnit4Provider.invoke(JUnit4Provider.java:124)
	at org.apache.maven.surefire.booter.ForkedBooter.invokeProviderInSameClassLoader(ForkedBooter.java:200)
	at org.apache.maven.surefire.booter.ForkedBooter.runSuitesInProcess(ForkedBooter.java:153)
	at org.apache.maven.surefire.booter.ForkedBooter.main(ForkedBooter.java:103)

codes(com.addthis.codec.CodecBin2BasicTest)  Time elapsed: 0.004 sec  <<< ERROR!
java.lang.ClassNotFoundException:  
	at java.lang.Class.forName0(Native Method)
	at java.lang.Class.forName(Class.java:191)
	at com.addthis.codec.plugins.PluginMap.findAndValidateClass(PluginMap.java:270)
	at com.addthis.codec.plugins.PluginMap.getClass(PluginMap.java:222)
	at com.addthis.codec.reflection.CodableClassInfo.getClass(CodableClassInfo.java:168)
	at com.addthis.codec.binary.CodecBin2.decodeObject(CodecBin2.java:154)
	at com.addthis.codec.binary.CodecBin2.decodeObject(CodecBin2.java:141)
	at com.addthis.codec.binary.CodecBin2.decodeField(CodecBin2.java:335)
	at com.addthis.codec.binary.CodecBin2.decodeObject(CodecBin2.java:164)
	at com.addthis.codec.binary.CodecBin2.decodeBytes(CodecBin2.java:97)
	at com.addthis.codec.binary.CodecBin2.decode(CodecBin2.java:77)
	at com.addthis.codec.CodecBasicTests.setup(CodecBasicTests.java:88)
	at sun.reflect.NativeMethodAccessorImpl.invoke0(Native Method)
	at sun.reflect.NativeMethodAccessorImpl.invoke(NativeMethodAccessorImpl.java:57)
	at sun.reflect.DelegatingMethodAccessorImpl.invoke(DelegatingMethodAccessorImpl.java:43)
	at java.lang.reflect.Method.invoke(Method.java:606)
	at org.junit.runners.model.FrameworkMethod$1.runReflectiveCall(FrameworkMethod.java:47)
	at org.junit.internal.runners.model.ReflectiveCallable.run(ReflectiveCallable.java:12)
	at org.junit.runners.model.FrameworkMethod.invokeExplosively(FrameworkMethod.java:44)
	at org.junit.internal.runners.statements.RunBefores.evaluate(RunBefores.java:24)
	at org.junit.runners.ParentRunner.runLeaf(ParentRunner.java:271)
	at org.junit.runners.BlockJUnit4ClassRunner.runChild(BlockJUnit4ClassRunner.java:70)
	at org.junit.runners.BlockJUnit4ClassRunner.runChild(BlockJUnit4ClassRunner.java:50)
	at org.junit.runners.ParentRunner$3.run(ParentRunner.java:238)
	at org.junit.runners.ParentRunner$1.schedule(ParentRunner.java:63)
	at org.junit.runners.ParentRunner.runChildren(ParentRunner.java:236)
	at org.junit.runners.ParentRunner.access$000(ParentRunner.java:53)
	at org.junit.runners.ParentRunner$2.evaluate(ParentRunner.java:229)
	at org.junit.runners.ParentRunner.run(ParentRunner.java:309)
	at org.apache.maven.surefire.junit4.JUnit4Provider.execute(JUnit4Provider.java:264)
	at org.apache.maven.surefire.junit4.JUnit4Provider.executeTestSet(JUnit4Provider.java:153)
	at org.apache.maven.surefire.junit4.JUnit4Provider.invoke(JUnit4Provider.java:124)
	at org.apache.maven.surefire.booter.ForkedBooter.invokeProviderInSameClassLoader(ForkedBooter.java:200)
	at org.apache.maven.surefire.booter.ForkedBooter.runSuitesInProcess(ForkedBooter.java:153)
	at org.apache.maven.surefire.booter.ForkedBooter.main(ForkedBooter.java:103)

subclasses(com.addthis.codec.CodecBin2BasicTest)  Time elapsed: 0.003 sec  <<< ERROR!
java.lang.ClassNotFoundException:  
	at java.lang.Class.forName0(Native Method)
	at java.lang.Class.forName(Class.java:191)
	at com.addthis.codec.plugins.PluginMap.findAndValidateClass(PluginMap.java:270)
	at com.addthis.codec.plugins.PluginMap.getClass(PluginMap.java:222)
	at com.addthis.codec.reflection.CodableClassInfo.getClass(CodableClassInfo.java:168)
	at com.addthis.codec.binary.CodecBin2.decodeObject(CodecBin2.java:154)
	at com.addthis.codec.binary.CodecBin2.decodeObject(CodecBin2.java:141)
	at com.addthis.codec.binary.CodecBin2.decodeField(CodecBin2.java:335)
	at com.addthis.codec.binary.CodecBin2.decodeObject(CodecBin2.java:164)
	at com.addthis.codec.binary.CodecBin2.decodeBytes(CodecBin2.java:97)
	at com.addthis.codec.binary.CodecBin2.decode(CodecBin2.java:77)
	at com.addthis.codec.CodecBasicTests.setup(CodecBasicTests.java:88)
	at sun.reflect.NativeMethodAccessorImpl.invoke0(Native Method)
	at sun.reflect.NativeMethodAccessorImpl.invoke(NativeMethodAccessorImpl.java:57)
	at sun.reflect.DelegatingMethodAccessorImpl.invoke(DelegatingMethodAccessorImpl.java:43)
	at java.lang.reflect.Method.invoke(Method.java:606)
	at org.junit.runners.model.FrameworkMethod$1.runReflectiveCall(FrameworkMethod.java:47)
	at org.junit.internal.runners.model.ReflectiveCallable.run(ReflectiveCallable.java:12)
	at org.junit.runners.model.FrameworkMethod.invokeExplosively(FrameworkMethod.java:44)
	at org.junit.internal.runners.statements.RunBefores.evaluate(RunBefores.java:24)
	at org.junit.runners.ParentRunner.runLeaf(ParentRunner.java:271)
	at org.junit.runners.BlockJUnit4ClassRunner.runChild(BlockJUnit4ClassRunner.java:70)
	at org.junit.runners.BlockJUnit4ClassRunner.runChild(BlockJUnit4ClassRunner.java:50)
	at org.junit.runners.ParentRunner$3.run(ParentRunner.java:238)
	at org.junit.runners.ParentRunner$1.schedule(ParentRunner.java:63)
	at org.junit.runners.ParentRunner.runChildren(ParentRunner.java:236)
	at org.junit.runners.ParentRunner.access$000(ParentRunner.java:53)
	at org.junit.runners.ParentRunner$2.evaluate(ParentRunner.java:229)
	at org.junit.runners.ParentRunner.run(ParentRunner.java:309)
	at org.apache.maven.surefire.junit4.JUnit4Provider.execute(JUnit4Provider.java:264)
	at org.apache.maven.surefire.junit4.JUnit4Provider.executeTestSet(JUnit4Provider.java:153)
	at org.apache.maven.surefire.junit4.JUnit4Provider.invoke(JUnit4Provider.java:124)
	at org.apache.maven.surefire.booter.ForkedBooter.invokeProviderInSameClassLoader(ForkedBooter.java:200)
	at org.apache.maven.surefire.booter.ForkedBooter.runSuitesInProcess(ForkedBooter.java:153)
	at org.apache.maven.surefire.booter.ForkedBooter.main(ForkedBooter.java:103)

requiredFields(com.addthis.codec.CodecBin2BasicTest)  Time elapsed: 0.004 sec  <<< ERROR!
java.lang.ClassNotFoundException:  
	at java.lang.Class.forName0(Native Method)
	at java.lang.Class.forName(Class.java:191)
	at com.addthis.codec.plugins.PluginMap.findAndValidateClass(PluginMap.java:270)
	at com.addthis.codec.plugins.PluginMap.getClass(PluginMap.java:222)
	at com.addthis.codec.reflection.CodableClassInfo.getClass(CodableClassInfo.java:168)
	at com.addthis.codec.binary.CodecBin2.decodeObject(CodecBin2.java:154)
	at com.addthis.codec.binary.CodecBin2.decodeObject(CodecBin2.java:141)
	at com.addthis.codec.binary.CodecBin2.decodeField(CodecBin2.java:335)
	at com.addthis.codec.binary.CodecBin2.decodeObject(CodecBin2.java:164)
	at com.addthis.codec.binary.CodecBin2.decodeBytes(CodecBin2.java:97)
	at com.addthis.codec.binary.CodecBin2.decode(CodecBin2.java:77)
	at com.addthis.codec.CodecBasicTests.setup(CodecBasicTests.java:88)
	at sun.reflect.NativeMethodAccessorImpl.invoke0(Native Method)
	at sun.reflect.NativeMethodAccessorImpl.invoke(NativeMethodAccessorImpl.java:57)
	at sun.reflect.DelegatingMethodAccessorImpl.invoke(DelegatingMethodAccessorImpl.java:43)
	at java.lang.reflect.Method.invoke(Method.java:606)
	at org.junit.runners.model.FrameworkMethod$1.runReflectiveCall(FrameworkMethod.java:47)
	at org.junit.internal.runners.model.ReflectiveCallable.run(ReflectiveCallable.java:12)
	at org.junit.runners.model.FrameworkMethod.invokeExplosively(FrameworkMethod.java:44)
	at org.junit.internal.runners.statements.RunBefores.evaluate(RunBefores.java:24)
	at org.junit.runners.ParentRunner.runLeaf(ParentRunner.java:271)
	at org.junit.runners.BlockJUnit4ClassRunner.runChild(BlockJUnit4ClassRunner.java:70)
	at org.junit.runners.BlockJUnit4ClassRunner.runChild(BlockJUnit4ClassRunner.java:50)
	at org.junit.runners.ParentRunner$3.run(ParentRunner.java:238)
	at org.junit.runners.ParentRunner$1.schedule(ParentRunner.java:63)
	at org.junit.runners.ParentRunner.runChildren(ParentRunner.java:236)
	at org.junit.runners.ParentRunner.access$000(ParentRunner.java:53)
	at org.junit.runners.ParentRunner$2.evaluate(ParentRunner.java:229)
	at org.junit.runners.ParentRunner.run(ParentRunner.java:309)
	at org.apache.maven.surefire.junit4.JUnit4Provider.execute(JUnit4Provider.java:264)
	at org.apache.maven.surefire.junit4.JUnit4Provider.executeTestSet(JUnit4Provider.java:153)
	at org.apache.maven.surefire.junit4.JUnit4Provider.invoke(JUnit4Provider.java:124)
	at org.apache.maven.surefire.booter.ForkedBooter.invokeProviderInSameClassLoader(ForkedBooter.java:200)
	at org.apache.maven.surefire.booter.ForkedBooter.runSuitesInProcess(ForkedBooter.java:153)
	at org.apache.maven.surefire.booter.ForkedBooter.main(ForkedBooter.java:103)

Running com.addthis.codec.utils.ExecutorServiceBuilderTest
Tests run: 1, Failures: 0, Errors: 0, Skipped: 0, Time elapsed: 0.084 sec - in com.addthis.codec.utils.ExecutorServiceBuilderTest
Running com.addthis.codec.CodecObjectSubclassTest
[main] WARN com.addthis.codec.binary.CodecBin2 - skip native encode for com.addthis.codec.CodecObjectSubclassTest$A@4d338bcf / class com.addthis.codec.CodecObjectSubclassTest$A
[main] WARN com.addthis.codec.binary.CodecBin2 - skip native encode for com.addthis.codec.CodecObjectSubclassTest$B@731feaa1 / class com.addthis.codec.CodecObjectSubclassTest$B
[main] WARN com.addthis.codec.binary.CodecBin2 - skip native encode for com.addthis.codec.CodecObjectSubclassTest$C@34652b13 / class com.addthis.codec.CodecObjectSubclassTest$C
[main] WARN com.addthis.codec.binary.CodecBin2 - skip native encode for com.addthis.codec.CodecObjectSubclassTest$D@5def0744 / class com.addthis.codec.CodecObjectSubclassTest$D
Tests run: 1, Failures: 0, Errors: 1, Skipped: 0, Time elapsed: 0.006 sec <<< FAILURE! - in com.addthis.codec.CodecObjectSubclassTest
testAll(com.addthis.codec.CodecObjectSubclassTest)  Time elapsed: 0.006 sec  <<< ERROR!
java.lang.ClassNotFoundException: 
	at java.net.URLClassLoader$1.run(URLClassLoader.java:366)
	at java.net.URLClassLoader$1.run(URLClassLoader.java:355)
	at java.security.AccessController.doPrivileged(Native Method)
	at java.net.URLClassLoader.findClass(URLClassLoader.java:354)
	at java.lang.ClassLoader.loadClass(ClassLoader.java:425)
	at sun.misc.Launcher$AppClassLoader.loadClass(Launcher.java:308)
	at java.lang.ClassLoader.loadClass(ClassLoader.java:358)
	at java.lang.Class.forName0(Native Method)
	at java.lang.Class.forName(Class.java:191)
	at com.addthis.codec.plugins.PluginMap.findAndValidateClass(PluginMap.java:270)
	at com.addthis.codec.plugins.PluginMap.getClass(PluginMap.java:222)
	at com.addthis.codec.reflection.CodableClassInfo.getClass(CodableClassInfo.java:168)
	at com.addthis.codec.binary.CodecBin2.decodeObject(CodecBin2.java:154)
	at com.addthis.codec.binary.CodecBin2.decodeObject(CodecBin2.java:141)
	at com.addthis.codec.binary.CodecBin2.decodeField(CodecBin2.java:339)
	at com.addthis.codec.binary.CodecBin2.decodeObject(CodecBin2.java:164)
	at com.addthis.codec.binary.CodecBin2.decodeBytes(CodecBin2.java:97)
	at com.addthis.codec.binary.CodecBin2.decode(CodecBin2.java:77)
	at com.addthis.codec.binary.CodecBin2.decode(CodecBin2.java:72)
	at com.addthis.codec.CodecObjectSubclassTest.testAll(CodecObjectSubclassTest.java:49)

Running com.addthis.codec.plugins.PluginRegistryTest
Tests run: 7, Failures: 0, Errors: 0, Skipped: 0, Time elapsed: 0.033 sec - in com.addthis.codec.plugins.PluginRegistryTest

Results :

Tests in error: 
  CodecGenericsTest.testAll:35->test:48 » EOF
  CodecBin2BasicTest>CodecBasicTests.setup:88 » ClassNotFound  
  CodecBin2BasicTest>CodecBasicTests.setup:88 » ClassNotFound  
  CodecBin2BasicTest>CodecBasicTests.setup:88 » ClassNotFound  
  CodecBin2BasicTest>CodecBasicTests.setup:88 » ClassNotFound  
  CodecObjectSubclassTest.testAll:49 » ClassNotFound 

Tests run: 54, Failures: 0, Errors: 6, Skipped: 0

[INFO] ------------------------------------------------------------------------
[INFO] BUILD FAILURE
[INFO] ------------------------------------------------------------------------
[INFO] Total time: 8.851s
[INFO] Finished at: Sun Aug 02 02:24:57 BST 2015
[INFO] Final Memory: 17M/219M
[INFO] ------------------------------------------------------------------------
[ERROR] Failed to execute goal org.apache.maven.plugins:maven-surefire-plugin:2.17:test (default-test) on project codec: There are test failures.
[ERROR] 
[ERROR] Please refer to /home/perham/Study/LittleDarwin/Cases/codec-3.3.0/target/surefire-reports for the individual test results.
[ERROR] -> [Help 1]
[ERROR] 
[ERROR] To see the full stack trace of the errors, re-run Maven with the -e switch.
[ERROR] Re-run Maven using the -X switch to enable full debug logging.
[ERROR] 
[ERROR] For more information about the errors and possible solutions, please read the following articles:
[ERROR] [Help 1] http://cwiki.apache.org/confluence/display/MAVEN/MojoFailureException
