[INFO] Scanning for projects...
[INFO]                                                                         
[INFO] ------------------------------------------------------------------------
[INFO] Building Codec 3.3.0
[INFO] ------------------------------------------------------------------------
[INFO] 
[INFO] --- jacoco-maven-plugin:0.7.1.201405082137:prepare-agent (default) @ codec ---
[INFO] argLine set to -javaagent:/home/perham/.m2/repository/org/jacoco/org.jacoco.agent/0.7.1.201405082137/org.jacoco.agent-0.7.1.201405082137-runtime.jar=destfile=/home/perham/Study/LittleDarwin/Cases/codec-3.3.0/target/jacoco.exec
[INFO] 
[INFO] --- maven-resources-plugin:2.3:resources (default-resources) @ codec ---
[INFO] Using 'UTF-8' encoding to copy filtered resources.
[INFO] Copying 1 resource
[INFO] 
[INFO] --- maven-compiler-plugin:3.1:compile (default-compile) @ codec ---
[INFO] Changes detected - recompiling the module!
[INFO] Compiling 47 source files to /home/perham/Study/LittleDarwin/Cases/codec-3.3.0/target/classes
[WARNING] /home/perham/Study/LittleDarwin/Cases/codec-3.3.0/src/main/java/com/addthis/codec/jackson/CodecTypeIdResolver.java:[93,31] typeFromId(java.lang.String) in com.fasterxml.jackson.databind.jsontype.impl.TypeIdResolverBase has been deprecated
[WARNING] /home/perham/Study/LittleDarwin/Cases/codec-3.3.0/src/main/java/com/addthis/codec/binary/BufferIn.java:[35,28] readBytes(java.io.InputStream,int) in com.addthis.basis.util.Bytes has been deprecated
[WARNING] /home/perham/Study/LittleDarwin/Cases/codec-3.3.0/src/main/java/com/addthis/codec/binary/CodecBin2.java:[87,14] writeInt(int,java.io.OutputStream) in com.addthis.basis.util.Bytes has been deprecated
[WARNING] /home/perham/Study/LittleDarwin/Cases/codec-3.3.0/src/main/java/com/addthis/codec/binary/CodecBin2.java:[95,24] readInt(java.io.InputStream) in com.addthis.basis.util.Bytes has been deprecated
[WARNING] /home/perham/Study/LittleDarwin/Cases/codec-3.3.0/src/main/java/com/addthis/codec/binary/CodecBin2.java:[181,22] writeInt(int,java.io.OutputStream) in com.addthis.basis.util.Bytes has been deprecated
[WARNING] /home/perham/Study/LittleDarwin/Cases/codec-3.3.0/src/main/java/com/addthis/codec/binary/CodecBin2.java:[186,22] writeLong(long,java.io.OutputStream) in com.addthis.basis.util.Bytes has been deprecated
[WARNING] /home/perham/Study/LittleDarwin/Cases/codec-3.3.0/src/main/java/com/addthis/codec/binary/CodecBin2.java:[210,35] readInt(java.io.InputStream) in com.addthis.basis.util.Bytes has been deprecated
[WARNING] /home/perham/Study/LittleDarwin/Cases/codec-3.3.0/src/main/java/com/addthis/codec/binary/CodecBin2.java:[216,35] readLong(java.io.InputStream) in com.addthis.basis.util.Bytes has been deprecated
[WARNING] /home/perham/Study/LittleDarwin/Cases/codec-3.3.0/src/main/java/com/addthis/codec/binary/CodecBin2.java:[356,18] writeInt(int,java.io.OutputStream) in com.addthis.basis.util.Bytes has been deprecated
[WARNING] /home/perham/Study/LittleDarwin/Cases/codec-3.3.0/src/main/java/com/addthis/codec/binary/CodecBin2.java:[358,18] writeLong(long,java.io.OutputStream) in com.addthis.basis.util.Bytes has been deprecated
[WARNING] /home/perham/Study/LittleDarwin/Cases/codec-3.3.0/src/main/java/com/addthis/codec/binary/CodecBin2.java:[360,18] writeShort(short,java.io.OutputStream) in com.addthis.basis.util.Bytes has been deprecated
[WARNING] /home/perham/Study/LittleDarwin/Cases/codec-3.3.0/src/main/java/com/addthis/codec/binary/CodecBin2.java:[364,18] writeInt(int,java.io.OutputStream) in com.addthis.basis.util.Bytes has been deprecated
[WARNING] /home/perham/Study/LittleDarwin/Cases/codec-3.3.0/src/main/java/com/addthis/codec/binary/CodecBin2.java:[366,18] writeLong(long,java.io.OutputStream) in com.addthis.basis.util.Bytes has been deprecated
[WARNING] /home/perham/Study/LittleDarwin/Cases/codec-3.3.0/src/main/java/com/addthis/codec/binary/CodecBin2.java:[368,18] writeLong(long,java.io.OutputStream) in com.addthis.basis.util.Bytes has been deprecated
[WARNING] /home/perham/Study/LittleDarwin/Cases/codec-3.3.0/src/main/java/com/addthis/codec/binary/CodecBin2.java:[370,18] writeInt(int,java.io.OutputStream) in com.addthis.basis.util.Bytes has been deprecated
[WARNING] /home/perham/Study/LittleDarwin/Cases/codec-3.3.0/src/main/java/com/addthis/codec/binary/CodecBin2.java:[388,27] readInt(java.io.InputStream) in com.addthis.basis.util.Bytes has been deprecated
[WARNING] /home/perham/Study/LittleDarwin/Cases/codec-3.3.0/src/main/java/com/addthis/codec/binary/CodecBin2.java:[390,27] readLong(java.io.InputStream) in com.addthis.basis.util.Bytes has been deprecated
[WARNING] /home/perham/Study/LittleDarwin/Cases/codec-3.3.0/src/main/java/com/addthis/codec/binary/CodecBin2.java:[392,27] readShort(java.io.InputStream) in com.addthis.basis.util.Bytes has been deprecated
[WARNING] /home/perham/Study/LittleDarwin/Cases/codec-3.3.0/src/main/java/com/addthis/codec/binary/CodecBin2.java:[396,51] readLong(java.io.InputStream) in com.addthis.basis.util.Bytes has been deprecated
[WARNING] /home/perham/Study/LittleDarwin/Cases/codec-3.3.0/src/main/java/com/addthis/codec/binary/CodecBin2.java:[398,48] readInt(java.io.InputStream) in com.addthis.basis.util.Bytes has been deprecated
[WARNING] /home/perham/Study/LittleDarwin/Cases/codec-3.3.0/src/main/java/com/addthis/codec/binary/CodecBin2.java:[400,42] readLong(java.io.InputStream) in com.addthis.basis.util.Bytes has been deprecated
[WARNING] /home/perham/Study/LittleDarwin/Cases/codec-3.3.0/src/main/java/com/addthis/codec/binary/CodecBin2.java:[402,45] readInt(java.io.InputStream) in com.addthis.basis.util.Bytes has been deprecated
[WARNING] /home/perham/Study/LittleDarwin/Cases/codec-3.3.0/src/main/java/com/addthis/codec/binary/CodecBin2.java:[419,25] readCharString(java.io.InputStream) in com.addthis.basis.util.Bytes has been deprecated
[WARNING] /home/perham/Study/LittleDarwin/Cases/codec-3.3.0/src/main/java/com/addthis/codec/binary/CodecBin2.java:[421,25] readString(java.io.InputStream) in com.addthis.basis.util.Bytes has been deprecated
[WARNING] /home/perham/Study/LittleDarwin/Cases/codec-3.3.0/src/main/java/com/addthis/codec/binary/CodecBin2.java:[427,18] writeCharString(java.lang.String,java.io.OutputStream) in com.addthis.basis.util.Bytes has been deprecated
[WARNING] /home/perham/Study/LittleDarwin/Cases/codec-3.3.0/src/main/java/com/addthis/codec/binary/CodecBin2.java:[429,18] writeString(java.lang.String,java.io.OutputStream) in com.addthis.basis.util.Bytes has been deprecated
[WARNING] /home/perham/Study/LittleDarwin/Cases/codec-3.3.0/src/main/java/com/addthis/codec/jackson/CodecJackson.java: Some input files use unchecked or unsafe operations.
[WARNING] /home/perham/Study/LittleDarwin/Cases/codec-3.3.0/src/main/java/com/addthis/codec/jackson/CodecJackson.java: Recompile with -Xlint:unchecked for details.
[INFO] 
[INFO] --- maven-resources-plugin:2.3:testResources (default-testResources) @ codec ---
[INFO] Using 'UTF-8' encoding to copy filtered resources.
[INFO] Copying 10 resources
[INFO] 
[INFO] --- maven-compiler-plugin:3.1:testCompile (default-testCompile) @ codec ---
[INFO] Nothing to compile - all classes are up to date
[INFO] 
[INFO] --- maven-surefire-plugin:2.17:test (default-test) @ codec ---
[INFO] Surefire report directory: /home/perham/Study/LittleDarwin/Cases/codec-3.3.0/target/surefire-reports

-------------------------------------------------------
 T E S T S
-------------------------------------------------------
Running com.addthis.codec.jackson.WriteonlyPropertyIgnorerTest
Tests run: 1, Failures: 0, Errors: 1, Skipped: 0, Time elapsed: 2.055 sec <<< FAILURE! - in com.addthis.codec.jackson.WriteonlyPropertyIgnorerTest
ignoreWriteonly(com.addthis.codec.jackson.WriteonlyPropertyIgnorerTest)  Time elapsed: 1.834 sec  <<< ERROR!
java.lang.ExceptionInInitializerError: null
	at com.addthis.codec.plugins.PluginMap.<init>(PluginMap.java:60)
	at com.addthis.codec.plugins.PluginRegistry.<init>(PluginRegistry.java:62)
	at com.addthis.codec.plugins.DefaultRegistry.<clinit>(DefaultRegistry.java:28)
	at com.addthis.codec.plugins.PluginRegistry.defaultRegistry(PluginRegistry.java:43)
	at com.addthis.codec.jackson.DefaultCodecJackson.<clinit>(DefaultCodecJackson.java:36)
	at com.addthis.codec.jackson.Jackson.defaultMapper(Jackson.java:66)
	at com.addthis.codec.jackson.WriteonlyPropertyIgnorerTest.ignoreWriteonly(WriteonlyPropertyIgnorerTest.java:37)

Running com.addthis.codec.CodecRWOnlyTest
Tests run: 1, Failures: 0, Errors: 1, Skipped: 0, Time elapsed: 0.011 sec <<< FAILURE! - in com.addthis.codec.CodecRWOnlyTest
readWrite(com.addthis.codec.CodecRWOnlyTest)  Time elapsed: 0 sec  <<< ERROR!
java.lang.NoClassDefFoundError: Could not initialize class com.addthis.codec.jackson.DefaultCodecJackson
	at com.addthis.codec.jackson.Jackson.defaultCodec(Jackson.java:70)
	at com.addthis.codec.json.CodecJSON.encodeString(CodecJSON.java:72)
	at com.addthis.codec.CodecRWOnlyTest.readWrite(CodecRWOnlyTest.java:46)

Running com.addthis.codec.json.CodecJSONTest
Tests run: 4, Failures: 0, Errors: 4, Skipped: 0, Time elapsed: 0.001 sec <<< FAILURE! - in com.addthis.codec.json.CodecJSONTest
testPrimitiveArrayTypeMismatch(com.addthis.codec.json.CodecJSONTest)  Time elapsed: 0 sec  <<< ERROR!
java.lang.NoClassDefFoundError: Could not initialize class com.addthis.codec.jackson.DefaultCodecJackson
	at com.addthis.codec.jackson.Jackson.defaultCodec(Jackson.java:70)
	at com.addthis.codec.json.CodecJSON.decodeString(CodecJSON.java:90)
	at com.addthis.codec.json.CodecJSONTest.testPrimitiveArrayTypeMismatch(CodecJSONTest.java:59)

arraySugar(com.addthis.codec.json.CodecJSONTest)  Time elapsed: 0 sec  <<< ERROR!
java.lang.NoClassDefFoundError: Could not initialize class com.addthis.codec.jackson.DefaultCodecJackson
	at com.addthis.codec.jackson.Jackson.defaultCodec(Jackson.java:70)
	at com.addthis.codec.json.CodecJSON.decodeString(CodecJSON.java:86)
	at com.addthis.codec.json.CodecJSONTest.arraySugar(CodecJSONTest.java:87)

typeSugar(com.addthis.codec.json.CodecJSONTest)  Time elapsed: 0 sec  <<< ERROR!
java.lang.NoClassDefFoundError: Could not initialize class com.addthis.codec.jackson.DefaultCodecJackson
	at com.addthis.codec.jackson.Jackson.defaultCodec(Jackson.java:70)
	at com.addthis.codec.json.CodecJSON.decodeString(CodecJSON.java:90)
	at com.addthis.codec.json.CodecJSONTest.typeSugar(CodecJSONTest.java:79)

testObjectArrayTypeMismatch(com.addthis.codec.json.CodecJSONTest)  Time elapsed: 0 sec  <<< ERROR!
java.lang.NoClassDefFoundError: Could not initialize class com.addthis.codec.jackson.DefaultCodecJackson
	at com.addthis.codec.jackson.Jackson.defaultCodec(Jackson.java:70)
	at com.addthis.codec.json.CodecJSON.decodeString(CodecJSON.java:90)
	at com.addthis.codec.json.CodecJSONTest.testObjectArrayTypeMismatch(CodecJSONTest.java:70)

Running com.addthis.codec.config.FeatureTest
Tests run: 22, Failures: 0, Errors: 22, Skipped: 0, Time elapsed: 0.019 sec <<< FAILURE! - in com.addthis.codec.config.FeatureTest
inheritance(com.addthis.codec.config.FeatureTest)  Time elapsed: 0 sec  <<< ERROR!
java.lang.NoClassDefFoundError: Could not initialize class com.addthis.codec.jackson.DefaultCodecJackson
	at com.addthis.codec.jackson.Jackson.defaultCodec(Jackson.java:70)
	at com.addthis.codec.config.Configs.decodeObject(Configs.java:71)
	at com.addthis.codec.config.FeatureTest.inheritance(FeatureTest.java:196)

abstractDelegateEmpty(com.addthis.codec.config.FeatureTest)  Time elapsed: 0 sec  <<< ERROR!
java.lang.NoClassDefFoundError: Could not initialize class com.addthis.codec.jackson.DefaultCodecJackson
	at com.addthis.codec.jackson.Jackson.defaultCodec(Jackson.java:70)
	at com.addthis.codec.config.Configs.decodeObject(Configs.java:90)
	at com.addthis.codec.config.FeatureTest.abstractDelegateEmpty(FeatureTest.java:229)

concreteValue(com.addthis.codec.config.FeatureTest)  Time elapsed: 0 sec  <<< ERROR!
java.lang.NoClassDefFoundError: Could not initialize class com.addthis.codec.jackson.DefaultCodecJackson
	at com.addthis.codec.jackson.Jackson.defaultCodec(Jackson.java:70)
	at com.addthis.codec.config.FeatureTest.concreteValue(FeatureTest.java:204)

autoCollection(com.addthis.codec.config.FeatureTest)  Time elapsed: 0 sec  <<< ERROR!
java.lang.NoClassDefFoundError: Could not initialize class com.addthis.codec.jackson.DefaultCodecJackson
	at com.addthis.codec.jackson.Jackson.defaultCodec(Jackson.java:70)
	at com.addthis.codec.config.Configs.decodeObject(Configs.java:118)
	at com.addthis.codec.config.FeatureTest.autoCollection(FeatureTest.java:80)

inline(com.addthis.codec.config.FeatureTest)  Time elapsed: 0 sec  <<< ERROR!
java.lang.NoClassDefFoundError: Could not initialize class com.addthis.codec.jackson.DefaultCodecJackson
	at com.addthis.codec.jackson.Jackson.defaultCodec(Jackson.java:70)
	at com.addthis.codec.config.Configs.decodeObject(Configs.java:118)
	at com.addthis.codec.config.FeatureTest.inline(FeatureTest.java:129)

primaryArray(com.addthis.codec.config.FeatureTest)  Time elapsed: 0.001 sec  <<< ERROR!
java.lang.NoClassDefFoundError: Could not initialize class com.addthis.codec.jackson.DefaultCodecJackson
	at com.addthis.codec.jackson.Jackson.defaultCodec(Jackson.java:70)
	at com.addthis.codec.config.Configs.decodeObject(Configs.java:118)
	at com.addthis.codec.config.FeatureTest.primaryArray(FeatureTest.java:104)

bytesConstructor(com.addthis.codec.config.FeatureTest)  Time elapsed: 0 sec  <<< ERROR!
java.lang.NoClassDefFoundError: Could not initialize class com.addthis.codec.jackson.DefaultCodecJackson
	at com.addthis.codec.jackson.Jackson.defaultCodec(Jackson.java:70)
	at com.addthis.codec.config.Configs.decodeObject(Configs.java:71)
	at com.addthis.codec.config.FeatureTest.bytesConstructor(FeatureTest.java:172)

aliasInheritance(com.addthis.codec.config.FeatureTest)  Time elapsed: 0 sec  <<< ERROR!
java.lang.NoClassDefFoundError: Could not initialize class com.addthis.codec.jackson.DefaultCodecJackson
	at com.addthis.codec.jackson.Jackson.defaultCodec(Jackson.java:70)
	at com.addthis.codec.config.Configs.decodeObject(Configs.java:118)
	at com.addthis.codec.config.FeatureTest.aliasInheritance(FeatureTest.java:137)

primaryNested(com.addthis.codec.config.FeatureTest)  Time elapsed: 0 sec  <<< ERROR!
java.lang.NoClassDefFoundError: Could not initialize class com.addthis.codec.jackson.DefaultCodecJackson
	at com.addthis.codec.jackson.Jackson.defaultCodec(Jackson.java:70)
	at com.addthis.codec.config.Configs.decodeObject(Configs.java:118)
	at com.addthis.codec.config.FeatureTest.primaryNested(FeatureTest.java:120)

primary(com.addthis.codec.config.FeatureTest)  Time elapsed: 0 sec  <<< ERROR!
java.lang.NoClassDefFoundError: Could not initialize class com.addthis.codec.jackson.DefaultCodecJackson
	at com.addthis.codec.jackson.Jackson.defaultCodec(Jackson.java:70)
	at com.addthis.codec.config.Configs.decodeObject(Configs.java:118)
	at com.addthis.codec.config.FeatureTest.primary(FeatureTest.java:96)

greetArray(com.addthis.codec.config.FeatureTest)  Time elapsed: 0.002 sec  <<< ERROR!
java.lang.NoClassDefFoundError: Could not initialize class com.addthis.codec.jackson.DefaultCodecJackson
	at com.addthis.codec.jackson.Jackson.defaultCodec(Jackson.java:70)
	at com.addthis.codec.config.Configs.decodeObject(Configs.java:118)
	at com.addthis.codec.config.FeatureTest.greetArray(FeatureTest.java:63)

bytesSetter(com.addthis.codec.config.FeatureTest)  Time elapsed: 0.001 sec  <<< ERROR!
java.lang.NoClassDefFoundError: Could not initialize class com.addthis.codec.jackson.DefaultCodecJackson
	at com.addthis.codec.jackson.Jackson.defaultCodec(Jackson.java:70)
	at com.addthis.codec.config.Configs.decodeObject(Configs.java:71)
	at com.addthis.codec.config.FeatureTest.bytesSetter(FeatureTest.java:165)

alias(com.addthis.codec.config.FeatureTest)  Time elapsed: 0.001 sec  <<< ERROR!
java.lang.NoClassDefFoundError: Could not initialize class com.addthis.codec.jackson.DefaultCodecJackson
	at com.addthis.codec.jackson.Jackson.defaultCodec(Jackson.java:70)
	at com.addthis.codec.config.Configs.decodeObject(Configs.java:118)
	at com.addthis.codec.config.FeatureTest.alias(FeatureTest.java:88)

enums(com.addthis.codec.config.FeatureTest)  Time elapsed: 0.001 sec  <<< ERROR!
java.lang.NoClassDefFoundError: Could not initialize class com.addthis.codec.jackson.DefaultCodecJackson
	at com.addthis.codec.jackson.Jackson.defaultCodec(Jackson.java:70)
	at com.addthis.codec.config.Configs.decodeObject(Configs.java:118)
	at com.addthis.codec.config.FeatureTest.enums(FeatureTest.java:187)

greetDefault(com.addthis.codec.config.FeatureTest)  Time elapsed: 0.001 sec  <<< ERROR!
java.lang.NoClassDefFoundError: Could not initialize class com.addthis.codec.jackson.DefaultCodecJackson
	at com.addthis.codec.jackson.Jackson.defaultCodec(Jackson.java:70)
	at com.addthis.codec.config.Configs.decodeObject(Configs.java:118)
	at com.addthis.codec.config.FeatureTest.greetDefault(FeatureTest.java:44)

abstractDelegate(com.addthis.codec.config.FeatureTest)  Time elapsed: 0.001 sec  <<< ERROR!
java.lang.NoClassDefFoundError: Could not initialize class com.addthis.codec.jackson.DefaultCodecJackson
	at com.addthis.codec.jackson.Jackson.defaultCodec(Jackson.java:70)
	at com.addthis.codec.config.Configs.decodeObject(Configs.java:90)
	at com.addthis.codec.config.FeatureTest.abstractDelegate(FeatureTest.java:220)

arraySingle(com.addthis.codec.config.FeatureTest)  Time elapsed: 0.001 sec  <<< ERROR!
java.lang.NoClassDefFoundError: Could not initialize class com.addthis.codec.jackson.DefaultCodecJackson
	at com.addthis.codec.jackson.Jackson.defaultCodec(Jackson.java:70)
	at com.addthis.codec.config.Configs.decodeObject(Configs.java:118)
	at com.addthis.codec.config.FeatureTest.arraySingle(FeatureTest.java:145)

primaryNestedObject(com.addthis.codec.config.FeatureTest)  Time elapsed: 0.001 sec  <<< ERROR!
java.lang.NoClassDefFoundError: Could not initialize class com.addthis.codec.jackson.DefaultCodecJackson
	at com.addthis.codec.jackson.Jackson.defaultCodec(Jackson.java:70)
	at com.addthis.codec.config.Configs.decodeObject(Configs.java:118)
	at com.addthis.codec.config.FeatureTest.primaryNestedObject(FeatureTest.java:112)

inheritanceJson(com.addthis.codec.config.FeatureTest)  Time elapsed: 0.001 sec  <<< ERROR!
java.lang.NoClassDefFoundError: Could not initialize class com.addthis.codec.jackson.DefaultCodecJackson
	at com.addthis.codec.jackson.Jackson.defaultCodec(Jackson.java:70)
	at com.addthis.codec.json.CodecJSON.decodeString(CodecJSON.java:90)
	at com.addthis.codec.config.FeatureTest.inheritanceJson(FeatureTest.java:211)

bytesAndTime(com.addthis.codec.config.FeatureTest)  Time elapsed: 0.001 sec  <<< ERROR!
java.lang.NoClassDefFoundError: Could not initialize class com.addthis.codec.jackson.DefaultCodecJackson
	at com.addthis.codec.jackson.Jackson.defaultCodec(Jackson.java:70)
	at com.addthis.codec.config.Configs.decodeObject(Configs.java:118)
	at com.addthis.codec.config.FeatureTest.bytesAndTime(FeatureTest.java:179)

autoArray(com.addthis.codec.config.FeatureTest)  Time elapsed: 0.002 sec  <<< ERROR!
java.lang.NoClassDefFoundError: Could not initialize class com.addthis.codec.jackson.DefaultCodecJackson
	at com.addthis.codec.jackson.Jackson.defaultCodec(Jackson.java:70)
	at com.addthis.codec.config.Configs.decodeObject(Configs.java:118)
	at com.addthis.codec.config.FeatureTest.autoArray(FeatureTest.java:72)

expandDefault(com.addthis.codec.config.FeatureTest)  Time elapsed: 0.002 sec  <<< ERROR!
java.lang.NoClassDefFoundError: Could not initialize class com.addthis.codec.plugins.DefaultRegistry
	at com.addthis.codec.plugins.PluginRegistry.defaultRegistry(PluginRegistry.java:43)
	at com.addthis.codec.config.FeatureTest.expandDefault(FeatureTest.java:52)

Running com.addthis.codec.CodecTest
Tests run: 6, Failures: 0, Errors: 0, Skipped: 0, Time elapsed: 0.001 sec - in com.addthis.codec.CodecTest
Running com.addthis.codec.CodecJsonBasicTest
Tests run: 5, Failures: 0, Errors: 5, Skipped: 0, Time elapsed: 0 sec <<< FAILURE! - in com.addthis.codec.CodecJsonBasicTest
upgradesDowngrades(com.addthis.codec.CodecJsonBasicTest)  Time elapsed: 0 sec  <<< ERROR!
java.lang.NoClassDefFoundError: Could not initialize class com.addthis.codec.jackson.DefaultCodecJackson
	at com.addthis.codec.jackson.Jackson.defaultCodec(Jackson.java:70)
	at com.addthis.codec.CodecJsonBasicTest.getCodec(CodecJsonBasicTest.java:30)

encodeDecode(com.addthis.codec.CodecJsonBasicTest)  Time elapsed: 0 sec  <<< ERROR!
java.lang.NoClassDefFoundError: Could not initialize class com.addthis.codec.jackson.DefaultCodecJackson
	at com.addthis.codec.jackson.Jackson.defaultCodec(Jackson.java:70)
	at com.addthis.codec.CodecJsonBasicTest.getCodec(CodecJsonBasicTest.java:30)

codes(com.addthis.codec.CodecJsonBasicTest)  Time elapsed: 0 sec  <<< ERROR!
java.lang.NoClassDefFoundError: Could not initialize class com.addthis.codec.jackson.DefaultCodecJackson
	at com.addthis.codec.jackson.Jackson.defaultCodec(Jackson.java:70)
	at com.addthis.codec.CodecJsonBasicTest.getCodec(CodecJsonBasicTest.java:30)

subclasses(com.addthis.codec.CodecJsonBasicTest)  Time elapsed: 0 sec  <<< ERROR!
java.lang.NoClassDefFoundError: Could not initialize class com.addthis.codec.jackson.DefaultCodecJackson
	at com.addthis.codec.jackson.Jackson.defaultCodec(Jackson.java:70)
	at com.addthis.codec.CodecJsonBasicTest.getCodec(CodecJsonBasicTest.java:30)

requiredFields(com.addthis.codec.CodecJsonBasicTest)  Time elapsed: 0 sec  <<< ERROR!
java.lang.NoClassDefFoundError: Could not initialize class com.addthis.codec.jackson.DefaultCodecJackson
	at com.addthis.codec.jackson.Jackson.defaultCodec(Jackson.java:70)
	at com.addthis.codec.CodecJsonBasicTest.getCodec(CodecJsonBasicTest.java:30)

Running com.addthis.codec.CodecGenericsTest
Tests run: 1, Failures: 0, Errors: 1, Skipped: 0, Time elapsed: 0 sec <<< FAILURE! - in com.addthis.codec.CodecGenericsTest
testAll(com.addthis.codec.CodecGenericsTest)  Time elapsed: 0 sec  <<< ERROR!
java.lang.NoClassDefFoundError: Could not initialize class com.addthis.codec.plugins.DefaultRegistry
	at com.addthis.codec.plugins.PluginRegistry.defaultRegistry(PluginRegistry.java:43)
	at com.addthis.codec.reflection.CodableClassInfo.<init>(CodableClassInfo.java:54)
	at com.addthis.codec.reflection.Fields.getClassFieldMap(Fields.java:39)
	at com.addthis.codec.binary.CodecBin2.encodeObject(CodecBin2.java:116)
	at com.addthis.codec.binary.CodecBin2.encodeBytes(CodecBin2.java:88)
	at com.addthis.codec.binary.CodecBin2.encode(CodecBin2.java:67)
	at com.addthis.codec.CodecGenericsTest.test(CodecGenericsTest.java:47)
	at com.addthis.codec.CodecGenericsTest.testAll(CodecGenericsTest.java:35)

Running com.addthis.codec.CodecUtilTest
[main] INFO com.addthis.codec.CodecUtilTest - compareTest(abc,ab) sc(1) bc(1)
[main] INFO com.addthis.codec.CodecUtilTest - compareTest(abc,abc) sc(0) bc(0)
[main] INFO com.addthis.codec.CodecUtilTest - compareTest(abc,abcd) sc(-1) bc(-1)
[main] INFO com.addthis.codec.CodecUtilTest - compareTest(abc,def) sc(-3) bc(-3)
[main] INFO com.addthis.codec.CodecUtilTest - compareTest(def,abc) sc(3) bc(3)
[main] INFO com.addthis.codec.CodecUtilTest - compareTest(abcd,acbd) sc(-1) bc(-1)
Tests run: 1, Failures: 0, Errors: 0, Skipped: 0, Time elapsed: 0.002 sec - in com.addthis.codec.CodecUtilTest
Running com.addthis.codec.CodecBin2BasicTest
Tests run: 4, Failures: 0, Errors: 4, Skipped: 0, Time elapsed: 0.006 sec <<< FAILURE! - in com.addthis.codec.CodecBin2BasicTest
encodeDecode(com.addthis.codec.CodecBin2BasicTest)  Time elapsed: 0 sec  <<< ERROR!
java.lang.NoClassDefFoundError: Could not initialize class com.addthis.codec.plugins.DefaultRegistry
	at com.addthis.codec.plugins.PluginRegistry.defaultRegistry(PluginRegistry.java:43)
	at com.addthis.codec.reflection.CodableClassInfo.<init>(CodableClassInfo.java:54)
	at com.addthis.codec.reflection.Fields.getClassFieldMap(Fields.java:39)
	at com.addthis.codec.binary.CodecBin2.encodeObject(CodecBin2.java:116)
	at com.addthis.codec.binary.CodecBin2.encodeBytes(CodecBin2.java:88)
	at com.addthis.codec.binary.CodecBin2.encode(CodecBin2.java:67)
	at com.addthis.codec.CodecBasicTests.setup(CodecBasicTests.java:84)
	at sun.reflect.NativeMethodAccessorImpl.invoke0(Native Method)
	at sun.reflect.NativeMethodAccessorImpl.invoke(NativeMethodAccessorImpl.java:57)
	at sun.reflect.DelegatingMethodAccessorImpl.invoke(DelegatingMethodAccessorImpl.java:43)
	at java.lang.reflect.Method.invoke(Method.java:606)
	at org.junit.runners.model.FrameworkMethod$1.runReflectiveCall(FrameworkMethod.java:47)
	at org.junit.internal.runners.model.ReflectiveCallable.run(ReflectiveCallable.java:12)
	at org.junit.runners.model.FrameworkMethod.invokeExplosively(FrameworkMethod.java:44)
	at org.junit.internal.runners.statements.RunBefores.evaluate(RunBefores.java:24)
	at org.junit.runners.ParentRunner.runLeaf(ParentRunner.java:271)
	at org.junit.runners.BlockJUnit4ClassRunner.runChild(BlockJUnit4ClassRunner.java:70)
	at org.junit.runners.BlockJUnit4ClassRunner.runChild(BlockJUnit4ClassRunner.java:50)
	at org.junit.runners.ParentRunner$3.run(ParentRunner.java:238)
	at org.junit.runners.ParentRunner$1.schedule(ParentRunner.java:63)
	at org.junit.runners.ParentRunner.runChildren(ParentRunner.java:236)
	at org.junit.runners.ParentRunner.access$000(ParentRunner.java:53)
	at org.junit.runners.ParentRunner$2.evaluate(ParentRunner.java:229)
	at org.junit.runners.ParentRunner.run(ParentRunner.java:309)
	at org.apache.maven.surefire.junit4.JUnit4Provider.execute(JUnit4Provider.java:264)
	at org.apache.maven.surefire.junit4.JUnit4Provider.executeTestSet(JUnit4Provider.java:153)
	at org.apache.maven.surefire.junit4.JUnit4Provider.invoke(JUnit4Provider.java:124)
	at org.apache.maven.surefire.booter.ForkedBooter.invokeProviderInSameClassLoader(ForkedBooter.java:200)
	at org.apache.maven.surefire.booter.ForkedBooter.runSuitesInProcess(ForkedBooter.java:153)
	at org.apache.maven.surefire.booter.ForkedBooter.main(ForkedBooter.java:103)

codes(com.addthis.codec.CodecBin2BasicTest)  Time elapsed: 0 sec  <<< ERROR!
java.lang.NoClassDefFoundError: Could not initialize class com.addthis.codec.plugins.DefaultRegistry
	at com.addthis.codec.plugins.PluginRegistry.defaultRegistry(PluginRegistry.java:43)
	at com.addthis.codec.reflection.CodableClassInfo.<init>(CodableClassInfo.java:54)
	at com.addthis.codec.reflection.Fields.getClassFieldMap(Fields.java:39)
	at com.addthis.codec.binary.CodecBin2.encodeObject(CodecBin2.java:116)
	at com.addthis.codec.binary.CodecBin2.encodeBytes(CodecBin2.java:88)
	at com.addthis.codec.binary.CodecBin2.encode(CodecBin2.java:67)
	at com.addthis.codec.CodecBasicTests.setup(CodecBasicTests.java:84)
	at sun.reflect.NativeMethodAccessorImpl.invoke0(Native Method)
	at sun.reflect.NativeMethodAccessorImpl.invoke(NativeMethodAccessorImpl.java:57)
	at sun.reflect.DelegatingMethodAccessorImpl.invoke(DelegatingMethodAccessorImpl.java:43)
	at java.lang.reflect.Method.invoke(Method.java:606)
	at org.junit.runners.model.FrameworkMethod$1.runReflectiveCall(FrameworkMethod.java:47)
	at org.junit.internal.runners.model.ReflectiveCallable.run(ReflectiveCallable.java:12)
	at org.junit.runners.model.FrameworkMethod.invokeExplosively(FrameworkMethod.java:44)
	at org.junit.internal.runners.statements.RunBefores.evaluate(RunBefores.java:24)
	at org.junit.runners.ParentRunner.runLeaf(ParentRunner.java:271)
	at org.junit.runners.BlockJUnit4ClassRunner.runChild(BlockJUnit4ClassRunner.java:70)
	at org.junit.runners.BlockJUnit4ClassRunner.runChild(BlockJUnit4ClassRunner.java:50)
	at org.junit.runners.ParentRunner$3.run(ParentRunner.java:238)
	at org.junit.runners.ParentRunner$1.schedule(ParentRunner.java:63)
	at org.junit.runners.ParentRunner.runChildren(ParentRunner.java:236)
	at org.junit.runners.ParentRunner.access$000(ParentRunner.java:53)
	at org.junit.runners.ParentRunner$2.evaluate(ParentRunner.java:229)
	at org.junit.runners.ParentRunner.run(ParentRunner.java:309)
	at org.apache.maven.surefire.junit4.JUnit4Provider.execute(JUnit4Provider.java:264)
	at org.apache.maven.surefire.junit4.JUnit4Provider.executeTestSet(JUnit4Provider.java:153)
	at org.apache.maven.surefire.junit4.JUnit4Provider.invoke(JUnit4Provider.java:124)
	at org.apache.maven.surefire.booter.ForkedBooter.invokeProviderInSameClassLoader(ForkedBooter.java:200)
	at org.apache.maven.surefire.booter.ForkedBooter.runSuitesInProcess(ForkedBooter.java:153)
	at org.apache.maven.surefire.booter.ForkedBooter.main(ForkedBooter.java:103)

subclasses(com.addthis.codec.CodecBin2BasicTest)  Time elapsed: 0 sec  <<< ERROR!
java.lang.NoClassDefFoundError: Could not initialize class com.addthis.codec.plugins.DefaultRegistry
	at com.addthis.codec.plugins.PluginRegistry.defaultRegistry(PluginRegistry.java:43)
	at com.addthis.codec.reflection.CodableClassInfo.<init>(CodableClassInfo.java:54)
	at com.addthis.codec.reflection.Fields.getClassFieldMap(Fields.java:39)
	at com.addthis.codec.binary.CodecBin2.encodeObject(CodecBin2.java:116)
	at com.addthis.codec.binary.CodecBin2.encodeBytes(CodecBin2.java:88)
	at com.addthis.codec.binary.CodecBin2.encode(CodecBin2.java:67)
	at com.addthis.codec.CodecBasicTests.setup(CodecBasicTests.java:84)
	at sun.reflect.NativeMethodAccessorImpl.invoke0(Native Method)
	at sun.reflect.NativeMethodAccessorImpl.invoke(NativeMethodAccessorImpl.java:57)
	at sun.reflect.DelegatingMethodAccessorImpl.invoke(DelegatingMethodAccessorImpl.java:43)
	at java.lang.reflect.Method.invoke(Method.java:606)
	at org.junit.runners.model.FrameworkMethod$1.runReflectiveCall(FrameworkMethod.java:47)
	at org.junit.internal.runners.model.ReflectiveCallable.run(ReflectiveCallable.java:12)
	at org.junit.runners.model.FrameworkMethod.invokeExplosively(FrameworkMethod.java:44)
	at org.junit.internal.runners.statements.RunBefores.evaluate(RunBefores.java:24)
	at org.junit.runners.ParentRunner.runLeaf(ParentRunner.java:271)
	at org.junit.runners.BlockJUnit4ClassRunner.runChild(BlockJUnit4ClassRunner.java:70)
	at org.junit.runners.BlockJUnit4ClassRunner.runChild(BlockJUnit4ClassRunner.java:50)
	at org.junit.runners.ParentRunner$3.run(ParentRunner.java:238)
	at org.junit.runners.ParentRunner$1.schedule(ParentRunner.java:63)
	at org.junit.runners.ParentRunner.runChildren(ParentRunner.java:236)
	at org.junit.runners.ParentRunner.access$000(ParentRunner.java:53)
	at org.junit.runners.ParentRunner$2.evaluate(ParentRunner.java:229)
	at org.junit.runners.ParentRunner.run(ParentRunner.java:309)
	at org.apache.maven.surefire.junit4.JUnit4Provider.execute(JUnit4Provider.java:264)
	at org.apache.maven.surefire.junit4.JUnit4Provider.executeTestSet(JUnit4Provider.java:153)
	at org.apache.maven.surefire.junit4.JUnit4Provider.invoke(JUnit4Provider.java:124)
	at org.apache.maven.surefire.booter.ForkedBooter.invokeProviderInSameClassLoader(ForkedBooter.java:200)
	at org.apache.maven.surefire.booter.ForkedBooter.runSuitesInProcess(ForkedBooter.java:153)
	at org.apache.maven.surefire.booter.ForkedBooter.main(ForkedBooter.java:103)

requiredFields(com.addthis.codec.CodecBin2BasicTest)  Time elapsed: 0.001 sec  <<< ERROR!
java.lang.NoClassDefFoundError: Could not initialize class com.addthis.codec.plugins.DefaultRegistry
	at com.addthis.codec.plugins.PluginRegistry.defaultRegistry(PluginRegistry.java:43)
	at com.addthis.codec.reflection.CodableClassInfo.<init>(CodableClassInfo.java:54)
	at com.addthis.codec.reflection.Fields.getClassFieldMap(Fields.java:39)
	at com.addthis.codec.binary.CodecBin2.encodeObject(CodecBin2.java:116)
	at com.addthis.codec.binary.CodecBin2.encodeBytes(CodecBin2.java:88)
	at com.addthis.codec.binary.CodecBin2.encode(CodecBin2.java:67)
	at com.addthis.codec.CodecBasicTests.setup(CodecBasicTests.java:84)
	at sun.reflect.NativeMethodAccessorImpl.invoke0(Native Method)
	at sun.reflect.NativeMethodAccessorImpl.invoke(NativeMethodAccessorImpl.java:57)
	at sun.reflect.DelegatingMethodAccessorImpl.invoke(DelegatingMethodAccessorImpl.java:43)
	at java.lang.reflect.Method.invoke(Method.java:606)
	at org.junit.runners.model.FrameworkMethod$1.runReflectiveCall(FrameworkMethod.java:47)
	at org.junit.internal.runners.model.ReflectiveCallable.run(ReflectiveCallable.java:12)
	at org.junit.runners.model.FrameworkMethod.invokeExplosively(FrameworkMethod.java:44)
	at org.junit.internal.runners.statements.RunBefores.evaluate(RunBefores.java:24)
	at org.junit.runners.ParentRunner.runLeaf(ParentRunner.java:271)
	at org.junit.runners.BlockJUnit4ClassRunner.runChild(BlockJUnit4ClassRunner.java:70)
	at org.junit.runners.BlockJUnit4ClassRunner.runChild(BlockJUnit4ClassRunner.java:50)
	at org.junit.runners.ParentRunner$3.run(ParentRunner.java:238)
	at org.junit.runners.ParentRunner$1.schedule(ParentRunner.java:63)
	at org.junit.runners.ParentRunner.runChildren(ParentRunner.java:236)
	at org.junit.runners.ParentRunner.access$000(ParentRunner.java:53)
	at org.junit.runners.ParentRunner$2.evaluate(ParentRunner.java:229)
	at org.junit.runners.ParentRunner.run(ParentRunner.java:309)
	at org.apache.maven.surefire.junit4.JUnit4Provider.execute(JUnit4Provider.java:264)
	at org.apache.maven.surefire.junit4.JUnit4Provider.executeTestSet(JUnit4Provider.java:153)
	at org.apache.maven.surefire.junit4.JUnit4Provider.invoke(JUnit4Provider.java:124)
	at org.apache.maven.surefire.booter.ForkedBooter.invokeProviderInSameClassLoader(ForkedBooter.java:200)
	at org.apache.maven.surefire.booter.ForkedBooter.runSuitesInProcess(ForkedBooter.java:153)
	at org.apache.maven.surefire.booter.ForkedBooter.main(ForkedBooter.java:103)

Running com.addthis.codec.utils.ExecutorServiceBuilderTest
Tests run: 1, Failures: 0, Errors: 1, Skipped: 0, Time elapsed: 0 sec <<< FAILURE! - in com.addthis.codec.utils.ExecutorServiceBuilderTest
dontError(com.addthis.codec.utils.ExecutorServiceBuilderTest)  Time elapsed: 0 sec  <<< ERROR!
java.lang.NoClassDefFoundError: Could not initialize class com.addthis.codec.jackson.DefaultCodecJackson
	at com.addthis.codec.jackson.Jackson.defaultCodec(Jackson.java:70)
	at com.addthis.codec.utils.ExecutorServiceBuilderTest.dontError(ExecutorServiceBuilderTest.java:32)

Running com.addthis.codec.CodecObjectSubclassTest
Tests run: 1, Failures: 0, Errors: 1, Skipped: 0, Time elapsed: 0.007 sec <<< FAILURE! - in com.addthis.codec.CodecObjectSubclassTest
testAll(com.addthis.codec.CodecObjectSubclassTest)  Time elapsed: 0.006 sec  <<< ERROR!
java.lang.NoClassDefFoundError: Could not initialize class com.addthis.codec.plugins.DefaultRegistry
	at com.addthis.codec.plugins.PluginRegistry.defaultRegistry(PluginRegistry.java:43)
	at com.addthis.codec.reflection.CodableClassInfo.<init>(CodableClassInfo.java:54)
	at com.addthis.codec.reflection.Fields.getClassFieldMap(Fields.java:39)
	at com.addthis.codec.binary.CodecBin2.encodeObject(CodecBin2.java:116)
	at com.addthis.codec.binary.CodecBin2.encodeBytes(CodecBin2.java:88)
	at com.addthis.codec.binary.CodecBin2.encode(CodecBin2.java:67)
	at com.addthis.codec.CodecObjectSubclassTest.testAll(CodecObjectSubclassTest.java:48)

Running com.addthis.codec.plugins.PluginRegistryTest
Tests run: 7, Failures: 0, Errors: 0, Skipped: 0, Time elapsed: 0.101 sec - in com.addthis.codec.plugins.PluginRegistryTest

Results :

Tests in error: 
  WriteonlyPropertyIgnorerTest.ignoreWriteonly:37 » ExceptionInInitializer
  CodecRWOnlyTest.readWrite:46 » NoClassDefFound Could not initialize class com....
  CodecJSONTest.testPrimitiveArrayTypeMismatch:59 » NoClassDefFound Could not in...
  CodecJSONTest.arraySugar:87 » NoClassDefFound Could not initialize class com.a...
  CodecJSONTest.typeSugar:79 » NoClassDefFound Could not initialize class com.ad...
  CodecJSONTest.testObjectArrayTypeMismatch:70 » NoClassDefFound Could not initi...
  FeatureTest.inheritance:196 » NoClassDefFound Could not initialize class com.a...
  FeatureTest.abstractDelegateEmpty:229 » NoClassDefFound Could not initialize c...
  FeatureTest.concreteValue:204 » NoClassDefFound Could not initialize class com...
  FeatureTest.autoCollection:80 » NoClassDefFound Could not initialize class com...
  FeatureTest.inline:129 » NoClassDefFound Could not initialize class com.addthi...
  FeatureTest.primaryArray:104 » NoClassDefFound Could not initialize class com....
  FeatureTest.bytesConstructor:172 » NoClassDefFound Could not initialize class ...
  FeatureTest.aliasInheritance:137 » NoClassDefFound Could not initialize class ...
  FeatureTest.primaryNested:120 » NoClassDefFound Could not initialize class com...
  FeatureTest.primary:96 » NoClassDefFound Could not initialize class com.addthi...
  FeatureTest.greetArray:63 » NoClassDefFound Could not initialize class com.add...
  FeatureTest.bytesSetter:165 » NoClassDefFound Could not initialize class com.a...
  FeatureTest.alias:88 » NoClassDefFound Could not initialize class com.addthis....
  FeatureTest.enums:187 » NoClassDefFound Could not initialize class com.addthis...
  FeatureTest.greetDefault:44 » NoClassDefFound Could not initialize class com.a...
  FeatureTest.abstractDelegate:220 » NoClassDefFound Could not initialize class ...
  FeatureTest.arraySingle:145 » NoClassDefFound Could not initialize class com.a...
  FeatureTest.primaryNestedObject:112 » NoClassDefFound Could not initialize cla...
  FeatureTest.inheritanceJson:211 » NoClassDefFound Could not initialize class c...
  FeatureTest.bytesAndTime:179 » NoClassDefFound Could not initialize class com....
  FeatureTest.autoArray:72 » NoClassDefFound Could not initialize class com.addt...
  FeatureTest.expandDefault:52 » NoClassDefFound Could not initialize class com....
  CodecJsonBasicTest>CodecBasicTests.setup:80->getCodec:30 » NoClassDefFound Cou...
  CodecJsonBasicTest>CodecBasicTests.setup:80->getCodec:30 » NoClassDefFound Cou...
  CodecJsonBasicTest>CodecBasicTests.setup:80->getCodec:30 » NoClassDefFound Cou...
  CodecJsonBasicTest>CodecBasicTests.setup:80->getCodec:30 » NoClassDefFound Cou...
  CodecJsonBasicTest>CodecBasicTests.setup:80->getCodec:30 » NoClassDefFound Cou...
  CodecGenericsTest.testAll:35->test:47 » NoClassDefFound Could not initialize c...
  CodecBin2BasicTest>CodecBasicTests.setup:84 » NoClassDefFound Could not initia...
  CodecBin2BasicTest>CodecBasicTests.setup:84 » NoClassDefFound Could not initia...
  CodecBin2BasicTest>CodecBasicTests.setup:84 » NoClassDefFound Could not initia...
  CodecBin2BasicTest>CodecBasicTests.setup:84 » NoClassDefFound Could not initia...
  ExecutorServiceBuilderTest.dontError:32 » NoClassDefFound Could not initialize...
  CodecObjectSubclassTest.testAll:48 » NoClassDefFound Could not initialize clas...

Tests run: 54, Failures: 0, Errors: 40, Skipped: 0

[INFO] ------------------------------------------------------------------------
[INFO] BUILD FAILURE
[INFO] ------------------------------------------------------------------------
[INFO] Total time: 7.889s
[INFO] Finished at: Sun Aug 02 02:15:14 BST 2015
[INFO] Final Memory: 18M/345M
[INFO] ------------------------------------------------------------------------
[ERROR] Failed to execute goal org.apache.maven.plugins:maven-surefire-plugin:2.17:test (default-test) on project codec: There are test failures.
[ERROR] 
[ERROR] Please refer to /home/perham/Study/LittleDarwin/Cases/codec-3.3.0/target/surefire-reports for the individual test results.
[ERROR] -> [Help 1]
[ERROR] 
[ERROR] To see the full stack trace of the errors, re-run Maven with the -e switch.
[ERROR] Re-run Maven using the -X switch to enable full debug logging.
[ERROR] 
[ERROR] For more information about the errors and possible solutions, please read the following articles:
[ERROR] [Help 1] http://cwiki.apache.org/confluence/display/MAVEN/MojoFailureException
