[INFO] Scanning for projects...
[INFO]                                                                         
[INFO] ------------------------------------------------------------------------
[INFO] Building Codec 3.3.0
[INFO] ------------------------------------------------------------------------
[INFO] 
[INFO] --- jacoco-maven-plugin:0.7.1.201405082137:prepare-agent (default) @ codec ---
[INFO] argLine set to -javaagent:/home/perham/.m2/repository/org/jacoco/org.jacoco.agent/0.7.1.201405082137/org.jacoco.agent-0.7.1.201405082137-runtime.jar=destfile=/home/perham/Study/LittleDarwin/Cases/codec-3.3.0/target/jacoco.exec
[INFO] 
[INFO] --- maven-resources-plugin:2.3:resources (default-resources) @ codec ---
[INFO] Using 'UTF-8' encoding to copy filtered resources.
[INFO] Copying 1 resource
[INFO] 
[INFO] --- maven-compiler-plugin:3.1:compile (default-compile) @ codec ---
[INFO] Changes detected - recompiling the module!
[INFO] Compiling 47 source files to /home/perham/Study/LittleDarwin/Cases/codec-3.3.0/target/classes
[WARNING] /home/perham/Study/LittleDarwin/Cases/codec-3.3.0/src/main/java/com/addthis/codec/jackson/CodecTypeIdResolver.java:[93,31] typeFromId(java.lang.String) in com.fasterxml.jackson.databind.jsontype.impl.TypeIdResolverBase has been deprecated
[WARNING] /home/perham/Study/LittleDarwin/Cases/codec-3.3.0/src/main/java/com/addthis/codec/binary/BufferIn.java:[35,28] readBytes(java.io.InputStream,int) in com.addthis.basis.util.Bytes has been deprecated
[WARNING] /home/perham/Study/LittleDarwin/Cases/codec-3.3.0/src/main/java/com/addthis/codec/binary/CodecBin2.java:[87,14] writeInt(int,java.io.OutputStream) in com.addthis.basis.util.Bytes has been deprecated
[WARNING] /home/perham/Study/LittleDarwin/Cases/codec-3.3.0/src/main/java/com/addthis/codec/binary/CodecBin2.java:[95,24] readInt(java.io.InputStream) in com.addthis.basis.util.Bytes has been deprecated
[WARNING] /home/perham/Study/LittleDarwin/Cases/codec-3.3.0/src/main/java/com/addthis/codec/binary/CodecBin2.java:[181,22] writeInt(int,java.io.OutputStream) in com.addthis.basis.util.Bytes has been deprecated
[WARNING] /home/perham/Study/LittleDarwin/Cases/codec-3.3.0/src/main/java/com/addthis/codec/binary/CodecBin2.java:[186,22] writeLong(long,java.io.OutputStream) in com.addthis.basis.util.Bytes has been deprecated
[WARNING] /home/perham/Study/LittleDarwin/Cases/codec-3.3.0/src/main/java/com/addthis/codec/binary/CodecBin2.java:[210,35] readInt(java.io.InputStream) in com.addthis.basis.util.Bytes has been deprecated
[WARNING] /home/perham/Study/LittleDarwin/Cases/codec-3.3.0/src/main/java/com/addthis/codec/binary/CodecBin2.java:[216,35] readLong(java.io.InputStream) in com.addthis.basis.util.Bytes has been deprecated
[WARNING] /home/perham/Study/LittleDarwin/Cases/codec-3.3.0/src/main/java/com/addthis/codec/binary/CodecBin2.java:[356,18] writeInt(int,java.io.OutputStream) in com.addthis.basis.util.Bytes has been deprecated
[WARNING] /home/perham/Study/LittleDarwin/Cases/codec-3.3.0/src/main/java/com/addthis/codec/binary/CodecBin2.java:[358,18] writeLong(long,java.io.OutputStream) in com.addthis.basis.util.Bytes has been deprecated
[WARNING] /home/perham/Study/LittleDarwin/Cases/codec-3.3.0/src/main/java/com/addthis/codec/binary/CodecBin2.java:[360,18] writeShort(short,java.io.OutputStream) in com.addthis.basis.util.Bytes has been deprecated
[WARNING] /home/perham/Study/LittleDarwin/Cases/codec-3.3.0/src/main/java/com/addthis/codec/binary/CodecBin2.java:[364,18] writeInt(int,java.io.OutputStream) in com.addthis.basis.util.Bytes has been deprecated
[WARNING] /home/perham/Study/LittleDarwin/Cases/codec-3.3.0/src/main/java/com/addthis/codec/binary/CodecBin2.java:[366,18] writeLong(long,java.io.OutputStream) in com.addthis.basis.util.Bytes has been deprecated
[WARNING] /home/perham/Study/LittleDarwin/Cases/codec-3.3.0/src/main/java/com/addthis/codec/binary/CodecBin2.java:[368,18] writeLong(long,java.io.OutputStream) in com.addthis.basis.util.Bytes has been deprecated
[WARNING] /home/perham/Study/LittleDarwin/Cases/codec-3.3.0/src/main/java/com/addthis/codec/binary/CodecBin2.java:[370,18] writeInt(int,java.io.OutputStream) in com.addthis.basis.util.Bytes has been deprecated
[WARNING] /home/perham/Study/LittleDarwin/Cases/codec-3.3.0/src/main/java/com/addthis/codec/binary/CodecBin2.java:[388,27] readInt(java.io.InputStream) in com.addthis.basis.util.Bytes has been deprecated
[WARNING] /home/perham/Study/LittleDarwin/Cases/codec-3.3.0/src/main/java/com/addthis/codec/binary/CodecBin2.java:[390,27] readLong(java.io.InputStream) in com.addthis.basis.util.Bytes has been deprecated
[WARNING] /home/perham/Study/LittleDarwin/Cases/codec-3.3.0/src/main/java/com/addthis/codec/binary/CodecBin2.java:[392,27] readShort(java.io.InputStream) in com.addthis.basis.util.Bytes has been deprecated
[WARNING] /home/perham/Study/LittleDarwin/Cases/codec-3.3.0/src/main/java/com/addthis/codec/binary/CodecBin2.java:[396,51] readLong(java.io.InputStream) in com.addthis.basis.util.Bytes has been deprecated
[WARNING] /home/perham/Study/LittleDarwin/Cases/codec-3.3.0/src/main/java/com/addthis/codec/binary/CodecBin2.java:[398,48] readInt(java.io.InputStream) in com.addthis.basis.util.Bytes has been deprecated
[WARNING] /home/perham/Study/LittleDarwin/Cases/codec-3.3.0/src/main/java/com/addthis/codec/binary/CodecBin2.java:[400,42] readLong(java.io.InputStream) in com.addthis.basis.util.Bytes has been deprecated
[WARNING] /home/perham/Study/LittleDarwin/Cases/codec-3.3.0/src/main/java/com/addthis/codec/binary/CodecBin2.java:[402,45] readInt(java.io.InputStream) in com.addthis.basis.util.Bytes has been deprecated
[WARNING] /home/perham/Study/LittleDarwin/Cases/codec-3.3.0/src/main/java/com/addthis/codec/binary/CodecBin2.java:[419,25] readCharString(java.io.InputStream) in com.addthis.basis.util.Bytes has been deprecated
[WARNING] /home/perham/Study/LittleDarwin/Cases/codec-3.3.0/src/main/java/com/addthis/codec/binary/CodecBin2.java:[421,25] readString(java.io.InputStream) in com.addthis.basis.util.Bytes has been deprecated
[WARNING] /home/perham/Study/LittleDarwin/Cases/codec-3.3.0/src/main/java/com/addthis/codec/binary/CodecBin2.java:[427,18] writeCharString(java.lang.String,java.io.OutputStream) in com.addthis.basis.util.Bytes has been deprecated
[WARNING] /home/perham/Study/LittleDarwin/Cases/codec-3.3.0/src/main/java/com/addthis/codec/binary/CodecBin2.java:[429,18] writeString(java.lang.String,java.io.OutputStream) in com.addthis.basis.util.Bytes has been deprecated
[WARNING] /home/perham/Study/LittleDarwin/Cases/codec-3.3.0/src/main/java/com/addthis/codec/jackson/CodecJackson.java: Some input files use unchecked or unsafe operations.
[WARNING] /home/perham/Study/LittleDarwin/Cases/codec-3.3.0/src/main/java/com/addthis/codec/jackson/CodecJackson.java: Recompile with -Xlint:unchecked for details.
[INFO] 
[INFO] --- maven-resources-plugin:2.3:testResources (default-testResources) @ codec ---
[INFO] Using 'UTF-8' encoding to copy filtered resources.
[INFO] Copying 10 resources
[INFO] 
[INFO] --- maven-compiler-plugin:3.1:testCompile (default-testCompile) @ codec ---
[INFO] Nothing to compile - all classes are up to date
[INFO] 
[INFO] --- maven-surefire-plugin:2.17:test (default-test) @ codec ---
[INFO] Surefire report directory: /home/perham/Study/LittleDarwin/Cases/codec-3.3.0/target/surefire-reports

-------------------------------------------------------
 T E S T S
-------------------------------------------------------
Running com.addthis.codec.jackson.WriteonlyPropertyIgnorerTest
Aug 02, 2015 2:15:03 AM org.hibernate.validator.internal.util.Version <clinit>
INFO: HV000001: Hibernate Validator 5.1.1.Final
Tests run: 1, Failures: 0, Errors: 0, Skipped: 0, Time elapsed: 3.003 sec - in com.addthis.codec.jackson.WriteonlyPropertyIgnorerTest
Running com.addthis.codec.CodecRWOnlyTest
{"read1":123,"read2":234,"write1":456,"write2":567}
r1:111,r2:222,w1:333,w2:444
Tests run: 1, Failures: 0, Errors: 0, Skipped: 0, Time elapsed: 0.009 sec - in com.addthis.codec.CodecRWOnlyTest
Running com.addthis.codec.json.CodecJSONTest
Tests run: 4, Failures: 0, Errors: 2, Skipped: 0, Time elapsed: 0.069 sec <<< FAILURE! - in com.addthis.codec.json.CodecJSONTest
arraySugar(com.addthis.codec.json.CodecJSONTest)  Time elapsed: 0.041 sec  <<< ERROR!
com.fasterxml.jackson.databind.JsonMappingException: No configuration setting found for key '"_primary"' (through reference chain: com.addthis.codec.json.Holder["thing"])
	at com.typesafe.config.impl.SimpleConfig.findKey(SimpleConfig.java:124)
	at com.typesafe.config.impl.SimpleConfig.find(SimpleConfig.java:145)
	at com.typesafe.config.impl.SimpleConfig.find(SimpleConfig.java:159)
	at com.typesafe.config.impl.SimpleConfig.find(SimpleConfig.java:164)
	at com.typesafe.config.impl.SimpleConfig.getString(SimpleConfig.java:206)
	at com.addthis.codec.jackson.CodecTypeDeserializer._deserializeTypedFromArray(CodecTypeDeserializer.java:320)
	at com.addthis.codec.jackson.CodecTypeDeserializer.deserializeTypedFromAny(CodecTypeDeserializer.java:120)
	at com.addthis.codec.jackson.CodecTypeDeserializer.deserializeTypedFromObject(CodecTypeDeserializer.java:83)
	at com.fasterxml.jackson.databind.deser.AbstractDeserializer.deserializeWithType(AbstractDeserializer.java:132)
	at com.fasterxml.jackson.databind.deser.SettableBeanProperty.deserialize(SettableBeanProperty.java:536)
	at com.fasterxml.jackson.databind.deser.impl.FieldProperty.deserializeAndSet(FieldProperty.java:106)
	at com.fasterxml.jackson.databind.deser.BeanDeserializer.deserialize(BeanDeserializer.java:205)
	at com.fasterxml.jackson.databind.deser.std.DelegatingDeserializer.deserialize(DelegatingDeserializer.java:115)
	at com.fasterxml.jackson.databind.ObjectReader._bindAndClose(ObjectReader.java:1271)
	at com.fasterxml.jackson.databind.ObjectReader.readValue(ObjectReader.java:896)
	at com.addthis.codec.json.CodecJSON.decodeString(CodecJSON.java:86)
	at com.addthis.codec.json.CodecJSONTest.arraySugar(CodecJSONTest.java:87)

typeSugar(com.addthis.codec.json.CodecJSONTest)  Time elapsed: 0.014 sec  <<< ERROR!
com.fasterxml.jackson.databind.JsonMappingException: (was java.lang.NullPointerException)
 at [Source: {thing: {"com.addthis.codec.json.CodecJSONTest$C": {intField: 5}}}; line: 1, column: 1] (through reference chain: com.addthis.codec.json.Holder["thing"])
	at com.addthis.codec.plugins.PluginMap.aliasDefaults(PluginMap.java:81)
	at com.addthis.codec.jackson.CodecTypeDeserializer._deserializeObjectFromSingleKey(CodecTypeDeserializer.java:239)
	at com.addthis.codec.jackson.CodecTypeDeserializer._deserializeTypedFromObject(CodecTypeDeserializer.java:146)
	at com.addthis.codec.jackson.CodecTypeDeserializer.deserializeTypedFromAny(CodecTypeDeserializer.java:123)
	at com.addthis.codec.jackson.CodecTypeDeserializer.deserializeTypedFromObject(CodecTypeDeserializer.java:83)
	at com.fasterxml.jackson.databind.deser.AbstractDeserializer.deserializeWithType(AbstractDeserializer.java:132)
	at com.fasterxml.jackson.databind.deser.SettableBeanProperty.deserialize(SettableBeanProperty.java:536)
	at com.fasterxml.jackson.databind.deser.impl.FieldProperty.deserializeAndSet(FieldProperty.java:106)
	at com.fasterxml.jackson.databind.deser.BeanDeserializer.vanillaDeserialize(BeanDeserializer.java:238)
	at com.fasterxml.jackson.databind.deser.BeanDeserializer.deserialize(BeanDeserializer.java:118)
	at com.addthis.codec.jackson.CodecBeanDeserializer.deserialize(CodecBeanDeserializer.java:82)
	at com.fasterxml.jackson.databind.ObjectReader._bindAndClose(ObjectReader.java:1269)
	at com.fasterxml.jackson.databind.ObjectReader.readValue(ObjectReader.java:896)
	at com.addthis.codec.json.CodecJSON.decodeString(CodecJSON.java:90)
	at com.addthis.codec.json.CodecJSONTest.typeSugar(CodecJSONTest.java:79)

Running com.addthis.codec.config.FeatureTest
[main] INFO com.addthis.codec.config.FeatureTest - unresolved {
    # config/defaultgreeter.conf: 1
    "greet" : {}
}

[main] INFO com.addthis.codec.config.FeatureTest - resolved {
    # global default : plugins/greet-complex.conf: 8
    "suffix" : "! What a pleasant default suffix we are having!",
    # greet default type : plugins/greet-complex.conf: 37
    "type" : "simple"
}

Tests run: 22, Failures: 6, Errors: 6, Skipped: 0, Time elapsed: 0.24 sec <<< FAILURE! - in com.addthis.codec.config.FeatureTest
abstractDelegateEmpty(com.addthis.codec.config.FeatureTest)  Time elapsed: 0.011 sec  <<< FAILURE!
org.junit.ComparisonFailure: expected:<...t a pleasant default[-alias] suffix we are havin...> but was:<...t a pleasant default[] suffix we are havin...>
	at org.junit.Assert.assertEquals(Assert.java:115)
	at org.junit.Assert.assertEquals(Assert.java:144)
	at com.addthis.codec.config.FeatureTest.abstractDelegateEmpty(FeatureTest.java:231)

inline(com.addthis.codec.config.FeatureTest)  Time elapsed: 0.001 sec  <<< ERROR!
java.lang.NullPointerException: null
	at com.addthis.codec.jackson.CodecTypeDeserializer._deserializeObjectFromInlinedType(CodecTypeDeserializer.java:209)
	at com.addthis.codec.jackson.CodecTypeDeserializer._deserializeTypedFromObject(CodecTypeDeserializer.java:151)
	at com.addthis.codec.jackson.CodecTypeDeserializer.deserializeTypedFromAny(CodecTypeDeserializer.java:123)
	at com.addthis.codec.jackson.CodecTypeDeserializer.deserializeTypedFromObject(CodecTypeDeserializer.java:83)
	at com.fasterxml.jackson.databind.deser.AbstractDeserializer.deserializeWithType(AbstractDeserializer.java:132)
	at com.fasterxml.jackson.databind.deser.impl.TypeWrappedDeserializer.deserialize(TypeWrappedDeserializer.java:41)
	at com.fasterxml.jackson.databind.ObjectMapper._readValue(ObjectMapper.java:3038)
	at com.fasterxml.jackson.databind.ObjectMapper.readValue(ObjectMapper.java:1652)
	at com.fasterxml.jackson.core.JsonParser.readValueAs(JsonParser.java:1346)
	at com.addthis.codec.jackson.CodecJackson.decodeObject(CodecJackson.java:116)
	at com.addthis.codec.jackson.CodecJackson.decodeObject(CodecJackson.java:205)
	at com.addthis.codec.config.Configs.decodeObject(Configs.java:118)
	at com.addthis.codec.config.FeatureTest.inline(FeatureTest.java:129)

primaryArray(com.addthis.codec.config.FeatureTest)  Time elapsed: 0.005 sec  <<< ERROR!
com.fasterxml.jackson.databind.JsonMappingException: Can not deserialize instance of com.addthis.codec.plugins.MultiGreet out of null token
 at [Source: SimpleConfigList(["a","b","c"]); line: 1, column: -1] (through reference chain: com.fasterxml.jackson.databind.type.SimpleType["multi-array-primary"])
	at com.fasterxml.jackson.databind.JsonMappingException.from(JsonMappingException.java:148)
	at com.fasterxml.jackson.databind.DeserializationContext.mappingException(DeserializationContext.java:762)
	at com.fasterxml.jackson.databind.DeserializationContext.mappingException(DeserializationContext.java:758)
	at com.fasterxml.jackson.databind.deser.BeanDeserializerBase.deserializeFromArray(BeanDeserializerBase.java:1211)
	at com.fasterxml.jackson.databind.deser.BeanDeserializer._deserializeOther(BeanDeserializer.java:147)
	at com.fasterxml.jackson.databind.deser.BeanDeserializer.deserialize(BeanDeserializer.java:126)
	at com.addthis.codec.jackson.CodecBeanDeserializer.deserialize(CodecBeanDeserializer.java:82)
	at com.addthis.codec.jackson.CodecTypeDeserializer._deserializeObjectFromSingleKey(CodecTypeDeserializer.java:268)
	at com.addthis.codec.jackson.CodecTypeDeserializer._deserializeTypedFromObject(CodecTypeDeserializer.java:146)
	at com.addthis.codec.jackson.CodecTypeDeserializer.deserializeTypedFromAny(CodecTypeDeserializer.java:123)
	at com.addthis.codec.jackson.CodecTypeDeserializer.deserializeTypedFromObject(CodecTypeDeserializer.java:83)
	at com.fasterxml.jackson.databind.deser.AbstractDeserializer.deserializeWithType(AbstractDeserializer.java:132)
	at com.fasterxml.jackson.databind.deser.impl.TypeWrappedDeserializer.deserialize(TypeWrappedDeserializer.java:41)
	at com.fasterxml.jackson.databind.ObjectMapper._readValue(ObjectMapper.java:3038)
	at com.fasterxml.jackson.databind.ObjectMapper.readValue(ObjectMapper.java:1652)
	at com.fasterxml.jackson.core.JsonParser.readValueAs(JsonParser.java:1346)
	at com.addthis.codec.jackson.CodecJackson.decodeObject(CodecJackson.java:116)
	at com.addthis.codec.jackson.CodecJackson.decodeObject(CodecJackson.java:205)
	at com.addthis.codec.config.Configs.decodeObject(Configs.java:118)
	at com.addthis.codec.config.FeatureTest.primaryArray(FeatureTest.java:104)

aliasInheritance(com.addthis.codec.config.FeatureTest)  Time elapsed: 0.003 sec  <<< FAILURE!
org.junit.ComparisonFailure: expected:<Hello World[ even simpler]> but was:<Hello World[! What a pleasant default suffix we are having!]>
	at org.junit.Assert.assertEquals(Assert.java:115)
	at org.junit.Assert.assertEquals(Assert.java:144)
	at com.addthis.codec.config.FeatureTest.aliasInheritance(FeatureTest.java:139)

primaryNested(com.addthis.codec.config.FeatureTest)  Time elapsed: 0.001 sec  <<< FAILURE!
org.junit.ComparisonFailure: expected:<extra [extra! other Hello WorldWOW bytes: 2048 millis: 100]0> but was:<extra [WOW other Hello Worldnull bytes: 0 millis: ]0>
	at org.junit.Assert.assertEquals(Assert.java:115)
	at org.junit.Assert.assertEquals(Assert.java:144)
	at com.addthis.codec.config.FeatureTest.primaryNested(FeatureTest.java:122)

primary(com.addthis.codec.config.FeatureTest)  Time elapsed: 0.001 sec  <<< ERROR!
com.fasterxml.jackson.databind.JsonMappingException: Can not instantiate value of type [simple type, class com.addthis.codec.plugins.MultiGreet] from String value (' even simpler'); no single-String constructor/factory method
 at [Source: ConfigString(" even simpler"); line: 1, column: -1] (through reference chain: com.fasterxml.jackson.databind.type.SimpleType["multi-simple-primary"])
	at com.fasterxml.jackson.databind.JsonMappingException.from(JsonMappingException.java:148)
	at com.fasterxml.jackson.databind.DeserializationContext.mappingException(DeserializationContext.java:770)
	at com.fasterxml.jackson.databind.deser.ValueInstantiator._createFromStringFallbacks(ValueInstantiator.java:277)
	at com.fasterxml.jackson.databind.deser.std.StdValueInstantiator.createFromString(StdValueInstantiator.java:289)
	at com.fasterxml.jackson.databind.deser.BeanDeserializerBase.deserializeFromString(BeanDeserializerBase.java:1141)
	at com.fasterxml.jackson.databind.deser.BeanDeserializer._deserializeOther(BeanDeserializer.java:135)
	at com.fasterxml.jackson.databind.deser.BeanDeserializer.deserialize(BeanDeserializer.java:126)
	at com.addthis.codec.jackson.CodecBeanDeserializer.deserialize(CodecBeanDeserializer.java:82)
	at com.addthis.codec.jackson.CodecTypeDeserializer._deserializeObjectFromSingleKey(CodecTypeDeserializer.java:268)
	at com.addthis.codec.jackson.CodecTypeDeserializer._deserializeTypedFromObject(CodecTypeDeserializer.java:146)
	at com.addthis.codec.jackson.CodecTypeDeserializer.deserializeTypedFromAny(CodecTypeDeserializer.java:123)
	at com.addthis.codec.jackson.CodecTypeDeserializer.deserializeTypedFromObject(CodecTypeDeserializer.java:83)
	at com.fasterxml.jackson.databind.deser.AbstractDeserializer.deserializeWithType(AbstractDeserializer.java:132)
	at com.fasterxml.jackson.databind.deser.impl.TypeWrappedDeserializer.deserialize(TypeWrappedDeserializer.java:41)
	at com.fasterxml.jackson.databind.ObjectMapper._readValue(ObjectMapper.java:3038)
	at com.fasterxml.jackson.databind.ObjectMapper.readValue(ObjectMapper.java:1652)
	at com.fasterxml.jackson.core.JsonParser.readValueAs(JsonParser.java:1346)
	at com.addthis.codec.jackson.CodecJackson.decodeObject(CodecJackson.java:116)
	at com.addthis.codec.jackson.CodecJackson.decodeObject(CodecJackson.java:205)
	at com.addthis.codec.config.Configs.decodeObject(Configs.java:118)
	at com.addthis.codec.config.FeatureTest.primary(FeatureTest.java:96)

greetArray(com.addthis.codec.config.FeatureTest)  Time elapsed: 0.003 sec  <<< ERROR!
com.typesafe.config.ConfigException$Missing: No configuration setting found for key '"_primary"'
	at com.typesafe.config.impl.SimpleConfig.findKey(SimpleConfig.java:124)
	at com.typesafe.config.impl.SimpleConfig.find(SimpleConfig.java:145)
	at com.typesafe.config.impl.SimpleConfig.find(SimpleConfig.java:159)
	at com.typesafe.config.impl.SimpleConfig.find(SimpleConfig.java:164)
	at com.typesafe.config.impl.SimpleConfig.getString(SimpleConfig.java:206)
	at com.addthis.codec.jackson.CodecTypeDeserializer._deserializeTypedFromArray(CodecTypeDeserializer.java:320)
	at com.addthis.codec.jackson.CodecTypeDeserializer.deserializeTypedFromAny(CodecTypeDeserializer.java:120)
	at com.addthis.codec.jackson.CodecTypeDeserializer.deserializeTypedFromObject(CodecTypeDeserializer.java:83)
	at com.fasterxml.jackson.databind.deser.AbstractDeserializer.deserializeWithType(AbstractDeserializer.java:132)
	at com.fasterxml.jackson.databind.deser.impl.TypeWrappedDeserializer.deserialize(TypeWrappedDeserializer.java:41)
	at com.fasterxml.jackson.databind.ObjectMapper._readValue(ObjectMapper.java:3038)
	at com.fasterxml.jackson.databind.ObjectMapper.readValue(ObjectMapper.java:1652)
	at com.fasterxml.jackson.core.JsonParser.readValueAs(JsonParser.java:1346)
	at com.addthis.codec.jackson.CodecJackson.decodeObject(CodecJackson.java:116)
	at com.addthis.codec.jackson.CodecJackson.decodeObject(CodecJackson.java:205)
	at com.addthis.codec.config.Configs.decodeObject(Configs.java:118)
	at com.addthis.codec.config.FeatureTest.greetArray(FeatureTest.java:63)

alias(com.addthis.codec.config.FeatureTest)  Time elapsed: 0.001 sec  <<< FAILURE!
org.junit.ComparisonFailure: expected:<Hello World[ even simpler]> but was:<Hello World[! What a pleasant default suffix we are having!]>
	at org.junit.Assert.assertEquals(Assert.java:115)
	at org.junit.Assert.assertEquals(Assert.java:144)
	at com.addthis.codec.config.FeatureTest.alias(FeatureTest.java:90)

greetDefault(com.addthis.codec.config.FeatureTest)  Time elapsed: 0.001 sec  <<< FAILURE!
org.junit.ComparisonFailure: expected:<...t a pleasant default[-alias] suffix we are havin...> but was:<...t a pleasant default[] suffix we are havin...>
	at org.junit.Assert.assertEquals(Assert.java:115)
	at org.junit.Assert.assertEquals(Assert.java:144)
	at com.addthis.codec.config.FeatureTest.greetDefault(FeatureTest.java:45)

arraySingle(com.addthis.codec.config.FeatureTest)  Time elapsed: 0.002 sec  <<< ERROR!
java.lang.NullPointerException: null
	at com.addthis.codec.plugins.PluginMap.aliasDefaults(PluginMap.java:81)
	at com.addthis.codec.jackson.CodecTypeDeserializer._deserializeObjectFromSingleKey(CodecTypeDeserializer.java:239)
	at com.addthis.codec.jackson.CodecTypeDeserializer._deserializeTypedFromObject(CodecTypeDeserializer.java:146)
	at com.addthis.codec.jackson.CodecTypeDeserializer.deserializeTypedFromAny(CodecTypeDeserializer.java:123)
	at com.addthis.codec.jackson.CodecTypeDeserializer.deserializeTypedFromObject(CodecTypeDeserializer.java:83)
	at com.fasterxml.jackson.databind.deser.AbstractDeserializer.deserializeWithType(AbstractDeserializer.java:132)
	at com.fasterxml.jackson.databind.deser.impl.TypeWrappedDeserializer.deserialize(TypeWrappedDeserializer.java:41)
	at com.fasterxml.jackson.databind.ObjectMapper._readValue(ObjectMapper.java:3038)
	at com.fasterxml.jackson.databind.ObjectMapper.readValue(ObjectMapper.java:1652)
	at com.fasterxml.jackson.core.JsonParser.readValueAs(JsonParser.java:1346)
	at com.addthis.codec.jackson.CodecJackson.decodeObject(CodecJackson.java:116)
	at com.addthis.codec.jackson.CodecJackson.decodeObject(CodecJackson.java:205)
	at com.addthis.codec.config.Configs.decodeObject(Configs.java:118)
	at com.addthis.codec.config.FeatureTest.arraySingle(FeatureTest.java:145)

primaryNestedObject(com.addthis.codec.config.FeatureTest)  Time elapsed: 0.002 sec  <<< ERROR!
com.fasterxml.jackson.databind.JsonMappingException: Unrecognized field "simple" (class com.addthis.codec.plugins.ParseGreetSub), not marked as ignorable (4 known properties: "other", "extra", "bytes", "millis"])
 at [Source: SimpleConfigObject({"suffix":"WOW"}); line: 1, column: -1] (through reference chain: com.fasterxml.jackson.databind.type.SimpleType["parse-primary"]->com.addthis.codec.plugins.ParseGreetSub["simple"])
	at com.fasterxml.jackson.databind.exc.UnrecognizedPropertyException.from(UnrecognizedPropertyException.java:51)
	at com.fasterxml.jackson.databind.DeserializationContext.reportUnknownProperty(DeserializationContext.java:744)
	at com.fasterxml.jackson.databind.deser.std.StdDeserializer.handleUnknownProperty(StdDeserializer.java:915)
	at com.fasterxml.jackson.databind.deser.BeanDeserializerBase.handleUnknownProperty(BeanDeserializerBase.java:1306)
	at com.fasterxml.jackson.databind.deser.BeanDeserializerBase.handleUnknownVanilla(BeanDeserializerBase.java:1284)
	at com.fasterxml.jackson.databind.deser.BeanDeserializer.vanillaDeserialize(BeanDeserializer.java:243)
	at com.fasterxml.jackson.databind.deser.BeanDeserializer.deserialize(BeanDeserializer.java:118)
	at com.addthis.codec.jackson.CodecBeanDeserializer.deserialize(CodecBeanDeserializer.java:82)
	at com.addthis.codec.jackson.CodecTypeDeserializer._deserializeObjectFromSingleKey(CodecTypeDeserializer.java:268)
	at com.addthis.codec.jackson.CodecTypeDeserializer._deserializeTypedFromObject(CodecTypeDeserializer.java:146)
	at com.addthis.codec.jackson.CodecTypeDeserializer.deserializeTypedFromAny(CodecTypeDeserializer.java:123)
	at com.addthis.codec.jackson.CodecTypeDeserializer.deserializeTypedFromObject(CodecTypeDeserializer.java:83)
	at com.fasterxml.jackson.databind.deser.AbstractDeserializer.deserializeWithType(AbstractDeserializer.java:132)
	at com.fasterxml.jackson.databind.deser.impl.TypeWrappedDeserializer.deserialize(TypeWrappedDeserializer.java:41)
	at com.fasterxml.jackson.databind.ObjectMapper._readValue(ObjectMapper.java:3038)
	at com.fasterxml.jackson.databind.ObjectMapper.readValue(ObjectMapper.java:1652)
	at com.fasterxml.jackson.core.JsonParser.readValueAs(JsonParser.java:1346)
	at com.addthis.codec.jackson.CodecJackson.decodeObject(CodecJackson.java:116)
	at com.addthis.codec.jackson.CodecJackson.decodeObject(CodecJackson.java:205)
	at com.addthis.codec.config.Configs.decodeObject(Configs.java:118)
	at com.addthis.codec.config.FeatureTest.primaryNestedObject(FeatureTest.java:112)

expandDefault(com.addthis.codec.config.FeatureTest)  Time elapsed: 0.049 sec  <<< FAILURE!
org.junit.ComparisonFailure: expected:<...t a pleasant default[-alias] suffix we are havin...> but was:<...t a pleasant default[] suffix we are havin...>
	at org.junit.Assert.assertEquals(Assert.java:115)
	at org.junit.Assert.assertEquals(Assert.java:144)
	at com.addthis.codec.config.FeatureTest.expandDefault(FeatureTest.java:56)

Running com.addthis.codec.CodecTest
Tests run: 6, Failures: 0, Errors: 0, Skipped: 0, Time elapsed: 0.001 sec - in com.addthis.codec.CodecTest
Running com.addthis.codec.CodecJsonBasicTest
Tests run: 5, Failures: 0, Errors: 5, Skipped: 0, Time elapsed: 0.136 sec <<< FAILURE! - in com.addthis.codec.CodecJsonBasicTest
upgradesDowngrades(com.addthis.codec.CodecJsonBasicTest)  Time elapsed: 0.119 sec  <<< ERROR!
com.fasterxml.jackson.databind.JsonMappingException: (was java.lang.NullPointerException)
 at [Source: [B@a97b8a3; line: 1, column: 136] (through reference chain: com.addthis.codec.letters.CC["obj_A_h"]->com.addthis.codec.letters.A["obj_B_b"])
	at com.addthis.codec.jackson.Jackson.maybeImproveLocation(Jackson.java:237)
	at com.addthis.codec.jackson.CodecBeanDeserializer.deserialize(CodecBeanDeserializer.java:88)
	at com.fasterxml.jackson.databind.deser.SettableBeanProperty.deserialize(SettableBeanProperty.java:538)
	at com.fasterxml.jackson.databind.deser.impl.FieldProperty.deserializeAndSet(FieldProperty.java:106)
	at com.fasterxml.jackson.databind.deser.BeanDeserializer.deserialize(BeanDeserializer.java:205)
	at com.fasterxml.jackson.databind.deser.std.DelegatingDeserializer.deserialize(DelegatingDeserializer.java:115)
	at com.fasterxml.jackson.databind.deser.impl.TypeWrappedDeserializer.deserialize(TypeWrappedDeserializer.java:61)
	at com.fasterxml.jackson.databind.ObjectReader._bindAndClose(ObjectReader.java:1271)
	at com.fasterxml.jackson.databind.ObjectReader.readValue(ObjectReader.java:912)
	at com.addthis.codec.json.CodecJSON.decode(CodecJSON.java:48)
	at com.addthis.codec.CodecBasicTests.setup(CodecBasicTests.java:88)
	at sun.reflect.NativeMethodAccessorImpl.invoke0(Native Method)
	at sun.reflect.NativeMethodAccessorImpl.invoke(NativeMethodAccessorImpl.java:57)
	at sun.reflect.DelegatingMethodAccessorImpl.invoke(DelegatingMethodAccessorImpl.java:43)
	at java.lang.reflect.Method.invoke(Method.java:606)
	at org.junit.runners.model.FrameworkMethod$1.runReflectiveCall(FrameworkMethod.java:47)
	at org.junit.internal.runners.model.ReflectiveCallable.run(ReflectiveCallable.java:12)
	at org.junit.runners.model.FrameworkMethod.invokeExplosively(FrameworkMethod.java:44)
	at org.junit.internal.runners.statements.RunBefores.evaluate(RunBefores.java:24)
	at org.junit.runners.ParentRunner.runLeaf(ParentRunner.java:271)
	at org.junit.runners.BlockJUnit4ClassRunner.runChild(BlockJUnit4ClassRunner.java:70)
	at org.junit.runners.BlockJUnit4ClassRunner.runChild(BlockJUnit4ClassRunner.java:50)
	at org.junit.runners.ParentRunner$3.run(ParentRunner.java:238)
	at org.junit.runners.ParentRunner$1.schedule(ParentRunner.java:63)
	at org.junit.runners.ParentRunner.runChildren(ParentRunner.java:236)
	at org.junit.runners.ParentRunner.access$000(ParentRunner.java:53)
	at org.junit.runners.ParentRunner$2.evaluate(ParentRunner.java:229)
	at org.junit.runners.ParentRunner.run(ParentRunner.java:309)
	at org.apache.maven.surefire.junit4.JUnit4Provider.execute(JUnit4Provider.java:264)
	at org.apache.maven.surefire.junit4.JUnit4Provider.executeTestSet(JUnit4Provider.java:153)
	at org.apache.maven.surefire.junit4.JUnit4Provider.invoke(JUnit4Provider.java:124)
	at org.apache.maven.surefire.booter.ForkedBooter.invokeProviderInSameClassLoader(ForkedBooter.java:200)
	at org.apache.maven.surefire.booter.ForkedBooter.runSuitesInProcess(ForkedBooter.java:153)
	at org.apache.maven.surefire.booter.ForkedBooter.main(ForkedBooter.java:103)
Caused by: com.fasterxml.jackson.databind.JsonMappingException: (was java.lang.NullPointerException) (through reference chain: com.addthis.codec.letters.A["obj_B_b"])
	at com.fasterxml.jackson.databind.JsonMappingException.wrapWithPath(JsonMappingException.java:210)
	at com.fasterxml.jackson.databind.JsonMappingException.wrapWithPath(JsonMappingException.java:177)
	at com.fasterxml.jackson.databind.deser.BeanDeserializerBase.wrapAndThrow(BeanDeserializerBase.java:1428)
	at com.fasterxml.jackson.databind.deser.BeanDeserializer.vanillaDeserialize(BeanDeserializer.java:240)
	at com.fasterxml.jackson.databind.deser.BeanDeserializer.deserialize(BeanDeserializer.java:118)
	at com.addthis.codec.jackson.CodecBeanDeserializer.deserialize(CodecBeanDeserializer.java:82)
	at com.fasterxml.jackson.databind.deser.SettableBeanProperty.deserialize(SettableBeanProperty.java:538)
	at com.fasterxml.jackson.databind.deser.impl.FieldProperty.deserializeAndSet(FieldProperty.java:106)
	at com.fasterxml.jackson.databind.deser.BeanDeserializer.deserialize(BeanDeserializer.java:205)
	at com.fasterxml.jackson.databind.deser.std.DelegatingDeserializer.deserialize(DelegatingDeserializer.java:115)
	at com.fasterxml.jackson.databind.deser.impl.TypeWrappedDeserializer.deserialize(TypeWrappedDeserializer.java:61)
	at com.fasterxml.jackson.databind.ObjectReader._bindAndClose(ObjectReader.java:1271)
	at com.fasterxml.jackson.databind.ObjectReader.readValue(ObjectReader.java:912)
	at com.addthis.codec.json.CodecJSON.decode(CodecJSON.java:48)
	at com.addthis.codec.CodecBasicTests.setup(CodecBasicTests.java:88)
	at sun.reflect.NativeMethodAccessorImpl.invoke0(Native Method)
	at sun.reflect.NativeMethodAccessorImpl.invoke(NativeMethodAccessorImpl.java:57)
	at sun.reflect.DelegatingMethodAccessorImpl.invoke(DelegatingMethodAccessorImpl.java:43)
	at java.lang.reflect.Method.invoke(Method.java:606)
	at org.junit.runners.model.FrameworkMethod$1.runReflectiveCall(FrameworkMethod.java:47)
	at org.junit.internal.runners.model.ReflectiveCallable.run(ReflectiveCallable.java:12)
	at org.junit.runners.model.FrameworkMethod.invokeExplosively(FrameworkMethod.java:44)
	at org.junit.internal.runners.statements.RunBefores.evaluate(RunBefores.java:24)
	at org.junit.runners.ParentRunner.runLeaf(ParentRunner.java:271)
	at org.junit.runners.BlockJUnit4ClassRunner.runChild(BlockJUnit4ClassRunner.java:70)
	at org.junit.runners.BlockJUnit4ClassRunner.runChild(BlockJUnit4ClassRunner.java:50)
	at org.junit.runners.ParentRunner$3.run(ParentRunner.java:238)
	at org.junit.runners.ParentRunner$1.schedule(ParentRunner.java:63)
	at org.junit.runners.ParentRunner.runChildren(ParentRunner.java:236)
	at org.junit.runners.ParentRunner.access$000(ParentRunner.java:53)
	at org.junit.runners.ParentRunner$2.evaluate(ParentRunner.java:229)
	at org.junit.runners.ParentRunner.run(ParentRunner.java:309)
	at org.apache.maven.surefire.junit4.JUnit4Provider.execute(JUnit4Provider.java:264)
	at org.apache.maven.surefire.junit4.JUnit4Provider.executeTestSet(JUnit4Provider.java:153)
	at org.apache.maven.surefire.junit4.JUnit4Provider.invoke(JUnit4Provider.java:124)
	at org.apache.maven.surefire.booter.ForkedBooter.invokeProviderInSameClassLoader(ForkedBooter.java:200)
	at org.apache.maven.surefire.booter.ForkedBooter.runSuitesInProcess(ForkedBooter.java:153)
	at org.apache.maven.surefire.booter.ForkedBooter.main(ForkedBooter.java:103)
Caused by: java.lang.NullPointerException: null
	at com.addthis.codec.plugins.PluginMap.aliasDefaults(PluginMap.java:81)
	at com.addthis.codec.jackson.CodecTypeDeserializer._deserializeObjectFromProperty(CodecTypeDeserializer.java:294)
	at com.addthis.codec.jackson.CodecTypeDeserializer._deserializeTypedFromObject(CodecTypeDeserializer.java:142)
	at com.addthis.codec.jackson.CodecTypeDeserializer.deserializeTypedFromAny(CodecTypeDeserializer.java:123)
	at com.addthis.codec.jackson.CodecTypeDeserializer.deserializeTypedFromObject(CodecTypeDeserializer.java:83)
	at com.fasterxml.jackson.databind.deser.BeanDeserializerBase.deserializeWithType(BeanDeserializerBase.java:956)
	at com.fasterxml.jackson.databind.deser.std.DelegatingDeserializer.deserializeWithType(DelegatingDeserializer.java:123)
	at com.fasterxml.jackson.databind.deser.SettableBeanProperty.deserialize(SettableBeanProperty.java:536)
	at com.fasterxml.jackson.databind.deser.impl.FieldProperty.deserializeAndSet(FieldProperty.java:106)
	at com.fasterxml.jackson.databind.deser.BeanDeserializer.vanillaDeserialize(BeanDeserializer.java:238)
	at com.fasterxml.jackson.databind.deser.BeanDeserializer.deserialize(BeanDeserializer.java:118)
	at com.addthis.codec.jackson.CodecBeanDeserializer.deserialize(CodecBeanDeserializer.java:82)
	at com.fasterxml.jackson.databind.deser.SettableBeanProperty.deserialize(SettableBeanProperty.java:538)
	at com.fasterxml.jackson.databind.deser.impl.FieldProperty.deserializeAndSet(FieldProperty.java:106)
	at com.fasterxml.jackson.databind.deser.BeanDeserializer.deserialize(BeanDeserializer.java:205)
	at com.fasterxml.jackson.databind.deser.std.DelegatingDeserializer.deserialize(DelegatingDeserializer.java:115)
	at com.fasterxml.jackson.databind.deser.impl.TypeWrappedDeserializer.deserialize(TypeWrappedDeserializer.java:61)
	at com.fasterxml.jackson.databind.ObjectReader._bindAndClose(ObjectReader.java:1271)
	at com.fasterxml.jackson.databind.ObjectReader.readValue(ObjectReader.java:912)
	at com.addthis.codec.json.CodecJSON.decode(CodecJSON.java:48)
	at com.addthis.codec.CodecBasicTests.setup(CodecBasicTests.java:88)
	at sun.reflect.NativeMethodAccessorImpl.invoke0(Native Method)
	at sun.reflect.NativeMethodAccessorImpl.invoke(NativeMethodAccessorImpl.java:57)
	at sun.reflect.DelegatingMethodAccessorImpl.invoke(DelegatingMethodAccessorImpl.java:43)
	at java.lang.reflect.Method.invoke(Method.java:606)
	at org.junit.runners.model.FrameworkMethod$1.runReflectiveCall(FrameworkMethod.java:47)
	at org.junit.internal.runners.model.ReflectiveCallable.run(ReflectiveCallable.java:12)
	at org.junit.runners.model.FrameworkMethod.invokeExplosively(FrameworkMethod.java:44)
	at org.junit.internal.runners.statements.RunBefores.evaluate(RunBefores.java:24)
	at org.junit.runners.ParentRunner.runLeaf(ParentRunner.java:271)
	at org.junit.runners.BlockJUnit4ClassRunner.runChild(BlockJUnit4ClassRunner.java:70)
	at org.junit.runners.BlockJUnit4ClassRunner.runChild(BlockJUnit4ClassRunner.java:50)
	at org.junit.runners.ParentRunner$3.run(ParentRunner.java:238)
	at org.junit.runners.ParentRunner$1.schedule(ParentRunner.java:63)
	at org.junit.runners.ParentRunner.runChildren(ParentRunner.java:236)
	at org.junit.runners.ParentRunner.access$000(ParentRunner.java:53)
	at org.junit.runners.ParentRunner$2.evaluate(ParentRunner.java:229)
	at org.junit.runners.ParentRunner.run(ParentRunner.java:309)
	at org.apache.maven.surefire.junit4.JUnit4Provider.execute(JUnit4Provider.java:264)
	at org.apache.maven.surefire.junit4.JUnit4Provider.executeTestSet(JUnit4Provider.java:153)
	at org.apache.maven.surefire.junit4.JUnit4Provider.invoke(JUnit4Provider.java:124)
	at org.apache.maven.surefire.booter.ForkedBooter.invokeProviderInSameClassLoader(ForkedBooter.java:200)
	at org.apache.maven.surefire.booter.ForkedBooter.runSuitesInProcess(ForkedBooter.java:153)
	at org.apache.maven.surefire.booter.ForkedBooter.main(ForkedBooter.java:103)

encodeDecode(com.addthis.codec.CodecJsonBasicTest)  Time elapsed: 0.003 sec  <<< ERROR!
com.fasterxml.jackson.databind.JsonMappingException: (was java.lang.NullPointerException)
 at [Source: [B@6edadac3; line: 1, column: 136] (through reference chain: com.addthis.codec.letters.CC["obj_A_h"]->com.addthis.codec.letters.A["obj_B_b"])
	at com.addthis.codec.jackson.Jackson.maybeImproveLocation(Jackson.java:237)
	at com.addthis.codec.jackson.CodecBeanDeserializer.deserialize(CodecBeanDeserializer.java:88)
	at com.fasterxml.jackson.databind.deser.SettableBeanProperty.deserialize(SettableBeanProperty.java:538)
	at com.fasterxml.jackson.databind.deser.impl.FieldProperty.deserializeAndSet(FieldProperty.java:106)
	at com.fasterxml.jackson.databind.deser.BeanDeserializer.deserialize(BeanDeserializer.java:205)
	at com.fasterxml.jackson.databind.deser.std.DelegatingDeserializer.deserialize(DelegatingDeserializer.java:115)
	at com.fasterxml.jackson.databind.deser.impl.TypeWrappedDeserializer.deserialize(TypeWrappedDeserializer.java:61)
	at com.fasterxml.jackson.databind.ObjectReader._bindAndClose(ObjectReader.java:1271)
	at com.fasterxml.jackson.databind.ObjectReader.readValue(ObjectReader.java:912)
	at com.addthis.codec.json.CodecJSON.decode(CodecJSON.java:48)
	at com.addthis.codec.CodecBasicTests.setup(CodecBasicTests.java:88)
	at sun.reflect.NativeMethodAccessorImpl.invoke0(Native Method)
	at sun.reflect.NativeMethodAccessorImpl.invoke(NativeMethodAccessorImpl.java:57)
	at sun.reflect.DelegatingMethodAccessorImpl.invoke(DelegatingMethodAccessorImpl.java:43)
	at java.lang.reflect.Method.invoke(Method.java:606)
	at org.junit.runners.model.FrameworkMethod$1.runReflectiveCall(FrameworkMethod.java:47)
	at org.junit.internal.runners.model.ReflectiveCallable.run(ReflectiveCallable.java:12)
	at org.junit.runners.model.FrameworkMethod.invokeExplosively(FrameworkMethod.java:44)
	at org.junit.internal.runners.statements.RunBefores.evaluate(RunBefores.java:24)
	at org.junit.runners.ParentRunner.runLeaf(ParentRunner.java:271)
	at org.junit.runners.BlockJUnit4ClassRunner.runChild(BlockJUnit4ClassRunner.java:70)
	at org.junit.runners.BlockJUnit4ClassRunner.runChild(BlockJUnit4ClassRunner.java:50)
	at org.junit.runners.ParentRunner$3.run(ParentRunner.java:238)
	at org.junit.runners.ParentRunner$1.schedule(ParentRunner.java:63)
	at org.junit.runners.ParentRunner.runChildren(ParentRunner.java:236)
	at org.junit.runners.ParentRunner.access$000(ParentRunner.java:53)
	at org.junit.runners.ParentRunner$2.evaluate(ParentRunner.java:229)
	at org.junit.runners.ParentRunner.run(ParentRunner.java:309)
	at org.apache.maven.surefire.junit4.JUnit4Provider.execute(JUnit4Provider.java:264)
	at org.apache.maven.surefire.junit4.JUnit4Provider.executeTestSet(JUnit4Provider.java:153)
	at org.apache.maven.surefire.junit4.JUnit4Provider.invoke(JUnit4Provider.java:124)
	at org.apache.maven.surefire.booter.ForkedBooter.invokeProviderInSameClassLoader(ForkedBooter.java:200)
	at org.apache.maven.surefire.booter.ForkedBooter.runSuitesInProcess(ForkedBooter.java:153)
	at org.apache.maven.surefire.booter.ForkedBooter.main(ForkedBooter.java:103)
Caused by: com.fasterxml.jackson.databind.JsonMappingException: (was java.lang.NullPointerException) (through reference chain: com.addthis.codec.letters.A["obj_B_b"])
	at com.fasterxml.jackson.databind.JsonMappingException.wrapWithPath(JsonMappingException.java:210)
	at com.fasterxml.jackson.databind.JsonMappingException.wrapWithPath(JsonMappingException.java:177)
	at com.fasterxml.jackson.databind.deser.BeanDeserializerBase.wrapAndThrow(BeanDeserializerBase.java:1428)
	at com.fasterxml.jackson.databind.deser.BeanDeserializer.vanillaDeserialize(BeanDeserializer.java:240)
	at com.fasterxml.jackson.databind.deser.BeanDeserializer.deserialize(BeanDeserializer.java:118)
	at com.addthis.codec.jackson.CodecBeanDeserializer.deserialize(CodecBeanDeserializer.java:82)
	at com.fasterxml.jackson.databind.deser.SettableBeanProperty.deserialize(SettableBeanProperty.java:538)
	at com.fasterxml.jackson.databind.deser.impl.FieldProperty.deserializeAndSet(FieldProperty.java:106)
	at com.fasterxml.jackson.databind.deser.BeanDeserializer.deserialize(BeanDeserializer.java:205)
	at com.fasterxml.jackson.databind.deser.std.DelegatingDeserializer.deserialize(DelegatingDeserializer.java:115)
	at com.fasterxml.jackson.databind.deser.impl.TypeWrappedDeserializer.deserialize(TypeWrappedDeserializer.java:61)
	at com.fasterxml.jackson.databind.ObjectReader._bindAndClose(ObjectReader.java:1271)
	at com.fasterxml.jackson.databind.ObjectReader.readValue(ObjectReader.java:912)
	at com.addthis.codec.json.CodecJSON.decode(CodecJSON.java:48)
	at com.addthis.codec.CodecBasicTests.setup(CodecBasicTests.java:88)
	at sun.reflect.NativeMethodAccessorImpl.invoke0(Native Method)
	at sun.reflect.NativeMethodAccessorImpl.invoke(NativeMethodAccessorImpl.java:57)
	at sun.reflect.DelegatingMethodAccessorImpl.invoke(DelegatingMethodAccessorImpl.java:43)
	at java.lang.reflect.Method.invoke(Method.java:606)
	at org.junit.runners.model.FrameworkMethod$1.runReflectiveCall(FrameworkMethod.java:47)
	at org.junit.internal.runners.model.ReflectiveCallable.run(ReflectiveCallable.java:12)
	at org.junit.runners.model.FrameworkMethod.invokeExplosively(FrameworkMethod.java:44)
	at org.junit.internal.runners.statements.RunBefores.evaluate(RunBefores.java:24)
	at org.junit.runners.ParentRunner.runLeaf(ParentRunner.java:271)
	at org.junit.runners.BlockJUnit4ClassRunner.runChild(BlockJUnit4ClassRunner.java:70)
	at org.junit.runners.BlockJUnit4ClassRunner.runChild(BlockJUnit4ClassRunner.java:50)
	at org.junit.runners.ParentRunner$3.run(ParentRunner.java:238)
	at org.junit.runners.ParentRunner$1.schedule(ParentRunner.java:63)
	at org.junit.runners.ParentRunner.runChildren(ParentRunner.java:236)
	at org.junit.runners.ParentRunner.access$000(ParentRunner.java:53)
	at org.junit.runners.ParentRunner$2.evaluate(ParentRunner.java:229)
	at org.junit.runners.ParentRunner.run(ParentRunner.java:309)
	at org.apache.maven.surefire.junit4.JUnit4Provider.execute(JUnit4Provider.java:264)
	at org.apache.maven.surefire.junit4.JUnit4Provider.executeTestSet(JUnit4Provider.java:153)
	at org.apache.maven.surefire.junit4.JUnit4Provider.invoke(JUnit4Provider.java:124)
	at org.apache.maven.surefire.booter.ForkedBooter.invokeProviderInSameClassLoader(ForkedBooter.java:200)
	at org.apache.maven.surefire.booter.ForkedBooter.runSuitesInProcess(ForkedBooter.java:153)
	at org.apache.maven.surefire.booter.ForkedBooter.main(ForkedBooter.java:103)
Caused by: java.lang.NullPointerException: null
	at com.addthis.codec.plugins.PluginMap.aliasDefaults(PluginMap.java:81)
	at com.addthis.codec.jackson.CodecTypeDeserializer._deserializeObjectFromProperty(CodecTypeDeserializer.java:294)
	at com.addthis.codec.jackson.CodecTypeDeserializer._deserializeTypedFromObject(CodecTypeDeserializer.java:142)
	at com.addthis.codec.jackson.CodecTypeDeserializer.deserializeTypedFromAny(CodecTypeDeserializer.java:123)
	at com.addthis.codec.jackson.CodecTypeDeserializer.deserializeTypedFromObject(CodecTypeDeserializer.java:83)
	at com.fasterxml.jackson.databind.deser.BeanDeserializerBase.deserializeWithType(BeanDeserializerBase.java:956)
	at com.fasterxml.jackson.databind.deser.std.DelegatingDeserializer.deserializeWithType(DelegatingDeserializer.java:123)
	at com.fasterxml.jackson.databind.deser.SettableBeanProperty.deserialize(SettableBeanProperty.java:536)
	at com.fasterxml.jackson.databind.deser.impl.FieldProperty.deserializeAndSet(FieldProperty.java:106)
	at com.fasterxml.jackson.databind.deser.BeanDeserializer.vanillaDeserialize(BeanDeserializer.java:238)
	at com.fasterxml.jackson.databind.deser.BeanDeserializer.deserialize(BeanDeserializer.java:118)
	at com.addthis.codec.jackson.CodecBeanDeserializer.deserialize(CodecBeanDeserializer.java:82)
	at com.fasterxml.jackson.databind.deser.SettableBeanProperty.deserialize(SettableBeanProperty.java:538)
	at com.fasterxml.jackson.databind.deser.impl.FieldProperty.deserializeAndSet(FieldProperty.java:106)
	at com.fasterxml.jackson.databind.deser.BeanDeserializer.deserialize(BeanDeserializer.java:205)
	at com.fasterxml.jackson.databind.deser.std.DelegatingDeserializer.deserialize(DelegatingDeserializer.java:115)
	at com.fasterxml.jackson.databind.deser.impl.TypeWrappedDeserializer.deserialize(TypeWrappedDeserializer.java:61)
	at com.fasterxml.jackson.databind.ObjectReader._bindAndClose(ObjectReader.java:1271)
	at com.fasterxml.jackson.databind.ObjectReader.readValue(ObjectReader.java:912)
	at com.addthis.codec.json.CodecJSON.decode(CodecJSON.java:48)
	at com.addthis.codec.CodecBasicTests.setup(CodecBasicTests.java:88)
	at sun.reflect.NativeMethodAccessorImpl.invoke0(Native Method)
	at sun.reflect.NativeMethodAccessorImpl.invoke(NativeMethodAccessorImpl.java:57)
	at sun.reflect.DelegatingMethodAccessorImpl.invoke(DelegatingMethodAccessorImpl.java:43)
	at java.lang.reflect.Method.invoke(Method.java:606)
	at org.junit.runners.model.FrameworkMethod$1.runReflectiveCall(FrameworkMethod.java:47)
	at org.junit.internal.runners.model.ReflectiveCallable.run(ReflectiveCallable.java:12)
	at org.junit.runners.model.FrameworkMethod.invokeExplosively(FrameworkMethod.java:44)
	at org.junit.internal.runners.statements.RunBefores.evaluate(RunBefores.java:24)
	at org.junit.runners.ParentRunner.runLeaf(ParentRunner.java:271)
	at org.junit.runners.BlockJUnit4ClassRunner.runChild(BlockJUnit4ClassRunner.java:70)
	at org.junit.runners.BlockJUnit4ClassRunner.runChild(BlockJUnit4ClassRunner.java:50)
	at org.junit.runners.ParentRunner$3.run(ParentRunner.java:238)
	at org.junit.runners.ParentRunner$1.schedule(ParentRunner.java:63)
	at org.junit.runners.ParentRunner.runChildren(ParentRunner.java:236)
	at org.junit.runners.ParentRunner.access$000(ParentRunner.java:53)
	at org.junit.runners.ParentRunner$2.evaluate(ParentRunner.java:229)
	at org.junit.runners.ParentRunner.run(ParentRunner.java:309)
	at org.apache.maven.surefire.junit4.JUnit4Provider.execute(JUnit4Provider.java:264)
	at org.apache.maven.surefire.junit4.JUnit4Provider.executeTestSet(JUnit4Provider.java:153)
	at org.apache.maven.surefire.junit4.JUnit4Provider.invoke(JUnit4Provider.java:124)
	at org.apache.maven.surefire.booter.ForkedBooter.invokeProviderInSameClassLoader(ForkedBooter.java:200)
	at org.apache.maven.surefire.booter.ForkedBooter.runSuitesInProcess(ForkedBooter.java:153)
	at org.apache.maven.surefire.booter.ForkedBooter.main(ForkedBooter.java:103)

codes(com.addthis.codec.CodecJsonBasicTest)  Time elapsed: 0.004 sec  <<< ERROR!
com.fasterxml.jackson.databind.JsonMappingException: (was java.lang.NullPointerException)
 at [Source: [B@62507110; line: 1, column: 136] (through reference chain: com.addthis.codec.letters.CC["obj_A_h"]->com.addthis.codec.letters.A["obj_B_b"])
	at com.addthis.codec.jackson.Jackson.maybeImproveLocation(Jackson.java:237)
	at com.addthis.codec.jackson.CodecBeanDeserializer.deserialize(CodecBeanDeserializer.java:88)
	at com.fasterxml.jackson.databind.deser.SettableBeanProperty.deserialize(SettableBeanProperty.java:538)
	at com.fasterxml.jackson.databind.deser.impl.FieldProperty.deserializeAndSet(FieldProperty.java:106)
	at com.fasterxml.jackson.databind.deser.BeanDeserializer.deserialize(BeanDeserializer.java:205)
	at com.fasterxml.jackson.databind.deser.std.DelegatingDeserializer.deserialize(DelegatingDeserializer.java:115)
	at com.fasterxml.jackson.databind.deser.impl.TypeWrappedDeserializer.deserialize(TypeWrappedDeserializer.java:61)
	at com.fasterxml.jackson.databind.ObjectReader._bindAndClose(ObjectReader.java:1271)
	at com.fasterxml.jackson.databind.ObjectReader.readValue(ObjectReader.java:912)
	at com.addthis.codec.json.CodecJSON.decode(CodecJSON.java:48)
	at com.addthis.codec.CodecBasicTests.setup(CodecBasicTests.java:88)
	at sun.reflect.NativeMethodAccessorImpl.invoke0(Native Method)
	at sun.reflect.NativeMethodAccessorImpl.invoke(NativeMethodAccessorImpl.java:57)
	at sun.reflect.DelegatingMethodAccessorImpl.invoke(DelegatingMethodAccessorImpl.java:43)
	at java.lang.reflect.Method.invoke(Method.java:606)
	at org.junit.runners.model.FrameworkMethod$1.runReflectiveCall(FrameworkMethod.java:47)
	at org.junit.internal.runners.model.ReflectiveCallable.run(ReflectiveCallable.java:12)
	at org.junit.runners.model.FrameworkMethod.invokeExplosively(FrameworkMethod.java:44)
	at org.junit.internal.runners.statements.RunBefores.evaluate(RunBefores.java:24)
	at org.junit.runners.ParentRunner.runLeaf(ParentRunner.java:271)
	at org.junit.runners.BlockJUnit4ClassRunner.runChild(BlockJUnit4ClassRunner.java:70)
	at org.junit.runners.BlockJUnit4ClassRunner.runChild(BlockJUnit4ClassRunner.java:50)
	at org.junit.runners.ParentRunner$3.run(ParentRunner.java:238)
	at org.junit.runners.ParentRunner$1.schedule(ParentRunner.java:63)
	at org.junit.runners.ParentRunner.runChildren(ParentRunner.java:236)
	at org.junit.runners.ParentRunner.access$000(ParentRunner.java:53)
	at org.junit.runners.ParentRunner$2.evaluate(ParentRunner.java:229)
	at org.junit.runners.ParentRunner.run(ParentRunner.java:309)
	at org.apache.maven.surefire.junit4.JUnit4Provider.execute(JUnit4Provider.java:264)
	at org.apache.maven.surefire.junit4.JUnit4Provider.executeTestSet(JUnit4Provider.java:153)
	at org.apache.maven.surefire.junit4.JUnit4Provider.invoke(JUnit4Provider.java:124)
	at org.apache.maven.surefire.booter.ForkedBooter.invokeProviderInSameClassLoader(ForkedBooter.java:200)
	at org.apache.maven.surefire.booter.ForkedBooter.runSuitesInProcess(ForkedBooter.java:153)
	at org.apache.maven.surefire.booter.ForkedBooter.main(ForkedBooter.java:103)
Caused by: com.fasterxml.jackson.databind.JsonMappingException: (was java.lang.NullPointerException) (through reference chain: com.addthis.codec.letters.A["obj_B_b"])
	at com.fasterxml.jackson.databind.JsonMappingException.wrapWithPath(JsonMappingException.java:210)
	at com.fasterxml.jackson.databind.JsonMappingException.wrapWithPath(JsonMappingException.java:177)
	at com.fasterxml.jackson.databind.deser.BeanDeserializerBase.wrapAndThrow(BeanDeserializerBase.java:1428)
	at com.fasterxml.jackson.databind.deser.BeanDeserializer.vanillaDeserialize(BeanDeserializer.java:240)
	at com.fasterxml.jackson.databind.deser.BeanDeserializer.deserialize(BeanDeserializer.java:118)
	at com.addthis.codec.jackson.CodecBeanDeserializer.deserialize(CodecBeanDeserializer.java:82)
	at com.fasterxml.jackson.databind.deser.SettableBeanProperty.deserialize(SettableBeanProperty.java:538)
	at com.fasterxml.jackson.databind.deser.impl.FieldProperty.deserializeAndSet(FieldProperty.java:106)
	at com.fasterxml.jackson.databind.deser.BeanDeserializer.deserialize(BeanDeserializer.java:205)
	at com.fasterxml.jackson.databind.deser.std.DelegatingDeserializer.deserialize(DelegatingDeserializer.java:115)
	at com.fasterxml.jackson.databind.deser.impl.TypeWrappedDeserializer.deserialize(TypeWrappedDeserializer.java:61)
	at com.fasterxml.jackson.databind.ObjectReader._bindAndClose(ObjectReader.java:1271)
	at com.fasterxml.jackson.databind.ObjectReader.readValue(ObjectReader.java:912)
	at com.addthis.codec.json.CodecJSON.decode(CodecJSON.java:48)
	at com.addthis.codec.CodecBasicTests.setup(CodecBasicTests.java:88)
	at sun.reflect.NativeMethodAccessorImpl.invoke0(Native Method)
	at sun.reflect.NativeMethodAccessorImpl.invoke(NativeMethodAccessorImpl.java:57)
	at sun.reflect.DelegatingMethodAccessorImpl.invoke(DelegatingMethodAccessorImpl.java:43)
	at java.lang.reflect.Method.invoke(Method.java:606)
	at org.junit.runners.model.FrameworkMethod$1.runReflectiveCall(FrameworkMethod.java:47)
	at org.junit.internal.runners.model.ReflectiveCallable.run(ReflectiveCallable.java:12)
	at org.junit.runners.model.FrameworkMethod.invokeExplosively(FrameworkMethod.java:44)
	at org.junit.internal.runners.statements.RunBefores.evaluate(RunBefores.java:24)
	at org.junit.runners.ParentRunner.runLeaf(ParentRunner.java:271)
	at org.junit.runners.BlockJUnit4ClassRunner.runChild(BlockJUnit4ClassRunner.java:70)
	at org.junit.runners.BlockJUnit4ClassRunner.runChild(BlockJUnit4ClassRunner.java:50)
	at org.junit.runners.ParentRunner$3.run(ParentRunner.java:238)
	at org.junit.runners.ParentRunner$1.schedule(ParentRunner.java:63)
	at org.junit.runners.ParentRunner.runChildren(ParentRunner.java:236)
	at org.junit.runners.ParentRunner.access$000(ParentRunner.java:53)
	at org.junit.runners.ParentRunner$2.evaluate(ParentRunner.java:229)
	at org.junit.runners.ParentRunner.run(ParentRunner.java:309)
	at org.apache.maven.surefire.junit4.JUnit4Provider.execute(JUnit4Provider.java:264)
	at org.apache.maven.surefire.junit4.JUnit4Provider.executeTestSet(JUnit4Provider.java:153)
	at org.apache.maven.surefire.junit4.JUnit4Provider.invoke(JUnit4Provider.java:124)
	at org.apache.maven.surefire.booter.ForkedBooter.invokeProviderInSameClassLoader(ForkedBooter.java:200)
	at org.apache.maven.surefire.booter.ForkedBooter.runSuitesInProcess(ForkedBooter.java:153)
	at org.apache.maven.surefire.booter.ForkedBooter.main(ForkedBooter.java:103)
Caused by: java.lang.NullPointerException: null
	at com.addthis.codec.plugins.PluginMap.aliasDefaults(PluginMap.java:81)
	at com.addthis.codec.jackson.CodecTypeDeserializer._deserializeObjectFromProperty(CodecTypeDeserializer.java:294)
	at com.addthis.codec.jackson.CodecTypeDeserializer._deserializeTypedFromObject(CodecTypeDeserializer.java:142)
	at com.addthis.codec.jackson.CodecTypeDeserializer.deserializeTypedFromAny(CodecTypeDeserializer.java:123)
	at com.addthis.codec.jackson.CodecTypeDeserializer.deserializeTypedFromObject(CodecTypeDeserializer.java:83)
	at com.fasterxml.jackson.databind.deser.BeanDeserializerBase.deserializeWithType(BeanDeserializerBase.java:956)
	at com.fasterxml.jackson.databind.deser.std.DelegatingDeserializer.deserializeWithType(DelegatingDeserializer.java:123)
	at com.fasterxml.jackson.databind.deser.SettableBeanProperty.deserialize(SettableBeanProperty.java:536)
	at com.fasterxml.jackson.databind.deser.impl.FieldProperty.deserializeAndSet(FieldProperty.java:106)
	at com.fasterxml.jackson.databind.deser.BeanDeserializer.vanillaDeserialize(BeanDeserializer.java:238)
	at com.fasterxml.jackson.databind.deser.BeanDeserializer.deserialize(BeanDeserializer.java:118)
	at com.addthis.codec.jackson.CodecBeanDeserializer.deserialize(CodecBeanDeserializer.java:82)
	at com.fasterxml.jackson.databind.deser.SettableBeanProperty.deserialize(SettableBeanProperty.java:538)
	at com.fasterxml.jackson.databind.deser.impl.FieldProperty.deserializeAndSet(FieldProperty.java:106)
	at com.fasterxml.jackson.databind.deser.BeanDeserializer.deserialize(BeanDeserializer.java:205)
	at com.fasterxml.jackson.databind.deser.std.DelegatingDeserializer.deserialize(DelegatingDeserializer.java:115)
	at com.fasterxml.jackson.databind.deser.impl.TypeWrappedDeserializer.deserialize(TypeWrappedDeserializer.java:61)
	at com.fasterxml.jackson.databind.ObjectReader._bindAndClose(ObjectReader.java:1271)
	at com.fasterxml.jackson.databind.ObjectReader.readValue(ObjectReader.java:912)
	at com.addthis.codec.json.CodecJSON.decode(CodecJSON.java:48)
	at com.addthis.codec.CodecBasicTests.setup(CodecBasicTests.java:88)
	at sun.reflect.NativeMethodAccessorImpl.invoke0(Native Method)
	at sun.reflect.NativeMethodAccessorImpl.invoke(NativeMethodAccessorImpl.java:57)
	at sun.reflect.DelegatingMethodAccessorImpl.invoke(DelegatingMethodAccessorImpl.java:43)
	at java.lang.reflect.Method.invoke(Method.java:606)
	at org.junit.runners.model.FrameworkMethod$1.runReflectiveCall(FrameworkMethod.java:47)
	at org.junit.internal.runners.model.ReflectiveCallable.run(ReflectiveCallable.java:12)
	at org.junit.runners.model.FrameworkMethod.invokeExplosively(FrameworkMethod.java:44)
	at org.junit.internal.runners.statements.RunBefores.evaluate(RunBefores.java:24)
	at org.junit.runners.ParentRunner.runLeaf(ParentRunner.java:271)
	at org.junit.runners.BlockJUnit4ClassRunner.runChild(BlockJUnit4ClassRunner.java:70)
	at org.junit.runners.BlockJUnit4ClassRunner.runChild(BlockJUnit4ClassRunner.java:50)
	at org.junit.runners.ParentRunner$3.run(ParentRunner.java:238)
	at org.junit.runners.ParentRunner$1.schedule(ParentRunner.java:63)
	at org.junit.runners.ParentRunner.runChildren(ParentRunner.java:236)
	at org.junit.runners.ParentRunner.access$000(ParentRunner.java:53)
	at org.junit.runners.ParentRunner$2.evaluate(ParentRunner.java:229)
	at org.junit.runners.ParentRunner.run(ParentRunner.java:309)
	at org.apache.maven.surefire.junit4.JUnit4Provider.execute(JUnit4Provider.java:264)
	at org.apache.maven.surefire.junit4.JUnit4Provider.executeTestSet(JUnit4Provider.java:153)
	at org.apache.maven.surefire.junit4.JUnit4Provider.invoke(JUnit4Provider.java:124)
	at org.apache.maven.surefire.booter.ForkedBooter.invokeProviderInSameClassLoader(ForkedBooter.java:200)
	at org.apache.maven.surefire.booter.ForkedBooter.runSuitesInProcess(ForkedBooter.java:153)
	at org.apache.maven.surefire.booter.ForkedBooter.main(ForkedBooter.java:103)

subclasses(com.addthis.codec.CodecJsonBasicTest)  Time elapsed: 0.005 sec  <<< ERROR!
com.fasterxml.jackson.databind.JsonMappingException: (was java.lang.NullPointerException)
 at [Source: [B@f2f03dd; line: 1, column: 136] (through reference chain: com.addthis.codec.letters.CC["obj_A_h"]->com.addthis.codec.letters.A["obj_B_b"])
	at com.addthis.codec.jackson.Jackson.maybeImproveLocation(Jackson.java:237)
	at com.addthis.codec.jackson.CodecBeanDeserializer.deserialize(CodecBeanDeserializer.java:88)
	at com.fasterxml.jackson.databind.deser.SettableBeanProperty.deserialize(SettableBeanProperty.java:538)
	at com.fasterxml.jackson.databind.deser.impl.FieldProperty.deserializeAndSet(FieldProperty.java:106)
	at com.fasterxml.jackson.databind.deser.BeanDeserializer.deserialize(BeanDeserializer.java:205)
	at com.fasterxml.jackson.databind.deser.std.DelegatingDeserializer.deserialize(DelegatingDeserializer.java:115)
	at com.fasterxml.jackson.databind.deser.impl.TypeWrappedDeserializer.deserialize(TypeWrappedDeserializer.java:61)
	at com.fasterxml.jackson.databind.ObjectReader._bindAndClose(ObjectReader.java:1271)
	at com.fasterxml.jackson.databind.ObjectReader.readValue(ObjectReader.java:912)
	at com.addthis.codec.json.CodecJSON.decode(CodecJSON.java:48)
	at com.addthis.codec.CodecBasicTests.setup(CodecBasicTests.java:88)
	at sun.reflect.NativeMethodAccessorImpl.invoke0(Native Method)
	at sun.reflect.NativeMethodAccessorImpl.invoke(NativeMethodAccessorImpl.java:57)
	at sun.reflect.DelegatingMethodAccessorImpl.invoke(DelegatingMethodAccessorImpl.java:43)
	at java.lang.reflect.Method.invoke(Method.java:606)
	at org.junit.runners.model.FrameworkMethod$1.runReflectiveCall(FrameworkMethod.java:47)
	at org.junit.internal.runners.model.ReflectiveCallable.run(ReflectiveCallable.java:12)
	at org.junit.runners.model.FrameworkMethod.invokeExplosively(FrameworkMethod.java:44)
	at org.junit.internal.runners.statements.RunBefores.evaluate(RunBefores.java:24)
	at org.junit.runners.ParentRunner.runLeaf(ParentRunner.java:271)
	at org.junit.runners.BlockJUnit4ClassRunner.runChild(BlockJUnit4ClassRunner.java:70)
	at org.junit.runners.BlockJUnit4ClassRunner.runChild(BlockJUnit4ClassRunner.java:50)
	at org.junit.runners.ParentRunner$3.run(ParentRunner.java:238)
	at org.junit.runners.ParentRunner$1.schedule(ParentRunner.java:63)
	at org.junit.runners.ParentRunner.runChildren(ParentRunner.java:236)
	at org.junit.runners.ParentRunner.access$000(ParentRunner.java:53)
	at org.junit.runners.ParentRunner$2.evaluate(ParentRunner.java:229)
	at org.junit.runners.ParentRunner.run(ParentRunner.java:309)
	at org.apache.maven.surefire.junit4.JUnit4Provider.execute(JUnit4Provider.java:264)
	at org.apache.maven.surefire.junit4.JUnit4Provider.executeTestSet(JUnit4Provider.java:153)
	at org.apache.maven.surefire.junit4.JUnit4Provider.invoke(JUnit4Provider.java:124)
	at org.apache.maven.surefire.booter.ForkedBooter.invokeProviderInSameClassLoader(ForkedBooter.java:200)
	at org.apache.maven.surefire.booter.ForkedBooter.runSuitesInProcess(ForkedBooter.java:153)
	at org.apache.maven.surefire.booter.ForkedBooter.main(ForkedBooter.java:103)
Caused by: com.fasterxml.jackson.databind.JsonMappingException: (was java.lang.NullPointerException) (through reference chain: com.addthis.codec.letters.A["obj_B_b"])
	at com.fasterxml.jackson.databind.JsonMappingException.wrapWithPath(JsonMappingException.java:210)
	at com.fasterxml.jackson.databind.JsonMappingException.wrapWithPath(JsonMappingException.java:177)
	at com.fasterxml.jackson.databind.deser.BeanDeserializerBase.wrapAndThrow(BeanDeserializerBase.java:1428)
	at com.fasterxml.jackson.databind.deser.BeanDeserializer.vanillaDeserialize(BeanDeserializer.java:240)
	at com.fasterxml.jackson.databind.deser.BeanDeserializer.deserialize(BeanDeserializer.java:118)
	at com.addthis.codec.jackson.CodecBeanDeserializer.deserialize(CodecBeanDeserializer.java:82)
	at com.fasterxml.jackson.databind.deser.SettableBeanProperty.deserialize(SettableBeanProperty.java:538)
	at com.fasterxml.jackson.databind.deser.impl.FieldProperty.deserializeAndSet(FieldProperty.java:106)
	at com.fasterxml.jackson.databind.deser.BeanDeserializer.deserialize(BeanDeserializer.java:205)
	at com.fasterxml.jackson.databind.deser.std.DelegatingDeserializer.deserialize(DelegatingDeserializer.java:115)
	at com.fasterxml.jackson.databind.deser.impl.TypeWrappedDeserializer.deserialize(TypeWrappedDeserializer.java:61)
	at com.fasterxml.jackson.databind.ObjectReader._bindAndClose(ObjectReader.java:1271)
	at com.fasterxml.jackson.databind.ObjectReader.readValue(ObjectReader.java:912)
	at com.addthis.codec.json.CodecJSON.decode(CodecJSON.java:48)
	at com.addthis.codec.CodecBasicTests.setup(CodecBasicTests.java:88)
	at sun.reflect.NativeMethodAccessorImpl.invoke0(Native Method)
	at sun.reflect.NativeMethodAccessorImpl.invoke(NativeMethodAccessorImpl.java:57)
	at sun.reflect.DelegatingMethodAccessorImpl.invoke(DelegatingMethodAccessorImpl.java:43)
	at java.lang.reflect.Method.invoke(Method.java:606)
	at org.junit.runners.model.FrameworkMethod$1.runReflectiveCall(FrameworkMethod.java:47)
	at org.junit.internal.runners.model.ReflectiveCallable.run(ReflectiveCallable.java:12)
	at org.junit.runners.model.FrameworkMethod.invokeExplosively(FrameworkMethod.java:44)
	at org.junit.internal.runners.statements.RunBefores.evaluate(RunBefores.java:24)
	at org.junit.runners.ParentRunner.runLeaf(ParentRunner.java:271)
	at org.junit.runners.BlockJUnit4ClassRunner.runChild(BlockJUnit4ClassRunner.java:70)
	at org.junit.runners.BlockJUnit4ClassRunner.runChild(BlockJUnit4ClassRunner.java:50)
	at org.junit.runners.ParentRunner$3.run(ParentRunner.java:238)
	at org.junit.runners.ParentRunner$1.schedule(ParentRunner.java:63)
	at org.junit.runners.ParentRunner.runChildren(ParentRunner.java:236)
	at org.junit.runners.ParentRunner.access$000(ParentRunner.java:53)
	at org.junit.runners.ParentRunner$2.evaluate(ParentRunner.java:229)
	at org.junit.runners.ParentRunner.run(ParentRunner.java:309)
	at org.apache.maven.surefire.junit4.JUnit4Provider.execute(JUnit4Provider.java:264)
	at org.apache.maven.surefire.junit4.JUnit4Provider.executeTestSet(JUnit4Provider.java:153)
	at org.apache.maven.surefire.junit4.JUnit4Provider.invoke(JUnit4Provider.java:124)
	at org.apache.maven.surefire.booter.ForkedBooter.invokeProviderInSameClassLoader(ForkedBooter.java:200)
	at org.apache.maven.surefire.booter.ForkedBooter.runSuitesInProcess(ForkedBooter.java:153)
	at org.apache.maven.surefire.booter.ForkedBooter.main(ForkedBooter.java:103)
Caused by: java.lang.NullPointerException: null
	at com.addthis.codec.plugins.PluginMap.aliasDefaults(PluginMap.java:81)
	at com.addthis.codec.jackson.CodecTypeDeserializer._deserializeObjectFromProperty(CodecTypeDeserializer.java:294)
	at com.addthis.codec.jackson.CodecTypeDeserializer._deserializeTypedFromObject(CodecTypeDeserializer.java:142)
	at com.addthis.codec.jackson.CodecTypeDeserializer.deserializeTypedFromAny(CodecTypeDeserializer.java:123)
	at com.addthis.codec.jackson.CodecTypeDeserializer.deserializeTypedFromObject(CodecTypeDeserializer.java:83)
	at com.fasterxml.jackson.databind.deser.BeanDeserializerBase.deserializeWithType(BeanDeserializerBase.java:956)
	at com.fasterxml.jackson.databind.deser.std.DelegatingDeserializer.deserializeWithType(DelegatingDeserializer.java:123)
	at com.fasterxml.jackson.databind.deser.SettableBeanProperty.deserialize(SettableBeanProperty.java:536)
	at com.fasterxml.jackson.databind.deser.impl.FieldProperty.deserializeAndSet(FieldProperty.java:106)
	at com.fasterxml.jackson.databind.deser.BeanDeserializer.vanillaDeserialize(BeanDeserializer.java:238)
	at com.fasterxml.jackson.databind.deser.BeanDeserializer.deserialize(BeanDeserializer.java:118)
	at com.addthis.codec.jackson.CodecBeanDeserializer.deserialize(CodecBeanDeserializer.java:82)
	at com.fasterxml.jackson.databind.deser.SettableBeanProperty.deserialize(SettableBeanProperty.java:538)
	at com.fasterxml.jackson.databind.deser.impl.FieldProperty.deserializeAndSet(FieldProperty.java:106)
	at com.fasterxml.jackson.databind.deser.BeanDeserializer.deserialize(BeanDeserializer.java:205)
	at com.fasterxml.jackson.databind.deser.std.DelegatingDeserializer.deserialize(DelegatingDeserializer.java:115)
	at com.fasterxml.jackson.databind.deser.impl.TypeWrappedDeserializer.deserialize(TypeWrappedDeserializer.java:61)
	at com.fasterxml.jackson.databind.ObjectReader._bindAndClose(ObjectReader.java:1271)
	at com.fasterxml.jackson.databind.ObjectReader.readValue(ObjectReader.java:912)
	at com.addthis.codec.json.CodecJSON.decode(CodecJSON.java:48)
	at com.addthis.codec.CodecBasicTests.setup(CodecBasicTests.java:88)
	at sun.reflect.NativeMethodAccessorImpl.invoke0(Native Method)
	at sun.reflect.NativeMethodAccessorImpl.invoke(NativeMethodAccessorImpl.java:57)
	at sun.reflect.DelegatingMethodAccessorImpl.invoke(DelegatingMethodAccessorImpl.java:43)
	at java.lang.reflect.Method.invoke(Method.java:606)
	at org.junit.runners.model.FrameworkMethod$1.runReflectiveCall(FrameworkMethod.java:47)
	at org.junit.internal.runners.model.ReflectiveCallable.run(ReflectiveCallable.java:12)
	at org.junit.runners.model.FrameworkMethod.invokeExplosively(FrameworkMethod.java:44)
	at org.junit.internal.runners.statements.RunBefores.evaluate(RunBefores.java:24)
	at org.junit.runners.ParentRunner.runLeaf(ParentRunner.java:271)
	at org.junit.runners.BlockJUnit4ClassRunner.runChild(BlockJUnit4ClassRunner.java:70)
	at org.junit.runners.BlockJUnit4ClassRunner.runChild(BlockJUnit4ClassRunner.java:50)
	at org.junit.runners.ParentRunner$3.run(ParentRunner.java:238)
	at org.junit.runners.ParentRunner$1.schedule(ParentRunner.java:63)
	at org.junit.runners.ParentRunner.runChildren(ParentRunner.java:236)
	at org.junit.runners.ParentRunner.access$000(ParentRunner.java:53)
	at org.junit.runners.ParentRunner$2.evaluate(ParentRunner.java:229)
	at org.junit.runners.ParentRunner.run(ParentRunner.java:309)
	at org.apache.maven.surefire.junit4.JUnit4Provider.execute(JUnit4Provider.java:264)
	at org.apache.maven.surefire.junit4.JUnit4Provider.executeTestSet(JUnit4Provider.java:153)
	at org.apache.maven.surefire.junit4.JUnit4Provider.invoke(JUnit4Provider.java:124)
	at org.apache.maven.surefire.booter.ForkedBooter.invokeProviderInSameClassLoader(ForkedBooter.java:200)
	at org.apache.maven.surefire.booter.ForkedBooter.runSuitesInProcess(ForkedBooter.java:153)
	at org.apache.maven.surefire.booter.ForkedBooter.main(ForkedBooter.java:103)

requiredFields(com.addthis.codec.CodecJsonBasicTest)  Time elapsed: 0.003 sec  <<< ERROR!
com.fasterxml.jackson.databind.JsonMappingException: (was java.lang.NullPointerException)
 at [Source: [B@57a6a9f4; line: 1, column: 136] (through reference chain: com.addthis.codec.letters.CC["obj_A_h"]->com.addthis.codec.letters.A["obj_B_b"])
	at com.addthis.codec.jackson.Jackson.maybeImproveLocation(Jackson.java:237)
	at com.addthis.codec.jackson.CodecBeanDeserializer.deserialize(CodecBeanDeserializer.java:88)
	at com.fasterxml.jackson.databind.deser.SettableBeanProperty.deserialize(SettableBeanProperty.java:538)
	at com.fasterxml.jackson.databind.deser.impl.FieldProperty.deserializeAndSet(FieldProperty.java:106)
	at com.fasterxml.jackson.databind.deser.BeanDeserializer.deserialize(BeanDeserializer.java:205)
	at com.fasterxml.jackson.databind.deser.std.DelegatingDeserializer.deserialize(DelegatingDeserializer.java:115)
	at com.fasterxml.jackson.databind.deser.impl.TypeWrappedDeserializer.deserialize(TypeWrappedDeserializer.java:61)
	at com.fasterxml.jackson.databind.ObjectReader._bindAndClose(ObjectReader.java:1271)
	at com.fasterxml.jackson.databind.ObjectReader.readValue(ObjectReader.java:912)
	at com.addthis.codec.json.CodecJSON.decode(CodecJSON.java:48)
	at com.addthis.codec.CodecBasicTests.setup(CodecBasicTests.java:88)
	at sun.reflect.NativeMethodAccessorImpl.invoke0(Native Method)
	at sun.reflect.NativeMethodAccessorImpl.invoke(NativeMethodAccessorImpl.java:57)
	at sun.reflect.DelegatingMethodAccessorImpl.invoke(DelegatingMethodAccessorImpl.java:43)
	at java.lang.reflect.Method.invoke(Method.java:606)
	at org.junit.runners.model.FrameworkMethod$1.runReflectiveCall(FrameworkMethod.java:47)
	at org.junit.internal.runners.model.ReflectiveCallable.run(ReflectiveCallable.java:12)
	at org.junit.runners.model.FrameworkMethod.invokeExplosively(FrameworkMethod.java:44)
	at org.junit.internal.runners.statements.RunBefores.evaluate(RunBefores.java:24)
	at org.junit.runners.ParentRunner.runLeaf(ParentRunner.java:271)
	at org.junit.runners.BlockJUnit4ClassRunner.runChild(BlockJUnit4ClassRunner.java:70)
	at org.junit.runners.BlockJUnit4ClassRunner.runChild(BlockJUnit4ClassRunner.java:50)
	at org.junit.runners.ParentRunner$3.run(ParentRunner.java:238)
	at org.junit.runners.ParentRunner$1.schedule(ParentRunner.java:63)
	at org.junit.runners.ParentRunner.runChildren(ParentRunner.java:236)
	at org.junit.runners.ParentRunner.access$000(ParentRunner.java:53)
	at org.junit.runners.ParentRunner$2.evaluate(ParentRunner.java:229)
	at org.junit.runners.ParentRunner.run(ParentRunner.java:309)
	at org.apache.maven.surefire.junit4.JUnit4Provider.execute(JUnit4Provider.java:264)
	at org.apache.maven.surefire.junit4.JUnit4Provider.executeTestSet(JUnit4Provider.java:153)
	at org.apache.maven.surefire.junit4.JUnit4Provider.invoke(JUnit4Provider.java:124)
	at org.apache.maven.surefire.booter.ForkedBooter.invokeProviderInSameClassLoader(ForkedBooter.java:200)
	at org.apache.maven.surefire.booter.ForkedBooter.runSuitesInProcess(ForkedBooter.java:153)
	at org.apache.maven.surefire.booter.ForkedBooter.main(ForkedBooter.java:103)
Caused by: com.fasterxml.jackson.databind.JsonMappingException: (was java.lang.NullPointerException) (through reference chain: com.addthis.codec.letters.A["obj_B_b"])
	at com.fasterxml.jackson.databind.JsonMappingException.wrapWithPath(JsonMappingException.java:210)
	at com.fasterxml.jackson.databind.JsonMappingException.wrapWithPath(JsonMappingException.java:177)
	at com.fasterxml.jackson.databind.deser.BeanDeserializerBase.wrapAndThrow(BeanDeserializerBase.java:1428)
	at com.fasterxml.jackson.databind.deser.BeanDeserializer.vanillaDeserialize(BeanDeserializer.java:240)
	at com.fasterxml.jackson.databind.deser.BeanDeserializer.deserialize(BeanDeserializer.java:118)
	at com.addthis.codec.jackson.CodecBeanDeserializer.deserialize(CodecBeanDeserializer.java:82)
	at com.fasterxml.jackson.databind.deser.SettableBeanProperty.deserialize(SettableBeanProperty.java:538)
	at com.fasterxml.jackson.databind.deser.impl.FieldProperty.deserializeAndSet(FieldProperty.java:106)
	at com.fasterxml.jackson.databind.deser.BeanDeserializer.deserialize(BeanDeserializer.java:205)
	at com.fasterxml.jackson.databind.deser.std.DelegatingDeserializer.deserialize(DelegatingDeserializer.java:115)
	at com.fasterxml.jackson.databind.deser.impl.TypeWrappedDeserializer.deserialize(TypeWrappedDeserializer.java:61)
	at com.fasterxml.jackson.databind.ObjectReader._bindAndClose(ObjectReader.java:1271)
	at com.fasterxml.jackson.databind.ObjectReader.readValue(ObjectReader.java:912)
	at com.addthis.codec.json.CodecJSON.decode(CodecJSON.java:48)
	at com.addthis.codec.CodecBasicTests.setup(CodecBasicTests.java:88)
	at sun.reflect.NativeMethodAccessorImpl.invoke0(Native Method)
	at sun.reflect.NativeMethodAccessorImpl.invoke(NativeMethodAccessorImpl.java:57)
	at sun.reflect.DelegatingMethodAccessorImpl.invoke(DelegatingMethodAccessorImpl.java:43)
	at java.lang.reflect.Method.invoke(Method.java:606)
	at org.junit.runners.model.FrameworkMethod$1.runReflectiveCall(FrameworkMethod.java:47)
	at org.junit.internal.runners.model.ReflectiveCallable.run(ReflectiveCallable.java:12)
	at org.junit.runners.model.FrameworkMethod.invokeExplosively(FrameworkMethod.java:44)
	at org.junit.internal.runners.statements.RunBefores.evaluate(RunBefores.java:24)
	at org.junit.runners.ParentRunner.runLeaf(ParentRunner.java:271)
	at org.junit.runners.BlockJUnit4ClassRunner.runChild(BlockJUnit4ClassRunner.java:70)
	at org.junit.runners.BlockJUnit4ClassRunner.runChild(BlockJUnit4ClassRunner.java:50)
	at org.junit.runners.ParentRunner$3.run(ParentRunner.java:238)
	at org.junit.runners.ParentRunner$1.schedule(ParentRunner.java:63)
	at org.junit.runners.ParentRunner.runChildren(ParentRunner.java:236)
	at org.junit.runners.ParentRunner.access$000(ParentRunner.java:53)
	at org.junit.runners.ParentRunner$2.evaluate(ParentRunner.java:229)
	at org.junit.runners.ParentRunner.run(ParentRunner.java:309)
	at org.apache.maven.surefire.junit4.JUnit4Provider.execute(JUnit4Provider.java:264)
	at org.apache.maven.surefire.junit4.JUnit4Provider.executeTestSet(JUnit4Provider.java:153)
	at org.apache.maven.surefire.junit4.JUnit4Provider.invoke(JUnit4Provider.java:124)
	at org.apache.maven.surefire.booter.ForkedBooter.invokeProviderInSameClassLoader(ForkedBooter.java:200)
	at org.apache.maven.surefire.booter.ForkedBooter.runSuitesInProcess(ForkedBooter.java:153)
	at org.apache.maven.surefire.booter.ForkedBooter.main(ForkedBooter.java:103)
Caused by: java.lang.NullPointerException: null
	at com.addthis.codec.plugins.PluginMap.aliasDefaults(PluginMap.java:81)
	at com.addthis.codec.jackson.CodecTypeDeserializer._deserializeObjectFromProperty(CodecTypeDeserializer.java:294)
	at com.addthis.codec.jackson.CodecTypeDeserializer._deserializeTypedFromObject(CodecTypeDeserializer.java:142)
	at com.addthis.codec.jackson.CodecTypeDeserializer.deserializeTypedFromAny(CodecTypeDeserializer.java:123)
	at com.addthis.codec.jackson.CodecTypeDeserializer.deserializeTypedFromObject(CodecTypeDeserializer.java:83)
	at com.fasterxml.jackson.databind.deser.BeanDeserializerBase.deserializeWithType(BeanDeserializerBase.java:956)
	at com.fasterxml.jackson.databind.deser.std.DelegatingDeserializer.deserializeWithType(DelegatingDeserializer.java:123)
	at com.fasterxml.jackson.databind.deser.SettableBeanProperty.deserialize(SettableBeanProperty.java:536)
	at com.fasterxml.jackson.databind.deser.impl.FieldProperty.deserializeAndSet(FieldProperty.java:106)
	at com.fasterxml.jackson.databind.deser.BeanDeserializer.vanillaDeserialize(BeanDeserializer.java:238)
	at com.fasterxml.jackson.databind.deser.BeanDeserializer.deserialize(BeanDeserializer.java:118)
	at com.addthis.codec.jackson.CodecBeanDeserializer.deserialize(CodecBeanDeserializer.java:82)
	at com.fasterxml.jackson.databind.deser.SettableBeanProperty.deserialize(SettableBeanProperty.java:538)
	at com.fasterxml.jackson.databind.deser.impl.FieldProperty.deserializeAndSet(FieldProperty.java:106)
	at com.fasterxml.jackson.databind.deser.BeanDeserializer.deserialize(BeanDeserializer.java:205)
	at com.fasterxml.jackson.databind.deser.std.DelegatingDeserializer.deserialize(DelegatingDeserializer.java:115)
	at com.fasterxml.jackson.databind.deser.impl.TypeWrappedDeserializer.deserialize(TypeWrappedDeserializer.java:61)
	at com.fasterxml.jackson.databind.ObjectReader._bindAndClose(ObjectReader.java:1271)
	at com.fasterxml.jackson.databind.ObjectReader.readValue(ObjectReader.java:912)
	at com.addthis.codec.json.CodecJSON.decode(CodecJSON.java:48)
	at com.addthis.codec.CodecBasicTests.setup(CodecBasicTests.java:88)
	at sun.reflect.NativeMethodAccessorImpl.invoke0(Native Method)
	at sun.reflect.NativeMethodAccessorImpl.invoke(NativeMethodAccessorImpl.java:57)
	at sun.reflect.DelegatingMethodAccessorImpl.invoke(DelegatingMethodAccessorImpl.java:43)
	at java.lang.reflect.Method.invoke(Method.java:606)
	at org.junit.runners.model.FrameworkMethod$1.runReflectiveCall(FrameworkMethod.java:47)
	at org.junit.internal.runners.model.ReflectiveCallable.run(ReflectiveCallable.java:12)
	at org.junit.runners.model.FrameworkMethod.invokeExplosively(FrameworkMethod.java:44)
	at org.junit.internal.runners.statements.RunBefores.evaluate(RunBefores.java:24)
	at org.junit.runners.ParentRunner.runLeaf(ParentRunner.java:271)
	at org.junit.runners.BlockJUnit4ClassRunner.runChild(BlockJUnit4ClassRunner.java:70)
	at org.junit.runners.BlockJUnit4ClassRunner.runChild(BlockJUnit4ClassRunner.java:50)
	at org.junit.runners.ParentRunner$3.run(ParentRunner.java:238)
	at org.junit.runners.ParentRunner$1.schedule(ParentRunner.java:63)
	at org.junit.runners.ParentRunner.runChildren(ParentRunner.java:236)
	at org.junit.runners.ParentRunner.access$000(ParentRunner.java:53)
	at org.junit.runners.ParentRunner$2.evaluate(ParentRunner.java:229)
	at org.junit.runners.ParentRunner.run(ParentRunner.java:309)
	at org.apache.maven.surefire.junit4.JUnit4Provider.execute(JUnit4Provider.java:264)
	at org.apache.maven.surefire.junit4.JUnit4Provider.executeTestSet(JUnit4Provider.java:153)
	at org.apache.maven.surefire.junit4.JUnit4Provider.invoke(JUnit4Provider.java:124)
	at org.apache.maven.surefire.booter.ForkedBooter.invokeProviderInSameClassLoader(ForkedBooter.java:200)
	at org.apache.maven.surefire.booter.ForkedBooter.runSuitesInProcess(ForkedBooter.java:153)
	at org.apache.maven.surefire.booter.ForkedBooter.main(ForkedBooter.java:103)

Running com.addthis.codec.CodecGenericsTest
Tests run: 1, Failures: 0, Errors: 0, Skipped: 0, Time elapsed: 0.016 sec - in com.addthis.codec.CodecGenericsTest
Running com.addthis.codec.CodecUtilTest
[main] INFO com.addthis.codec.CodecUtilTest - compareTest(abc,ab) sc(1) bc(1)
[main] INFO com.addthis.codec.CodecUtilTest - compareTest(abc,abc) sc(0) bc(0)
[main] INFO com.addthis.codec.CodecUtilTest - compareTest(abc,abcd) sc(-1) bc(-1)
[main] INFO com.addthis.codec.CodecUtilTest - compareTest(abc,def) sc(-3) bc(-3)
[main] INFO com.addthis.codec.CodecUtilTest - compareTest(def,abc) sc(3) bc(3)
[main] INFO com.addthis.codec.CodecUtilTest - compareTest(abcd,acbd) sc(-1) bc(-1)
Tests run: 1, Failures: 0, Errors: 0, Skipped: 0, Time elapsed: 0.003 sec - in com.addthis.codec.CodecUtilTest
Running com.addthis.codec.CodecBin2BasicTest
Tests run: 4, Failures: 0, Errors: 0, Skipped: 0, Time elapsed: 0.021 sec - in com.addthis.codec.CodecBin2BasicTest
Running com.addthis.codec.utils.ExecutorServiceBuilderTest
Tests run: 1, Failures: 0, Errors: 0, Skipped: 0, Time elapsed: 0.095 sec - in com.addthis.codec.utils.ExecutorServiceBuilderTest
Running com.addthis.codec.CodecObjectSubclassTest
[main] INFO com.addthis.codec.CodecObjectSubclassTest - en1[111] ->      ok1Bok1ok2Cok1ok2ok3Dok1ok2ok3ok4 ok1Bok1ok2Cok1ok2ok3
[main] INFO com.addthis.codec.CodecObjectSubclassTest - en2[111] ->      ok1Bok1ok2Cok1ok2ok3Dok1ok2ok3ok4 ok1Bok1ok2Cok1ok2ok3
[main] INFO com.addthis.codec.CodecObjectSubclassTest - CodecBin2 --> PASSED
[main] INFO com.addthis.codec.CodecObjectSubclassTest - en1[358] -> {"a":{"type":"A","field1":"ok1"},"b":{"type":"B","field1":"ok1","field2":"ok2"},"c":{"type":"C","field1":"ok1","field2":"ok2","field3":"ok3"},"d":{"type":"D","field1":"ok1","field2":"ok2","field3":"ok3","field4":"ok4","list4":[{"type":"A","field1":"ok1"},{"type":"B","field1":"ok1","field2":"ok2"},{"type":"C","field1":"ok1","field2":"ok2","field3":"ok3"}]}}
[main] INFO com.addthis.codec.CodecObjectSubclassTest - en2[358] -> {"a":{"type":"A","field1":"ok1"},"b":{"type":"B","field1":"ok1","field2":"ok2"},"c":{"type":"C","field1":"ok1","field2":"ok2","field3":"ok3"},"d":{"type":"D","field1":"ok1","field2":"ok2","field3":"ok3","field4":"ok4","list4":[{"type":"A","field1":"ok1"},{"type":"B","field1":"ok1","field2":"ok2"},{"type":"C","field1":"ok1","field2":"ok2","field3":"ok3"}]}}
[main] INFO com.addthis.codec.CodecObjectSubclassTest - CodecJSON --> PASSED
Tests run: 1, Failures: 0, Errors: 0, Skipped: 0, Time elapsed: 0.029 sec - in com.addthis.codec.CodecObjectSubclassTest
Running com.addthis.codec.plugins.PluginRegistryTest
Tests run: 7, Failures: 0, Errors: 0, Skipped: 0, Time elapsed: 0.036 sec - in com.addthis.codec.plugins.PluginRegistryTest

Results :

Failed tests: 
  FeatureTest.abstractDelegateEmpty:231 expected:<...t a pleasant default[-alias] suffix we are havin...> but was:<...t a pleasant default[] suffix we are havin...>
  FeatureTest.aliasInheritance:139 expected:<Hello World[ even simpler]> but was:<Hello World[! What a pleasant default suffix we are having!]>
  FeatureTest.primaryNested:122 expected:<extra [extra! other Hello WorldWOW bytes: 2048 millis: 100]0> but was:<extra [WOW other Hello Worldnull bytes: 0 millis: ]0>
  FeatureTest.alias:90 expected:<Hello World[ even simpler]> but was:<Hello World[! What a pleasant default suffix we are having!]>
  FeatureTest.greetDefault:45 expected:<...t a pleasant default[-alias] suffix we are havin...> but was:<...t a pleasant default[] suffix we are havin...>
  FeatureTest.expandDefault:56 expected:<...t a pleasant default[-alias] suffix we are havin...> but was:<...t a pleasant default[] suffix we are havin...>

Tests in error: 
  CodecJSONTest.arraySugar:87 » JsonMapping No configuration setting found for k...
  CodecJSONTest.typeSugar:79 » JsonMapping (was java.lang.NullPointerException)
...
  FeatureTest.inline:129 » NullPointer
  FeatureTest.primaryArray:104 » JsonMapping Can not deserialize instance of com...
  FeatureTest.primary:96 » JsonMapping Can not instantiate value of type [simple...
  FeatureTest.greetArray:63 » Missing No configuration setting found for key '"_...
  FeatureTest.arraySingle:145 » NullPointer
  FeatureTest.primaryNestedObject:112 » JsonMapping Unrecognized field "simple" ...
  CodecJsonBasicTest>CodecBasicTests.setup:88 » JsonMapping (was java.lang.NullP...
  CodecJsonBasicTest>CodecBasicTests.setup:88 » JsonMapping (was java.lang.NullP...
  CodecJsonBasicTest>CodecBasicTests.setup:88 » JsonMapping (was java.lang.NullP...
  CodecJsonBasicTest>CodecBasicTests.setup:88 » JsonMapping (was java.lang.NullP...
  CodecJsonBasicTest>CodecBasicTests.setup:88 » JsonMapping (was java.lang.NullP...

Tests run: 54, Failures: 6, Errors: 13, Skipped: 0

[INFO] ------------------------------------------------------------------------
[INFO] BUILD FAILURE
[INFO] ------------------------------------------------------------------------
[INFO] Total time: 9.282s
[INFO] Finished at: Sun Aug 02 02:15:04 BST 2015
[INFO] Final Memory: 17M/218M
[INFO] ------------------------------------------------------------------------
[ERROR] Failed to execute goal org.apache.maven.plugins:maven-surefire-plugin:2.17:test (default-test) on project codec: There are test failures.
[ERROR] 
[ERROR] Please refer to /home/perham/Study/LittleDarwin/Cases/codec-3.3.0/target/surefire-reports for the individual test results.
[ERROR] -> [Help 1]
[ERROR] 
[ERROR] To see the full stack trace of the errors, re-run Maven with the -e switch.
[ERROR] Re-run Maven using the -X switch to enable full debug logging.
[ERROR] 
[ERROR] For more information about the errors and possible solutions, please read the following articles:
[ERROR] [Help 1] http://cwiki.apache.org/confluence/display/MAVEN/MojoFailureException
