[INFO] Scanning for projects...
[INFO]                                                                         
[INFO] ------------------------------------------------------------------------
[INFO] Building Codec 3.3.0
[INFO] ------------------------------------------------------------------------
[INFO] 
[INFO] --- jacoco-maven-plugin:0.7.1.201405082137:prepare-agent (default) @ codec ---
[INFO] argLine set to -javaagent:/home/perham/.m2/repository/org/jacoco/org.jacoco.agent/0.7.1.201405082137/org.jacoco.agent-0.7.1.201405082137-runtime.jar=destfile=/home/perham/Study/LittleDarwin/Cases/codec-3.3.0/target/jacoco.exec
[INFO] 
[INFO] --- maven-resources-plugin:2.3:resources (default-resources) @ codec ---
[INFO] Using 'UTF-8' encoding to copy filtered resources.
[INFO] Copying 1 resource
[INFO] 
[INFO] --- maven-compiler-plugin:3.1:compile (default-compile) @ codec ---
[INFO] Changes detected - recompiling the module!
[INFO] Compiling 47 source files to /home/perham/Study/LittleDarwin/Cases/codec-3.3.0/target/classes
[WARNING] /home/perham/Study/LittleDarwin/Cases/codec-3.3.0/src/main/java/com/addthis/codec/jackson/CodecTypeIdResolver.java:[93,31] typeFromId(java.lang.String) in com.fasterxml.jackson.databind.jsontype.impl.TypeIdResolverBase has been deprecated
[WARNING] /home/perham/Study/LittleDarwin/Cases/codec-3.3.0/src/main/java/com/addthis/codec/binary/BufferIn.java:[35,28] readBytes(java.io.InputStream,int) in com.addthis.basis.util.Bytes has been deprecated
[WARNING] /home/perham/Study/LittleDarwin/Cases/codec-3.3.0/src/main/java/com/addthis/codec/binary/CodecBin2.java:[87,14] writeInt(int,java.io.OutputStream) in com.addthis.basis.util.Bytes has been deprecated
[WARNING] /home/perham/Study/LittleDarwin/Cases/codec-3.3.0/src/main/java/com/addthis/codec/binary/CodecBin2.java:[95,24] readInt(java.io.InputStream) in com.addthis.basis.util.Bytes has been deprecated
[WARNING] /home/perham/Study/LittleDarwin/Cases/codec-3.3.0/src/main/java/com/addthis/codec/binary/CodecBin2.java:[181,22] writeInt(int,java.io.OutputStream) in com.addthis.basis.util.Bytes has been deprecated
[WARNING] /home/perham/Study/LittleDarwin/Cases/codec-3.3.0/src/main/java/com/addthis/codec/binary/CodecBin2.java:[186,22] writeLong(long,java.io.OutputStream) in com.addthis.basis.util.Bytes has been deprecated
[WARNING] /home/perham/Study/LittleDarwin/Cases/codec-3.3.0/src/main/java/com/addthis/codec/binary/CodecBin2.java:[210,35] readInt(java.io.InputStream) in com.addthis.basis.util.Bytes has been deprecated
[WARNING] /home/perham/Study/LittleDarwin/Cases/codec-3.3.0/src/main/java/com/addthis/codec/binary/CodecBin2.java:[216,35] readLong(java.io.InputStream) in com.addthis.basis.util.Bytes has been deprecated
[WARNING] /home/perham/Study/LittleDarwin/Cases/codec-3.3.0/src/main/java/com/addthis/codec/binary/CodecBin2.java:[356,18] writeInt(int,java.io.OutputStream) in com.addthis.basis.util.Bytes has been deprecated
[WARNING] /home/perham/Study/LittleDarwin/Cases/codec-3.3.0/src/main/java/com/addthis/codec/binary/CodecBin2.java:[358,18] writeLong(long,java.io.OutputStream) in com.addthis.basis.util.Bytes has been deprecated
[WARNING] /home/perham/Study/LittleDarwin/Cases/codec-3.3.0/src/main/java/com/addthis/codec/binary/CodecBin2.java:[360,18] writeShort(short,java.io.OutputStream) in com.addthis.basis.util.Bytes has been deprecated
[WARNING] /home/perham/Study/LittleDarwin/Cases/codec-3.3.0/src/main/java/com/addthis/codec/binary/CodecBin2.java:[364,18] writeInt(int,java.io.OutputStream) in com.addthis.basis.util.Bytes has been deprecated
[WARNING] /home/perham/Study/LittleDarwin/Cases/codec-3.3.0/src/main/java/com/addthis/codec/binary/CodecBin2.java:[366,18] writeLong(long,java.io.OutputStream) in com.addthis.basis.util.Bytes has been deprecated
[WARNING] /home/perham/Study/LittleDarwin/Cases/codec-3.3.0/src/main/java/com/addthis/codec/binary/CodecBin2.java:[368,18] writeLong(long,java.io.OutputStream) in com.addthis.basis.util.Bytes has been deprecated
[WARNING] /home/perham/Study/LittleDarwin/Cases/codec-3.3.0/src/main/java/com/addthis/codec/binary/CodecBin2.java:[370,18] writeInt(int,java.io.OutputStream) in com.addthis.basis.util.Bytes has been deprecated
[WARNING] /home/perham/Study/LittleDarwin/Cases/codec-3.3.0/src/main/java/com/addthis/codec/binary/CodecBin2.java:[388,27] readInt(java.io.InputStream) in com.addthis.basis.util.Bytes has been deprecated
[WARNING] /home/perham/Study/LittleDarwin/Cases/codec-3.3.0/src/main/java/com/addthis/codec/binary/CodecBin2.java:[390,27] readLong(java.io.InputStream) in com.addthis.basis.util.Bytes has been deprecated
[WARNING] /home/perham/Study/LittleDarwin/Cases/codec-3.3.0/src/main/java/com/addthis/codec/binary/CodecBin2.java:[392,27] readShort(java.io.InputStream) in com.addthis.basis.util.Bytes has been deprecated
[WARNING] /home/perham/Study/LittleDarwin/Cases/codec-3.3.0/src/main/java/com/addthis/codec/binary/CodecBin2.java:[396,51] readLong(java.io.InputStream) in com.addthis.basis.util.Bytes has been deprecated
[WARNING] /home/perham/Study/LittleDarwin/Cases/codec-3.3.0/src/main/java/com/addthis/codec/binary/CodecBin2.java:[398,48] readInt(java.io.InputStream) in com.addthis.basis.util.Bytes has been deprecated
[WARNING] /home/perham/Study/LittleDarwin/Cases/codec-3.3.0/src/main/java/com/addthis/codec/binary/CodecBin2.java:[400,42] readLong(java.io.InputStream) in com.addthis.basis.util.Bytes has been deprecated
[WARNING] /home/perham/Study/LittleDarwin/Cases/codec-3.3.0/src/main/java/com/addthis/codec/binary/CodecBin2.java:[402,45] readInt(java.io.InputStream) in com.addthis.basis.util.Bytes has been deprecated
[WARNING] /home/perham/Study/LittleDarwin/Cases/codec-3.3.0/src/main/java/com/addthis/codec/binary/CodecBin2.java:[419,25] readCharString(java.io.InputStream) in com.addthis.basis.util.Bytes has been deprecated
[WARNING] /home/perham/Study/LittleDarwin/Cases/codec-3.3.0/src/main/java/com/addthis/codec/binary/CodecBin2.java:[421,25] readString(java.io.InputStream) in com.addthis.basis.util.Bytes has been deprecated
[WARNING] /home/perham/Study/LittleDarwin/Cases/codec-3.3.0/src/main/java/com/addthis/codec/binary/CodecBin2.java:[427,18] writeCharString(java.lang.String,java.io.OutputStream) in com.addthis.basis.util.Bytes has been deprecated
[WARNING] /home/perham/Study/LittleDarwin/Cases/codec-3.3.0/src/main/java/com/addthis/codec/binary/CodecBin2.java:[429,18] writeString(java.lang.String,java.io.OutputStream) in com.addthis.basis.util.Bytes has been deprecated
[WARNING] /home/perham/Study/LittleDarwin/Cases/codec-3.3.0/src/main/java/com/addthis/codec/jackson/CodecJackson.java: Some input files use unchecked or unsafe operations.
[WARNING] /home/perham/Study/LittleDarwin/Cases/codec-3.3.0/src/main/java/com/addthis/codec/jackson/CodecJackson.java: Recompile with -Xlint:unchecked for details.
[INFO] 
[INFO] --- maven-resources-plugin:2.3:testResources (default-testResources) @ codec ---
[INFO] Using 'UTF-8' encoding to copy filtered resources.
[INFO] Copying 10 resources
[INFO] 
[INFO] --- maven-compiler-plugin:3.1:testCompile (default-testCompile) @ codec ---
[INFO] Nothing to compile - all classes are up to date
[INFO] 
[INFO] --- maven-surefire-plugin:2.17:test (default-test) @ codec ---
[INFO] Surefire report directory: /home/perham/Study/LittleDarwin/Cases/codec-3.3.0/target/surefire-reports

-------------------------------------------------------
 T E S T S
-------------------------------------------------------
Running com.addthis.codec.jackson.WriteonlyPropertyIgnorerTest
Aug 02, 2015 2:02:25 AM org.hibernate.validator.internal.util.Version <clinit>
INFO: HV000001: Hibernate Validator 5.1.1.Final
Tests run: 1, Failures: 0, Errors: 0, Skipped: 0, Time elapsed: 3.159 sec - in com.addthis.codec.jackson.WriteonlyPropertyIgnorerTest
Running com.addthis.codec.CodecRWOnlyTest
{"read1":123,"read2":234,"write1":456,"write2":567}
r1:111,r2:222,w1:333,w2:444
Tests run: 1, Failures: 0, Errors: 0, Skipped: 0, Time elapsed: 0.01 sec - in com.addthis.codec.CodecRWOnlyTest
Running com.addthis.codec.json.CodecJSONTest
Tests run: 4, Failures: 0, Errors: 2, Skipped: 0, Time elapsed: 0.054 sec <<< FAILURE! - in com.addthis.codec.json.CodecJSONTest
arraySugar(com.addthis.codec.json.CodecJSONTest)  Time elapsed: 0.035 sec  <<< ERROR!
java.lang.NullPointerException: null
	at java.lang.Class.isAssignableFrom(Native Method)
	at com.addthis.codec.jackson.CodecTypeResolverBuilder.buildTypeDeserializer(CodecTypeResolverBuilder.java:30)
	at com.addthis.codec.jackson.CodecTypeResolverBuilder.buildTypeDeserializer(CodecTypeResolverBuilder.java:19)
	at com.fasterxml.jackson.databind.deser.BasicDeserializerFactory.findTypeDeserializer(BasicDeserializerFactory.java:1240)
	at com.fasterxml.jackson.databind.deser.BasicDeserializerFactory.findPropertyTypeDeserializer(BasicDeserializerFactory.java:1355)
	at com.fasterxml.jackson.databind.deser.BasicDeserializerFactory.resolveType(BasicDeserializerFactory.java:1585)
	at com.fasterxml.jackson.databind.deser.BeanDeserializerFactory.constructSettableProperty(BeanDeserializerFactory.java:758)
	at com.fasterxml.jackson.databind.deser.BeanDeserializerFactory.addBeanProps(BeanDeserializerFactory.java:549)
	at com.fasterxml.jackson.databind.deser.BeanDeserializerFactory.buildBeanDeserializer(BeanDeserializerFactory.java:270)
	at com.fasterxml.jackson.databind.deser.BeanDeserializerFactory.createBeanDeserializer(BeanDeserializerFactory.java:168)
	at com.fasterxml.jackson.databind.deser.DeserializerCache._createDeserializer2(DeserializerCache.java:399)
	at com.fasterxml.jackson.databind.deser.DeserializerCache._createDeserializer(DeserializerCache.java:348)
	at com.fasterxml.jackson.databind.deser.DeserializerCache._createAndCache2(DeserializerCache.java:261)
	at com.fasterxml.jackson.databind.deser.DeserializerCache._createAndCacheValueDeserializer(DeserializerCache.java:241)
	at com.fasterxml.jackson.databind.deser.DeserializerCache.findValueDeserializer(DeserializerCache.java:142)
	at com.fasterxml.jackson.databind.DeserializationContext.findRootValueDeserializer(DeserializationContext.java:394)
	at com.fasterxml.jackson.databind.ObjectReader._prefetchRootDeserializer(ObjectReader.java:1404)
	at com.fasterxml.jackson.databind.ObjectReader.<init>(ObjectReader.java:186)
	at com.fasterxml.jackson.databind.ObjectMapper.readerForUpdating(ObjectMapper.java:2583)
	at com.addthis.codec.json.CodecJSON.decodeString(CodecJSON.java:86)
	at com.addthis.codec.json.CodecJSONTest.arraySugar(CodecJSONTest.java:87)

typeSugar(com.addthis.codec.json.CodecJSONTest)  Time elapsed: 0.002 sec  <<< ERROR!
java.lang.NullPointerException: null
	at java.lang.Class.isAssignableFrom(Native Method)
	at com.addthis.codec.jackson.CodecTypeResolverBuilder.buildTypeDeserializer(CodecTypeResolverBuilder.java:30)
	at com.addthis.codec.jackson.CodecTypeResolverBuilder.buildTypeDeserializer(CodecTypeResolverBuilder.java:19)
	at com.fasterxml.jackson.databind.deser.BasicDeserializerFactory.findTypeDeserializer(BasicDeserializerFactory.java:1240)
	at com.fasterxml.jackson.databind.deser.BasicDeserializerFactory.findPropertyTypeDeserializer(BasicDeserializerFactory.java:1355)
	at com.fasterxml.jackson.databind.deser.BasicDeserializerFactory.resolveType(BasicDeserializerFactory.java:1585)
	at com.fasterxml.jackson.databind.deser.BeanDeserializerFactory.constructSettableProperty(BeanDeserializerFactory.java:758)
	at com.fasterxml.jackson.databind.deser.BeanDeserializerFactory.addBeanProps(BeanDeserializerFactory.java:549)
	at com.fasterxml.jackson.databind.deser.BeanDeserializerFactory.buildBeanDeserializer(BeanDeserializerFactory.java:270)
	at com.fasterxml.jackson.databind.deser.BeanDeserializerFactory.createBeanDeserializer(BeanDeserializerFactory.java:168)
	at com.fasterxml.jackson.databind.deser.DeserializerCache._createDeserializer2(DeserializerCache.java:399)
	at com.fasterxml.jackson.databind.deser.DeserializerCache._createDeserializer(DeserializerCache.java:348)
	at com.fasterxml.jackson.databind.deser.DeserializerCache._createAndCache2(DeserializerCache.java:261)
	at com.fasterxml.jackson.databind.deser.DeserializerCache._createAndCacheValueDeserializer(DeserializerCache.java:241)
	at com.fasterxml.jackson.databind.deser.DeserializerCache.findValueDeserializer(DeserializerCache.java:142)
	at com.fasterxml.jackson.databind.DeserializationContext.findRootValueDeserializer(DeserializationContext.java:394)
	at com.fasterxml.jackson.databind.ObjectReader._prefetchRootDeserializer(ObjectReader.java:1404)
	at com.fasterxml.jackson.databind.ObjectReader.<init>(ObjectReader.java:186)
	at com.fasterxml.jackson.databind.ObjectMapper.reader(ObjectMapper.java:2593)
	at com.fasterxml.jackson.databind.ObjectMapper.reader(ObjectMapper.java:2603)
	at com.addthis.codec.json.CodecJSON.decodeString(CodecJSON.java:90)
	at com.addthis.codec.json.CodecJSONTest.typeSugar(CodecJSONTest.java:79)

Running com.addthis.codec.config.FeatureTest
[main] INFO com.addthis.codec.config.FeatureTest - unresolved {
    # config/defaultgreeter.conf: 1
    "greet" : {}
}

[main] INFO com.addthis.codec.config.FeatureTest - resolved {
    # plugins/greet-complex.conf: 38
    "_class" : "simple",
    # plugins/greet-complex.conf: 39
    "suffix" : "! What a pleasant default-alias suffix we are having!",
    # greet default type : plugins/greet-complex.conf: 37
    "type" : "simple"
}

Tests run: 22, Failures: 0, Errors: 0, Skipped: 0, Time elapsed: 0.261 sec - in com.addthis.codec.config.FeatureTest
Running com.addthis.codec.CodecTest
Tests run: 6, Failures: 0, Errors: 0, Skipped: 0, Time elapsed: 0.004 sec - in com.addthis.codec.CodecTest
Running com.addthis.codec.CodecJsonBasicTest
Tests run: 5, Failures: 0, Errors: 5, Skipped: 0, Time elapsed: 0.102 sec <<< FAILURE! - in com.addthis.codec.CodecJsonBasicTest
upgradesDowngrades(com.addthis.codec.CodecJsonBasicTest)  Time elapsed: 0.068 sec  <<< ERROR!
java.lang.NullPointerException: null
	at java.lang.Class.isAssignableFrom(Native Method)
	at com.addthis.codec.jackson.CodecTypeResolverBuilder.buildTypeDeserializer(CodecTypeResolverBuilder.java:30)
	at com.addthis.codec.jackson.CodecTypeResolverBuilder.buildTypeDeserializer(CodecTypeResolverBuilder.java:19)
	at com.fasterxml.jackson.databind.deser.BasicDeserializerFactory.findTypeDeserializer(BasicDeserializerFactory.java:1240)
	at com.fasterxml.jackson.databind.deser.BasicDeserializerFactory.findPropertyContentTypeDeserializer(BasicDeserializerFactory.java:1383)
	at com.fasterxml.jackson.databind.deser.BasicDeserializerFactory.resolveType(BasicDeserializerFactory.java:1575)
	at com.fasterxml.jackson.databind.deser.BeanDeserializerFactory.constructSettableProperty(BeanDeserializerFactory.java:758)
	at com.fasterxml.jackson.databind.deser.BeanDeserializerFactory.addBeanProps(BeanDeserializerFactory.java:549)
	at com.fasterxml.jackson.databind.deser.BeanDeserializerFactory.buildBeanDeserializer(BeanDeserializerFactory.java:270)
	at com.fasterxml.jackson.databind.deser.BeanDeserializerFactory.createBeanDeserializer(BeanDeserializerFactory.java:168)
	at com.fasterxml.jackson.databind.deser.DeserializerCache._createDeserializer2(DeserializerCache.java:399)
	at com.fasterxml.jackson.databind.deser.DeserializerCache._createDeserializer(DeserializerCache.java:348)
	at com.fasterxml.jackson.databind.deser.DeserializerCache._createAndCache2(DeserializerCache.java:261)
	at com.fasterxml.jackson.databind.deser.DeserializerCache._createAndCacheValueDeserializer(DeserializerCache.java:241)
	at com.fasterxml.jackson.databind.deser.DeserializerCache.findValueDeserializer(DeserializerCache.java:142)
	at com.fasterxml.jackson.databind.DeserializationContext.findRootValueDeserializer(DeserializationContext.java:394)
	at com.fasterxml.jackson.databind.ObjectReader._prefetchRootDeserializer(ObjectReader.java:1404)
	at com.fasterxml.jackson.databind.ObjectReader.<init>(ObjectReader.java:186)
	at com.fasterxml.jackson.databind.ObjectMapper.readerForUpdating(ObjectMapper.java:2583)
	at com.addthis.codec.json.CodecJSON.decode(CodecJSON.java:48)
	at com.addthis.codec.CodecBasicTests.setup(CodecBasicTests.java:88)
	at sun.reflect.NativeMethodAccessorImpl.invoke0(Native Method)
	at sun.reflect.NativeMethodAccessorImpl.invoke(NativeMethodAccessorImpl.java:57)
	at sun.reflect.DelegatingMethodAccessorImpl.invoke(DelegatingMethodAccessorImpl.java:43)
	at java.lang.reflect.Method.invoke(Method.java:606)
	at org.junit.runners.model.FrameworkMethod$1.runReflectiveCall(FrameworkMethod.java:47)
	at org.junit.internal.runners.model.ReflectiveCallable.run(ReflectiveCallable.java:12)
	at org.junit.runners.model.FrameworkMethod.invokeExplosively(FrameworkMethod.java:44)
	at org.junit.internal.runners.statements.RunBefores.evaluate(RunBefores.java:24)
	at org.junit.runners.ParentRunner.runLeaf(ParentRunner.java:271)
	at org.junit.runners.BlockJUnit4ClassRunner.runChild(BlockJUnit4ClassRunner.java:70)
	at org.junit.runners.BlockJUnit4ClassRunner.runChild(BlockJUnit4ClassRunner.java:50)
	at org.junit.runners.ParentRunner$3.run(ParentRunner.java:238)
	at org.junit.runners.ParentRunner$1.schedule(ParentRunner.java:63)
	at org.junit.runners.ParentRunner.runChildren(ParentRunner.java:236)
	at org.junit.runners.ParentRunner.access$000(ParentRunner.java:53)
	at org.junit.runners.ParentRunner$2.evaluate(ParentRunner.java:229)
	at org.junit.runners.ParentRunner.run(ParentRunner.java:309)
	at org.apache.maven.surefire.junit4.JUnit4Provider.execute(JUnit4Provider.java:264)
	at org.apache.maven.surefire.junit4.JUnit4Provider.executeTestSet(JUnit4Provider.java:153)
	at org.apache.maven.surefire.junit4.JUnit4Provider.invoke(JUnit4Provider.java:124)
	at org.apache.maven.surefire.booter.ForkedBooter.invokeProviderInSameClassLoader(ForkedBooter.java:200)
	at org.apache.maven.surefire.booter.ForkedBooter.runSuitesInProcess(ForkedBooter.java:153)
	at org.apache.maven.surefire.booter.ForkedBooter.main(ForkedBooter.java:103)

encodeDecode(com.addthis.codec.CodecJsonBasicTest)  Time elapsed: 0.007 sec  <<< ERROR!
java.lang.NullPointerException: null
	at java.lang.Class.isAssignableFrom(Native Method)
	at com.addthis.codec.jackson.CodecTypeResolverBuilder.buildTypeDeserializer(CodecTypeResolverBuilder.java:30)
	at com.addthis.codec.jackson.CodecTypeResolverBuilder.buildTypeDeserializer(CodecTypeResolverBuilder.java:19)
	at com.fasterxml.jackson.databind.deser.BasicDeserializerFactory.findTypeDeserializer(BasicDeserializerFactory.java:1240)
	at com.fasterxml.jackson.databind.deser.BasicDeserializerFactory.findPropertyContentTypeDeserializer(BasicDeserializerFactory.java:1383)
	at com.fasterxml.jackson.databind.deser.BasicDeserializerFactory.resolveType(BasicDeserializerFactory.java:1575)
	at com.fasterxml.jackson.databind.deser.BeanDeserializerFactory.constructSettableProperty(BeanDeserializerFactory.java:758)
	at com.fasterxml.jackson.databind.deser.BeanDeserializerFactory.addBeanProps(BeanDeserializerFactory.java:549)
	at com.fasterxml.jackson.databind.deser.BeanDeserializerFactory.buildBeanDeserializer(BeanDeserializerFactory.java:270)
	at com.fasterxml.jackson.databind.deser.BeanDeserializerFactory.createBeanDeserializer(BeanDeserializerFactory.java:168)
	at com.fasterxml.jackson.databind.deser.DeserializerCache._createDeserializer2(DeserializerCache.java:399)
	at com.fasterxml.jackson.databind.deser.DeserializerCache._createDeserializer(DeserializerCache.java:348)
	at com.fasterxml.jackson.databind.deser.DeserializerCache._createAndCache2(DeserializerCache.java:261)
	at com.fasterxml.jackson.databind.deser.DeserializerCache._createAndCacheValueDeserializer(DeserializerCache.java:241)
	at com.fasterxml.jackson.databind.deser.DeserializerCache.findValueDeserializer(DeserializerCache.java:142)
	at com.fasterxml.jackson.databind.DeserializationContext.findRootValueDeserializer(DeserializationContext.java:394)
	at com.fasterxml.jackson.databind.ObjectReader._prefetchRootDeserializer(ObjectReader.java:1404)
	at com.fasterxml.jackson.databind.ObjectReader.<init>(ObjectReader.java:186)
	at com.fasterxml.jackson.databind.ObjectMapper.readerForUpdating(ObjectMapper.java:2583)
	at com.addthis.codec.json.CodecJSON.decode(CodecJSON.java:48)
	at com.addthis.codec.CodecBasicTests.setup(CodecBasicTests.java:88)
	at sun.reflect.NativeMethodAccessorImpl.invoke0(Native Method)
	at sun.reflect.NativeMethodAccessorImpl.invoke(NativeMethodAccessorImpl.java:57)
	at sun.reflect.DelegatingMethodAccessorImpl.invoke(DelegatingMethodAccessorImpl.java:43)
	at java.lang.reflect.Method.invoke(Method.java:606)
	at org.junit.runners.model.FrameworkMethod$1.runReflectiveCall(FrameworkMethod.java:47)
	at org.junit.internal.runners.model.ReflectiveCallable.run(ReflectiveCallable.java:12)
	at org.junit.runners.model.FrameworkMethod.invokeExplosively(FrameworkMethod.java:44)
	at org.junit.internal.runners.statements.RunBefores.evaluate(RunBefores.java:24)
	at org.junit.runners.ParentRunner.runLeaf(ParentRunner.java:271)
	at org.junit.runners.BlockJUnit4ClassRunner.runChild(BlockJUnit4ClassRunner.java:70)
	at org.junit.runners.BlockJUnit4ClassRunner.runChild(BlockJUnit4ClassRunner.java:50)
	at org.junit.runners.ParentRunner$3.run(ParentRunner.java:238)
	at org.junit.runners.ParentRunner$1.schedule(ParentRunner.java:63)
	at org.junit.runners.ParentRunner.runChildren(ParentRunner.java:236)
	at org.junit.runners.ParentRunner.access$000(ParentRunner.java:53)
	at org.junit.runners.ParentRunner$2.evaluate(ParentRunner.java:229)
	at org.junit.runners.ParentRunner.run(ParentRunner.java:309)
	at org.apache.maven.surefire.junit4.JUnit4Provider.execute(JUnit4Provider.java:264)
	at org.apache.maven.surefire.junit4.JUnit4Provider.executeTestSet(JUnit4Provider.java:153)
	at org.apache.maven.surefire.junit4.JUnit4Provider.invoke(JUnit4Provider.java:124)
	at org.apache.maven.surefire.booter.ForkedBooter.invokeProviderInSameClassLoader(ForkedBooter.java:200)
	at org.apache.maven.surefire.booter.ForkedBooter.runSuitesInProcess(ForkedBooter.java:153)
	at org.apache.maven.surefire.booter.ForkedBooter.main(ForkedBooter.java:103)

codes(com.addthis.codec.CodecJsonBasicTest)  Time elapsed: 0.008 sec  <<< ERROR!
java.lang.NullPointerException: null
	at java.lang.Class.isAssignableFrom(Native Method)
	at com.addthis.codec.jackson.CodecTypeResolverBuilder.buildTypeDeserializer(CodecTypeResolverBuilder.java:30)
	at com.addthis.codec.jackson.CodecTypeResolverBuilder.buildTypeDeserializer(CodecTypeResolverBuilder.java:19)
	at com.fasterxml.jackson.databind.deser.BasicDeserializerFactory.findTypeDeserializer(BasicDeserializerFactory.java:1240)
	at com.fasterxml.jackson.databind.deser.BasicDeserializerFactory.findPropertyContentTypeDeserializer(BasicDeserializerFactory.java:1383)
	at com.fasterxml.jackson.databind.deser.BasicDeserializerFactory.resolveType(BasicDeserializerFactory.java:1575)
	at com.fasterxml.jackson.databind.deser.BeanDeserializerFactory.constructSettableProperty(BeanDeserializerFactory.java:758)
	at com.fasterxml.jackson.databind.deser.BeanDeserializerFactory.addBeanProps(BeanDeserializerFactory.java:549)
	at com.fasterxml.jackson.databind.deser.BeanDeserializerFactory.buildBeanDeserializer(BeanDeserializerFactory.java:270)
	at com.fasterxml.jackson.databind.deser.BeanDeserializerFactory.createBeanDeserializer(BeanDeserializerFactory.java:168)
	at com.fasterxml.jackson.databind.deser.DeserializerCache._createDeserializer2(DeserializerCache.java:399)
	at com.fasterxml.jackson.databind.deser.DeserializerCache._createDeserializer(DeserializerCache.java:348)
	at com.fasterxml.jackson.databind.deser.DeserializerCache._createAndCache2(DeserializerCache.java:261)
	at com.fasterxml.jackson.databind.deser.DeserializerCache._createAndCacheValueDeserializer(DeserializerCache.java:241)
	at com.fasterxml.jackson.databind.deser.DeserializerCache.findValueDeserializer(DeserializerCache.java:142)
	at com.fasterxml.jackson.databind.DeserializationContext.findRootValueDeserializer(DeserializationContext.java:394)
	at com.fasterxml.jackson.databind.ObjectReader._prefetchRootDeserializer(ObjectReader.java:1404)
	at com.fasterxml.jackson.databind.ObjectReader.<init>(ObjectReader.java:186)
	at com.fasterxml.jackson.databind.ObjectMapper.readerForUpdating(ObjectMapper.java:2583)
	at com.addthis.codec.json.CodecJSON.decode(CodecJSON.java:48)
	at com.addthis.codec.CodecBasicTests.setup(CodecBasicTests.java:88)
	at sun.reflect.NativeMethodAccessorImpl.invoke0(Native Method)
	at sun.reflect.NativeMethodAccessorImpl.invoke(NativeMethodAccessorImpl.java:57)
	at sun.reflect.DelegatingMethodAccessorImpl.invoke(DelegatingMethodAccessorImpl.java:43)
	at java.lang.reflect.Method.invoke(Method.java:606)
	at org.junit.runners.model.FrameworkMethod$1.runReflectiveCall(FrameworkMethod.java:47)
	at org.junit.internal.runners.model.ReflectiveCallable.run(ReflectiveCallable.java:12)
	at org.junit.runners.model.FrameworkMethod.invokeExplosively(FrameworkMethod.java:44)
	at org.junit.internal.runners.statements.RunBefores.evaluate(RunBefores.java:24)
	at org.junit.runners.ParentRunner.runLeaf(ParentRunner.java:271)
	at org.junit.runners.BlockJUnit4ClassRunner.runChild(BlockJUnit4ClassRunner.java:70)
	at org.junit.runners.BlockJUnit4ClassRunner.runChild(BlockJUnit4ClassRunner.java:50)
	at org.junit.runners.ParentRunner$3.run(ParentRunner.java:238)
	at org.junit.runners.ParentRunner$1.schedule(ParentRunner.java:63)
	at org.junit.runners.ParentRunner.runChildren(ParentRunner.java:236)
	at org.junit.runners.ParentRunner.access$000(ParentRunner.java:53)
	at org.junit.runners.ParentRunner$2.evaluate(ParentRunner.java:229)
	at org.junit.runners.ParentRunner.run(ParentRunner.java:309)
	at org.apache.maven.surefire.junit4.JUnit4Provider.execute(JUnit4Provider.java:264)
	at org.apache.maven.surefire.junit4.JUnit4Provider.executeTestSet(JUnit4Provider.java:153)
	at org.apache.maven.surefire.junit4.JUnit4Provider.invoke(JUnit4Provider.java:124)
	at org.apache.maven.surefire.booter.ForkedBooter.invokeProviderInSameClassLoader(ForkedBooter.java:200)
	at org.apache.maven.surefire.booter.ForkedBooter.runSuitesInProcess(ForkedBooter.java:153)
	at org.apache.maven.surefire.booter.ForkedBooter.main(ForkedBooter.java:103)

subclasses(com.addthis.codec.CodecJsonBasicTest)  Time elapsed: 0.007 sec  <<< ERROR!
java.lang.NullPointerException: null
	at java.lang.Class.isAssignableFrom(Native Method)
	at com.addthis.codec.jackson.CodecTypeResolverBuilder.buildTypeDeserializer(CodecTypeResolverBuilder.java:30)
	at com.addthis.codec.jackson.CodecTypeResolverBuilder.buildTypeDeserializer(CodecTypeResolverBuilder.java:19)
	at com.fasterxml.jackson.databind.deser.BasicDeserializerFactory.findTypeDeserializer(BasicDeserializerFactory.java:1240)
	at com.fasterxml.jackson.databind.deser.BasicDeserializerFactory.findPropertyContentTypeDeserializer(BasicDeserializerFactory.java:1383)
	at com.fasterxml.jackson.databind.deser.BasicDeserializerFactory.resolveType(BasicDeserializerFactory.java:1575)
	at com.fasterxml.jackson.databind.deser.BeanDeserializerFactory.constructSettableProperty(BeanDeserializerFactory.java:758)
	at com.fasterxml.jackson.databind.deser.BeanDeserializerFactory.addBeanProps(BeanDeserializerFactory.java:549)
	at com.fasterxml.jackson.databind.deser.BeanDeserializerFactory.buildBeanDeserializer(BeanDeserializerFactory.java:270)
	at com.fasterxml.jackson.databind.deser.BeanDeserializerFactory.createBeanDeserializer(BeanDeserializerFactory.java:168)
	at com.fasterxml.jackson.databind.deser.DeserializerCache._createDeserializer2(DeserializerCache.java:399)
	at com.fasterxml.jackson.databind.deser.DeserializerCache._createDeserializer(DeserializerCache.java:348)
	at com.fasterxml.jackson.databind.deser.DeserializerCache._createAndCache2(DeserializerCache.java:261)
	at com.fasterxml.jackson.databind.deser.DeserializerCache._createAndCacheValueDeserializer(DeserializerCache.java:241)
	at com.fasterxml.jackson.databind.deser.DeserializerCache.findValueDeserializer(DeserializerCache.java:142)
	at com.fasterxml.jackson.databind.DeserializationContext.findRootValueDeserializer(DeserializationContext.java:394)
	at com.fasterxml.jackson.databind.ObjectReader._prefetchRootDeserializer(ObjectReader.java:1404)
	at com.fasterxml.jackson.databind.ObjectReader.<init>(ObjectReader.java:186)
	at com.fasterxml.jackson.databind.ObjectMapper.readerForUpdating(ObjectMapper.java:2583)
	at com.addthis.codec.json.CodecJSON.decode(CodecJSON.java:48)
	at com.addthis.codec.CodecBasicTests.setup(CodecBasicTests.java:88)
	at sun.reflect.NativeMethodAccessorImpl.invoke0(Native Method)
	at sun.reflect.NativeMethodAccessorImpl.invoke(NativeMethodAccessorImpl.java:57)
	at sun.reflect.DelegatingMethodAccessorImpl.invoke(DelegatingMethodAccessorImpl.java:43)
	at java.lang.reflect.Method.invoke(Method.java:606)
	at org.junit.runners.model.FrameworkMethod$1.runReflectiveCall(FrameworkMethod.java:47)
	at org.junit.internal.runners.model.ReflectiveCallable.run(ReflectiveCallable.java:12)
	at org.junit.runners.model.FrameworkMethod.invokeExplosively(FrameworkMethod.java:44)
	at org.junit.internal.runners.statements.RunBefores.evaluate(RunBefores.java:24)
	at org.junit.runners.ParentRunner.runLeaf(ParentRunner.java:271)
	at org.junit.runners.BlockJUnit4ClassRunner.runChild(BlockJUnit4ClassRunner.java:70)
	at org.junit.runners.BlockJUnit4ClassRunner.runChild(BlockJUnit4ClassRunner.java:50)
	at org.junit.runners.ParentRunner$3.run(ParentRunner.java:238)
	at org.junit.runners.ParentRunner$1.schedule(ParentRunner.java:63)
	at org.junit.runners.ParentRunner.runChildren(ParentRunner.java:236)
	at org.junit.runners.ParentRunner.access$000(ParentRunner.java:53)
	at org.junit.runners.ParentRunner$2.evaluate(ParentRunner.java:229)
	at org.junit.runners.ParentRunner.run(ParentRunner.java:309)
	at org.apache.maven.surefire.junit4.JUnit4Provider.execute(JUnit4Provider.java:264)
	at org.apache.maven.surefire.junit4.JUnit4Provider.executeTestSet(JUnit4Provider.java:153)
	at org.apache.maven.surefire.junit4.JUnit4Provider.invoke(JUnit4Provider.java:124)
	at org.apache.maven.surefire.booter.ForkedBooter.invokeProviderInSameClassLoader(ForkedBooter.java:200)
	at org.apache.maven.surefire.booter.ForkedBooter.runSuitesInProcess(ForkedBooter.java:153)
	at org.apache.maven.surefire.booter.ForkedBooter.main(ForkedBooter.java:103)

requiredFields(com.addthis.codec.CodecJsonBasicTest)  Time elapsed: 0.007 sec  <<< ERROR!
java.lang.NullPointerException: null
	at java.lang.Class.isAssignableFrom(Native Method)
	at com.addthis.codec.jackson.CodecTypeResolverBuilder.buildTypeDeserializer(CodecTypeResolverBuilder.java:30)
	at com.addthis.codec.jackson.CodecTypeResolverBuilder.buildTypeDeserializer(CodecTypeResolverBuilder.java:19)
	at com.fasterxml.jackson.databind.deser.BasicDeserializerFactory.findTypeDeserializer(BasicDeserializerFactory.java:1240)
	at com.fasterxml.jackson.databind.deser.BasicDeserializerFactory.findPropertyContentTypeDeserializer(BasicDeserializerFactory.java:1383)
	at com.fasterxml.jackson.databind.deser.BasicDeserializerFactory.resolveType(BasicDeserializerFactory.java:1575)
	at com.fasterxml.jackson.databind.deser.BeanDeserializerFactory.constructSettableProperty(BeanDeserializerFactory.java:758)
	at com.fasterxml.jackson.databind.deser.BeanDeserializerFactory.addBeanProps(BeanDeserializerFactory.java:549)
	at com.fasterxml.jackson.databind.deser.BeanDeserializerFactory.buildBeanDeserializer(BeanDeserializerFactory.java:270)
	at com.fasterxml.jackson.databind.deser.BeanDeserializerFactory.createBeanDeserializer(BeanDeserializerFactory.java:168)
	at com.fasterxml.jackson.databind.deser.DeserializerCache._createDeserializer2(DeserializerCache.java:399)
	at com.fasterxml.jackson.databind.deser.DeserializerCache._createDeserializer(DeserializerCache.java:348)
	at com.fasterxml.jackson.databind.deser.DeserializerCache._createAndCache2(DeserializerCache.java:261)
	at com.fasterxml.jackson.databind.deser.DeserializerCache._createAndCacheValueDeserializer(DeserializerCache.java:241)
	at com.fasterxml.jackson.databind.deser.DeserializerCache.findValueDeserializer(DeserializerCache.java:142)
	at com.fasterxml.jackson.databind.DeserializationContext.findRootValueDeserializer(DeserializationContext.java:394)
	at com.fasterxml.jackson.databind.ObjectReader._prefetchRootDeserializer(ObjectReader.java:1404)
	at com.fasterxml.jackson.databind.ObjectReader.<init>(ObjectReader.java:186)
	at com.fasterxml.jackson.databind.ObjectMapper.readerForUpdating(ObjectMapper.java:2583)
	at com.addthis.codec.json.CodecJSON.decode(CodecJSON.java:48)
	at com.addthis.codec.CodecBasicTests.setup(CodecBasicTests.java:88)
	at sun.reflect.NativeMethodAccessorImpl.invoke0(Native Method)
	at sun.reflect.NativeMethodAccessorImpl.invoke(NativeMethodAccessorImpl.java:57)
	at sun.reflect.DelegatingMethodAccessorImpl.invoke(DelegatingMethodAccessorImpl.java:43)
	at java.lang.reflect.Method.invoke(Method.java:606)
	at org.junit.runners.model.FrameworkMethod$1.runReflectiveCall(FrameworkMethod.java:47)
	at org.junit.internal.runners.model.ReflectiveCallable.run(ReflectiveCallable.java:12)
	at org.junit.runners.model.FrameworkMethod.invokeExplosively(FrameworkMethod.java:44)
	at org.junit.internal.runners.statements.RunBefores.evaluate(RunBefores.java:24)
	at org.junit.runners.ParentRunner.runLeaf(ParentRunner.java:271)
	at org.junit.runners.BlockJUnit4ClassRunner.runChild(BlockJUnit4ClassRunner.java:70)
	at org.junit.runners.BlockJUnit4ClassRunner.runChild(BlockJUnit4ClassRunner.java:50)
	at org.junit.runners.ParentRunner$3.run(ParentRunner.java:238)
	at org.junit.runners.ParentRunner$1.schedule(ParentRunner.java:63)
	at org.junit.runners.ParentRunner.runChildren(ParentRunner.java:236)
	at org.junit.runners.ParentRunner.access$000(ParentRunner.java:53)
	at org.junit.runners.ParentRunner$2.evaluate(ParentRunner.java:229)
	at org.junit.runners.ParentRunner.run(ParentRunner.java:309)
	at org.apache.maven.surefire.junit4.JUnit4Provider.execute(JUnit4Provider.java:264)
	at org.apache.maven.surefire.junit4.JUnit4Provider.executeTestSet(JUnit4Provider.java:153)
	at org.apache.maven.surefire.junit4.JUnit4Provider.invoke(JUnit4Provider.java:124)
	at org.apache.maven.surefire.booter.ForkedBooter.invokeProviderInSameClassLoader(ForkedBooter.java:200)
	at org.apache.maven.surefire.booter.ForkedBooter.runSuitesInProcess(ForkedBooter.java:153)
	at org.apache.maven.surefire.booter.ForkedBooter.main(ForkedBooter.java:103)

Running com.addthis.codec.CodecGenericsTest
Tests run: 1, Failures: 0, Errors: 0, Skipped: 0, Time elapsed: 0.014 sec - in com.addthis.codec.CodecGenericsTest
Running com.addthis.codec.CodecUtilTest
[main] INFO com.addthis.codec.CodecUtilTest - compareTest(abc,ab) sc(1) bc(1)
[main] INFO com.addthis.codec.CodecUtilTest - compareTest(abc,abc) sc(0) bc(0)
[main] INFO com.addthis.codec.CodecUtilTest - compareTest(abc,abcd) sc(-1) bc(-1)
[main] INFO com.addthis.codec.CodecUtilTest - compareTest(abc,def) sc(-3) bc(-3)
[main] INFO com.addthis.codec.CodecUtilTest - compareTest(def,abc) sc(3) bc(3)
[main] INFO com.addthis.codec.CodecUtilTest - compareTest(abcd,acbd) sc(-1) bc(-1)
Tests run: 1, Failures: 0, Errors: 0, Skipped: 0, Time elapsed: 0.004 sec - in com.addthis.codec.CodecUtilTest
Running com.addthis.codec.CodecBin2BasicTest
Tests run: 4, Failures: 0, Errors: 0, Skipped: 0, Time elapsed: 0.028 sec - in com.addthis.codec.CodecBin2BasicTest
Running com.addthis.codec.utils.ExecutorServiceBuilderTest
Tests run: 1, Failures: 0, Errors: 0, Skipped: 0, Time elapsed: 0.115 sec - in com.addthis.codec.utils.ExecutorServiceBuilderTest
Running com.addthis.codec.CodecObjectSubclassTest
[main] INFO com.addthis.codec.CodecObjectSubclassTest - en1[111] ->      ok1Bok1ok2Cok1ok2ok3Dok1ok2ok3ok4 ok1Bok1ok2Cok1ok2ok3
[main] INFO com.addthis.codec.CodecObjectSubclassTest - en2[111] ->      ok1Bok1ok2Cok1ok2ok3Dok1ok2ok3ok4 ok1Bok1ok2Cok1ok2ok3
[main] INFO com.addthis.codec.CodecObjectSubclassTest - CodecBin2 --> PASSED
Tests run: 1, Failures: 0, Errors: 1, Skipped: 0, Time elapsed: 0.021 sec <<< FAILURE! - in com.addthis.codec.CodecObjectSubclassTest
testAll(com.addthis.codec.CodecObjectSubclassTest)  Time elapsed: 0.021 sec  <<< ERROR!
java.lang.NullPointerException: null
	at java.lang.Class.isAssignableFrom(Native Method)
	at com.addthis.codec.jackson.CodecTypeResolverBuilder.buildTypeDeserializer(CodecTypeResolverBuilder.java:30)
	at com.addthis.codec.jackson.CodecTypeResolverBuilder.buildTypeDeserializer(CodecTypeResolverBuilder.java:19)
	at com.fasterxml.jackson.databind.deser.BasicDeserializerFactory.findTypeDeserializer(BasicDeserializerFactory.java:1240)
	at com.fasterxml.jackson.databind.deser.BasicDeserializerFactory.findPropertyTypeDeserializer(BasicDeserializerFactory.java:1355)
	at com.fasterxml.jackson.databind.deser.BasicDeserializerFactory.resolveType(BasicDeserializerFactory.java:1585)
	at com.fasterxml.jackson.databind.deser.BeanDeserializerFactory.constructSettableProperty(BeanDeserializerFactory.java:758)
	at com.fasterxml.jackson.databind.deser.BeanDeserializerFactory.addBeanProps(BeanDeserializerFactory.java:549)
	at com.fasterxml.jackson.databind.deser.BeanDeserializerFactory.buildBeanDeserializer(BeanDeserializerFactory.java:270)
	at com.fasterxml.jackson.databind.deser.BeanDeserializerFactory.createBeanDeserializer(BeanDeserializerFactory.java:168)
	at com.fasterxml.jackson.databind.deser.DeserializerCache._createDeserializer2(DeserializerCache.java:399)
	at com.fasterxml.jackson.databind.deser.DeserializerCache._createDeserializer(DeserializerCache.java:348)
	at com.fasterxml.jackson.databind.deser.DeserializerCache._createAndCache2(DeserializerCache.java:261)
	at com.fasterxml.jackson.databind.deser.DeserializerCache._createAndCacheValueDeserializer(DeserializerCache.java:241)
	at com.fasterxml.jackson.databind.deser.DeserializerCache.findValueDeserializer(DeserializerCache.java:142)
	at com.fasterxml.jackson.databind.DeserializationContext.findRootValueDeserializer(DeserializationContext.java:394)
	at com.fasterxml.jackson.databind.ObjectReader._prefetchRootDeserializer(ObjectReader.java:1404)
	at com.fasterxml.jackson.databind.ObjectReader.<init>(ObjectReader.java:186)
	at com.fasterxml.jackson.databind.ObjectMapper.reader(ObjectMapper.java:2593)
	at com.fasterxml.jackson.databind.ObjectMapper.reader(ObjectMapper.java:2603)
	at com.addthis.codec.json.CodecJSON.decode(CodecJSON.java:53)
	at com.addthis.codec.CodecObjectSubclassTest.testAll(CodecObjectSubclassTest.java:49)

Running com.addthis.codec.plugins.PluginRegistryTest
Tests run: 7, Failures: 0, Errors: 0, Skipped: 0, Time elapsed: 0.034 sec - in com.addthis.codec.plugins.PluginRegistryTest

Results :

Tests in error: 
  CodecJSONTest.arraySugar:87 » NullPointer
  CodecJSONTest.typeSugar:79 » NullPointer
  CodecJsonBasicTest>CodecBasicTests.setup:88 » NullPointer
  CodecJsonBasicTest>CodecBasicTests.setup:88 » NullPointer
  CodecJsonBasicTest>CodecBasicTests.setup:88 » NullPointer
  CodecJsonBasicTest>CodecBasicTests.setup:88 » NullPointer
  CodecJsonBasicTest>CodecBasicTests.setup:88 » NullPointer
  CodecObjectSubclassTest.testAll:49 » NullPointer

Tests run: 54, Failures: 0, Errors: 8, Skipped: 0

[INFO] ------------------------------------------------------------------------
[INFO] BUILD FAILURE
[INFO] ------------------------------------------------------------------------
[INFO] Total time: 9.519s
[INFO] Finished at: Sun Aug 02 02:02:26 BST 2015
[INFO] Final Memory: 17M/215M
[INFO] ------------------------------------------------------------------------
[ERROR] Failed to execute goal org.apache.maven.plugins:maven-surefire-plugin:2.17:test (default-test) on project codec: There are test failures.
[ERROR] 
[ERROR] Please refer to /home/perham/Study/LittleDarwin/Cases/codec-3.3.0/target/surefire-reports for the individual test results.
[ERROR] -> [Help 1]
[ERROR] 
[ERROR] To see the full stack trace of the errors, re-run Maven with the -e switch.
[ERROR] Re-run Maven using the -X switch to enable full debug logging.
[ERROR] 
[ERROR] For more information about the errors and possible solutions, please read the following articles:
[ERROR] [Help 1] http://cwiki.apache.org/confluence/display/MAVEN/MojoFailureException
