[INFO] Scanning for projects...
[INFO]                                                                         
[INFO] ------------------------------------------------------------------------
[INFO] Building Codec 3.3.0
[INFO] ------------------------------------------------------------------------
[INFO] 
[INFO] --- jacoco-maven-plugin:0.7.1.201405082137:prepare-agent (default) @ codec ---
[INFO] argLine set to -javaagent:/home/perham/.m2/repository/org/jacoco/org.jacoco.agent/0.7.1.201405082137/org.jacoco.agent-0.7.1.201405082137-runtime.jar=destfile=/home/perham/Study/LittleDarwin/Cases/codec-3.3.0/target/jacoco.exec
[INFO] 
[INFO] --- maven-resources-plugin:2.3:resources (default-resources) @ codec ---
[INFO] Using 'UTF-8' encoding to copy filtered resources.
[INFO] Copying 1 resource
[INFO] 
[INFO] --- maven-compiler-plugin:3.1:compile (default-compile) @ codec ---
[INFO] Changes detected - recompiling the module!
[INFO] Compiling 47 source files to /home/perham/Study/LittleDarwin/Cases/codec-3.3.0/target/classes
[WARNING] /home/perham/Study/LittleDarwin/Cases/codec-3.3.0/src/main/java/com/addthis/codec/jackson/CodecTypeIdResolver.java:[44,46] typeFromId(java.lang.String) in com.fasterxml.jackson.databind.jsontype.impl.TypeIdResolverBase has been deprecated
[WARNING] /home/perham/Study/LittleDarwin/Cases/codec-3.3.0/src/main/java/com/addthis/codec/binary/BufferIn.java:[35,28] readBytes(java.io.InputStream,int) in com.addthis.basis.util.Bytes has been deprecated
[WARNING] /home/perham/Study/LittleDarwin/Cases/codec-3.3.0/src/main/java/com/addthis/codec/binary/CodecBin2.java:[87,14] writeInt(int,java.io.OutputStream) in com.addthis.basis.util.Bytes has been deprecated
[WARNING] /home/perham/Study/LittleDarwin/Cases/codec-3.3.0/src/main/java/com/addthis/codec/binary/CodecBin2.java:[95,24] readInt(java.io.InputStream) in com.addthis.basis.util.Bytes has been deprecated
[WARNING] /home/perham/Study/LittleDarwin/Cases/codec-3.3.0/src/main/java/com/addthis/codec/binary/CodecBin2.java:[181,22] writeInt(int,java.io.OutputStream) in com.addthis.basis.util.Bytes has been deprecated
[WARNING] /home/perham/Study/LittleDarwin/Cases/codec-3.3.0/src/main/java/com/addthis/codec/binary/CodecBin2.java:[186,22] writeLong(long,java.io.OutputStream) in com.addthis.basis.util.Bytes has been deprecated
[WARNING] /home/perham/Study/LittleDarwin/Cases/codec-3.3.0/src/main/java/com/addthis/codec/binary/CodecBin2.java:[210,35] readInt(java.io.InputStream) in com.addthis.basis.util.Bytes has been deprecated
[WARNING] /home/perham/Study/LittleDarwin/Cases/codec-3.3.0/src/main/java/com/addthis/codec/binary/CodecBin2.java:[216,35] readLong(java.io.InputStream) in com.addthis.basis.util.Bytes has been deprecated
[WARNING] /home/perham/Study/LittleDarwin/Cases/codec-3.3.0/src/main/java/com/addthis/codec/binary/CodecBin2.java:[356,18] writeInt(int,java.io.OutputStream) in com.addthis.basis.util.Bytes has been deprecated
[WARNING] /home/perham/Study/LittleDarwin/Cases/codec-3.3.0/src/main/java/com/addthis/codec/binary/CodecBin2.java:[358,18] writeLong(long,java.io.OutputStream) in com.addthis.basis.util.Bytes has been deprecated
[WARNING] /home/perham/Study/LittleDarwin/Cases/codec-3.3.0/src/main/java/com/addthis/codec/binary/CodecBin2.java:[360,18] writeShort(short,java.io.OutputStream) in com.addthis.basis.util.Bytes has been deprecated
[WARNING] /home/perham/Study/LittleDarwin/Cases/codec-3.3.0/src/main/java/com/addthis/codec/binary/CodecBin2.java:[364,18] writeInt(int,java.io.OutputStream) in com.addthis.basis.util.Bytes has been deprecated
[WARNING] /home/perham/Study/LittleDarwin/Cases/codec-3.3.0/src/main/java/com/addthis/codec/binary/CodecBin2.java:[366,18] writeLong(long,java.io.OutputStream) in com.addthis.basis.util.Bytes has been deprecated
[WARNING] /home/perham/Study/LittleDarwin/Cases/codec-3.3.0/src/main/java/com/addthis/codec/binary/CodecBin2.java:[368,18] writeLong(long,java.io.OutputStream) in com.addthis.basis.util.Bytes has been deprecated
[WARNING] /home/perham/Study/LittleDarwin/Cases/codec-3.3.0/src/main/java/com/addthis/codec/binary/CodecBin2.java:[370,18] writeInt(int,java.io.OutputStream) in com.addthis.basis.util.Bytes has been deprecated
[WARNING] /home/perham/Study/LittleDarwin/Cases/codec-3.3.0/src/main/java/com/addthis/codec/binary/CodecBin2.java:[388,27] readInt(java.io.InputStream) in com.addthis.basis.util.Bytes has been deprecated
[WARNING] /home/perham/Study/LittleDarwin/Cases/codec-3.3.0/src/main/java/com/addthis/codec/binary/CodecBin2.java:[390,27] readLong(java.io.InputStream) in com.addthis.basis.util.Bytes has been deprecated
[WARNING] /home/perham/Study/LittleDarwin/Cases/codec-3.3.0/src/main/java/com/addthis/codec/binary/CodecBin2.java:[392,27] readShort(java.io.InputStream) in com.addthis.basis.util.Bytes has been deprecated
[WARNING] /home/perham/Study/LittleDarwin/Cases/codec-3.3.0/src/main/java/com/addthis/codec/binary/CodecBin2.java:[396,51] readLong(java.io.InputStream) in com.addthis.basis.util.Bytes has been deprecated
[WARNING] /home/perham/Study/LittleDarwin/Cases/codec-3.3.0/src/main/java/com/addthis/codec/binary/CodecBin2.java:[398,48] readInt(java.io.InputStream) in com.addthis.basis.util.Bytes has been deprecated
[WARNING] /home/perham/Study/LittleDarwin/Cases/codec-3.3.0/src/main/java/com/addthis/codec/binary/CodecBin2.java:[400,42] readLong(java.io.InputStream) in com.addthis.basis.util.Bytes has been deprecated
[WARNING] /home/perham/Study/LittleDarwin/Cases/codec-3.3.0/src/main/java/com/addthis/codec/binary/CodecBin2.java:[402,45] readInt(java.io.InputStream) in com.addthis.basis.util.Bytes has been deprecated
[WARNING] /home/perham/Study/LittleDarwin/Cases/codec-3.3.0/src/main/java/com/addthis/codec/binary/CodecBin2.java:[419,25] readCharString(java.io.InputStream) in com.addthis.basis.util.Bytes has been deprecated
[WARNING] /home/perham/Study/LittleDarwin/Cases/codec-3.3.0/src/main/java/com/addthis/codec/binary/CodecBin2.java:[421,25] readString(java.io.InputStream) in com.addthis.basis.util.Bytes has been deprecated
[WARNING] /home/perham/Study/LittleDarwin/Cases/codec-3.3.0/src/main/java/com/addthis/codec/binary/CodecBin2.java:[427,18] writeCharString(java.lang.String,java.io.OutputStream) in com.addthis.basis.util.Bytes has been deprecated
[WARNING] /home/perham/Study/LittleDarwin/Cases/codec-3.3.0/src/main/java/com/addthis/codec/binary/CodecBin2.java:[429,18] writeString(java.lang.String,java.io.OutputStream) in com.addthis.basis.util.Bytes has been deprecated
[WARNING] /home/perham/Study/LittleDarwin/Cases/codec-3.3.0/src/main/java/com/addthis/codec/jackson/CodecJackson.java: Some input files use unchecked or unsafe operations.
[WARNING] /home/perham/Study/LittleDarwin/Cases/codec-3.3.0/src/main/java/com/addthis/codec/jackson/CodecJackson.java: Recompile with -Xlint:unchecked for details.
[INFO] 
[INFO] --- maven-resources-plugin:2.3:testResources (default-testResources) @ codec ---
[INFO] Using 'UTF-8' encoding to copy filtered resources.
[INFO] Copying 10 resources
[INFO] 
[INFO] --- maven-compiler-plugin:3.1:testCompile (default-testCompile) @ codec ---
[INFO] Nothing to compile - all classes are up to date
[INFO] 
[INFO] --- maven-surefire-plugin:2.17:test (default-test) @ codec ---
[INFO] Surefire report directory: /home/perham/Study/LittleDarwin/Cases/codec-3.3.0/target/surefire-reports

-------------------------------------------------------
 T E S T S
-------------------------------------------------------
Running com.addthis.codec.jackson.WriteonlyPropertyIgnorerTest
Aug 02, 2015 2:01:27 AM org.hibernate.validator.internal.util.Version <clinit>
INFO: HV000001: Hibernate Validator 5.1.1.Final
Tests run: 1, Failures: 0, Errors: 0, Skipped: 0, Time elapsed: 2.839 sec - in com.addthis.codec.jackson.WriteonlyPropertyIgnorerTest
Running com.addthis.codec.CodecRWOnlyTest
{"read1":123,"read2":234,"write1":456,"write2":567}
r1:111,r2:222,w1:333,w2:444
Tests run: 1, Failures: 0, Errors: 0, Skipped: 0, Time elapsed: 0.02 sec - in com.addthis.codec.CodecRWOnlyTest
Running com.addthis.codec.json.CodecJSONTest
Tests run: 4, Failures: 0, Errors: 2, Skipped: 0, Time elapsed: 0.132 sec <<< FAILURE! - in com.addthis.codec.json.CodecJSONTest
arraySugar(com.addthis.codec.json.CodecJSONTest)  Time elapsed: 0.112 sec  <<< ERROR!
com.fasterxml.jackson.databind.JsonMappingException: Can not construct instance of com.addthis.codec.json.CodecJSONTest$AbstractLetter, problem: abstract types either need to be mapped to concrete types, have custom deserializer, or be instantiated with additional type information
 at [Source: {thing: [{C: {intField: 5}}, {C: {intField: 6}}, {C: {intField: 7}} ]}; line: 1, column: 69] (through reference chain: com.addthis.codec.json.Holder["thing"])
	at com.fasterxml.jackson.databind.JsonMappingException.from(JsonMappingException.java:148)
	at com.fasterxml.jackson.databind.DeserializationContext.instantiationException(DeserializationContext.java:784)
	at com.fasterxml.jackson.databind.deser.AbstractDeserializer.deserialize(AbstractDeserializer.java:140)
	at com.addthis.codec.jackson.CodecTypeDeserializer._deserializeTypedFromArray(CodecTypeDeserializer.java:329)
	at com.addthis.codec.jackson.CodecTypeDeserializer.deserializeTypedFromAny(CodecTypeDeserializer.java:120)
	at com.addthis.codec.jackson.CodecTypeDeserializer.deserializeTypedFromObject(CodecTypeDeserializer.java:83)
	at com.fasterxml.jackson.databind.deser.AbstractDeserializer.deserializeWithType(AbstractDeserializer.java:132)
	at com.fasterxml.jackson.databind.deser.SettableBeanProperty.deserialize(SettableBeanProperty.java:536)
	at com.fasterxml.jackson.databind.deser.impl.FieldProperty.deserializeAndSet(FieldProperty.java:106)
	at com.fasterxml.jackson.databind.deser.BeanDeserializer.deserialize(BeanDeserializer.java:205)
	at com.fasterxml.jackson.databind.deser.std.DelegatingDeserializer.deserialize(DelegatingDeserializer.java:115)
	at com.fasterxml.jackson.databind.ObjectReader._bindAndClose(ObjectReader.java:1271)
	at com.fasterxml.jackson.databind.ObjectReader.readValue(ObjectReader.java:896)
	at com.addthis.codec.json.CodecJSON.decodeString(CodecJSON.java:86)
	at com.addthis.codec.json.CodecJSONTest.arraySugar(CodecJSONTest.java:87)

typeSugar(com.addthis.codec.json.CodecJSONTest)  Time elapsed: 0.001 sec  <<< ERROR!
java.lang.NullPointerException: null
	at com.fasterxml.jackson.databind.JsonMappingException$Reference.toString(JsonMappingException.java:97)
	at com.fasterxml.jackson.databind.JsonMappingException._appendPathDesc(JsonMappingException.java:342)
	at com.fasterxml.jackson.databind.JsonMappingException.getPathReference(JsonMappingException.java:245)
	at com.fasterxml.jackson.databind.JsonMappingException._buildMessage(JsonMappingException.java:318)
	at com.fasterxml.jackson.databind.JsonMappingException.getMessage(JsonMappingException.java:299)
	at org.apache.maven.surefire.report.SmartStackTraceParser.toString(SmartStackTraceParser.java:308)
	at org.apache.maven.surefire.report.SmartStackTraceParser.innerMostWithFocusOnClass(SmartStackTraceParser.java:246)
	at org.apache.maven.surefire.common.junit4.JUnit4StackTraceWriter.writeTrimmedTraceToString(JUnit4StackTraceWriter.java:97)
	at org.apache.maven.surefire.booter.ForkingRunListener.encode(ForkingRunListener.java:330)
	at org.apache.maven.surefire.booter.ForkingRunListener.encode(ForkingRunListener.java:312)
	at org.apache.maven.surefire.booter.ForkingRunListener.toString(ForkingRunListener.java:258)
	at org.apache.maven.surefire.booter.ForkingRunListener.testError(ForkingRunListener.java:132)
	at org.apache.maven.surefire.common.junit4.JUnit4RunListener.testFailure(JUnit4RunListener.java:114)
	at org.junit.runner.notification.RunNotifier$4.notifyListener(RunNotifier.java:139)
	at org.junit.runner.notification.RunNotifier$SafeNotifier.run(RunNotifier.java:61)
	at org.junit.runner.notification.RunNotifier.fireTestFailures(RunNotifier.java:134)
	at org.junit.runner.notification.RunNotifier.fireTestFailure(RunNotifier.java:128)
	at org.junit.internal.runners.model.EachTestNotifier.addFailure(EachTestNotifier.java:23)
	at org.junit.runners.ParentRunner.runLeaf(ParentRunner.java:275)
	at org.junit.runners.BlockJUnit4ClassRunner.runChild(BlockJUnit4ClassRunner.java:70)
	at org.junit.runners.BlockJUnit4ClassRunner.runChild(BlockJUnit4ClassRunner.java:50)
	at org.junit.runners.ParentRunner$3.run(ParentRunner.java:238)
	at org.junit.runners.ParentRunner$1.schedule(ParentRunner.java:63)
	at org.junit.runners.ParentRunner.runChildren(ParentRunner.java:236)
	at org.junit.runners.ParentRunner.access$000(ParentRunner.java:53)
	at org.junit.runners.ParentRunner$2.evaluate(ParentRunner.java:229)
	at org.junit.runners.ParentRunner.run(ParentRunner.java:309)
	at org.apache.maven.surefire.junit4.JUnit4Provider.execute(JUnit4Provider.java:264)
	at org.apache.maven.surefire.junit4.JUnit4Provider.executeTestSet(JUnit4Provider.java:153)
	at org.apache.maven.surefire.junit4.JUnit4Provider.invoke(JUnit4Provider.java:124)
	at org.apache.maven.surefire.booter.ForkedBooter.invokeProviderInSameClassLoader(ForkedBooter.java:200)
	at org.apache.maven.surefire.booter.ForkedBooter.runSuitesInProcess(ForkedBooter.java:153)
	at org.apache.maven.surefire.booter.ForkedBooter.main(ForkedBooter.java:103)

Running com.addthis.codec.config.FeatureTest
[main] INFO com.addthis.codec.config.FeatureTest - unresolved {
    # config/defaultgreeter.conf: 1
    "greet" : {}
}

[main] INFO com.addthis.codec.config.FeatureTest - resolved {
    # plugins/greet-complex.conf: 38
    "_class" : "simple",
    # plugins/greet-complex.conf: 39
    "suffix" : "! What a pleasant default-alias suffix we are having!",
    # greet default type : plugins/greet-complex.conf: 37
    "type" : "simple"
}

Tests run: 22, Failures: 3, Errors: 13, Skipped: 0, Time elapsed: 0.261 sec <<< FAILURE! - in com.addthis.codec.config.FeatureTest
inheritance(com.addthis.codec.config.FeatureTest)  Time elapsed: 0.022 sec  <<< ERROR!
java.lang.IllegalArgumentException: Could not instantiate an instance of the greet category that you have specified with "null".
Perhaps you intended one of the following: [holder, list, easy, subparse, config, enum, crowd, simple, multi, parse]
	at java.lang.Class.forName0(Native Method)
	at java.lang.Class.forName(Class.java:191)
	at com.addthis.codec.plugins.PluginMap.findAndValidateClass(PluginMap.java:270)
	at com.addthis.codec.plugins.PluginMap.getClass(PluginMap.java:222)
	at com.addthis.codec.jackson.CodecTypeIdResolver._typeFromId(CodecTypeIdResolver.java:49)
	at com.addthis.codec.jackson.CodecTypeIdResolver.typeFromId(CodecTypeIdResolver.java:38)
	at com.fasterxml.jackson.databind.jsontype.impl.TypeDeserializerBase._findDeserializer(TypeDeserializerBase.java:159)
	at com.addthis.codec.jackson.CodecTypeDeserializer.deserializeTypedFromAny(CodecTypeDeserializer.java:128)
	at com.addthis.codec.jackson.CodecTypeDeserializer.deserializeTypedFromObject(CodecTypeDeserializer.java:83)
	at com.fasterxml.jackson.databind.deser.BeanDeserializerBase.deserializeWithType(BeanDeserializerBase.java:956)
	at com.fasterxml.jackson.databind.deser.std.DelegatingDeserializer.deserializeWithType(DelegatingDeserializer.java:123)
	at com.fasterxml.jackson.databind.deser.impl.TypeWrappedDeserializer.deserialize(TypeWrappedDeserializer.java:41)
	at com.fasterxml.jackson.databind.ObjectMapper._readValue(ObjectMapper.java:3038)
	at com.fasterxml.jackson.databind.ObjectMapper.readValue(ObjectMapper.java:1652)
	at com.fasterxml.jackson.core.JsonParser.readValueAs(JsonParser.java:1346)
	at com.addthis.codec.jackson.CodecJackson.decodeObject(CodecJackson.java:116)
	at com.addthis.codec.jackson.CodecJackson.decodeObject(CodecJackson.java:174)
	at com.addthis.codec.config.Configs.decodeObject(Configs.java:71)
	at com.addthis.codec.config.FeatureTest.inheritance(FeatureTest.java:196)

abstractDelegateEmpty(com.addthis.codec.config.FeatureTest)  Time elapsed: 0.078 sec  <<< FAILURE!
org.junit.ComparisonFailure: expected:<...t a pleasant default[-alias] suffix we are havin...> but was:<...t a pleasant default[] suffix we are havin...>
	at org.junit.Assert.assertEquals(Assert.java:115)
	at org.junit.Assert.assertEquals(Assert.java:144)
	at com.addthis.codec.config.FeatureTest.abstractDelegateEmpty(FeatureTest.java:231)

concreteValue(com.addthis.codec.config.FeatureTest)  Time elapsed: 0.002 sec  <<< ERROR!
java.lang.IllegalArgumentException: Could not instantiate an instance of the greet category that you have specified with "null".
Perhaps you intended one of the following: [holder, list, easy, subparse, config, enum, crowd, simple, multi, parse]
	at java.lang.Class.forName0(Native Method)
	at java.lang.Class.forName(Class.java:191)
	at com.addthis.codec.plugins.PluginMap.findAndValidateClass(PluginMap.java:270)
	at com.addthis.codec.plugins.PluginMap.getClass(PluginMap.java:222)
	at com.addthis.codec.jackson.CodecTypeIdResolver._typeFromId(CodecTypeIdResolver.java:49)
	at com.addthis.codec.jackson.CodecTypeIdResolver.typeFromId(CodecTypeIdResolver.java:38)
	at com.fasterxml.jackson.databind.jsontype.impl.TypeDeserializerBase._findDeserializer(TypeDeserializerBase.java:159)
	at com.addthis.codec.jackson.CodecTypeDeserializer.deserializeTypedFromAny(CodecTypeDeserializer.java:128)
	at com.addthis.codec.jackson.CodecTypeDeserializer.deserializeTypedFromObject(CodecTypeDeserializer.java:83)
	at com.fasterxml.jackson.databind.deser.BeanDeserializerBase.deserializeWithType(BeanDeserializerBase.java:956)
	at com.fasterxml.jackson.databind.deser.std.DelegatingDeserializer.deserializeWithType(DelegatingDeserializer.java:123)
	at com.fasterxml.jackson.databind.deser.impl.TypeWrappedDeserializer.deserialize(TypeWrappedDeserializer.java:41)
	at com.fasterxml.jackson.databind.ObjectMapper._readValue(ObjectMapper.java:3038)
	at com.fasterxml.jackson.databind.ObjectMapper.readValue(ObjectMapper.java:1652)
	at com.fasterxml.jackson.core.JsonParser.readValueAs(JsonParser.java:1346)
	at com.addthis.codec.jackson.CodecJackson.decodeObject(CodecJackson.java:116)
	at com.addthis.codec.config.FeatureTest.concreteValue(FeatureTest.java:204)

autoCollection(com.addthis.codec.config.FeatureTest)  Time elapsed: 0.002 sec  <<< FAILURE!
org.junit.ComparisonFailure: expected:<Hello World! Wh[ere are all my friends?]> but was:<Hello World! Wh[at a pleasant default suffix we are having!]>
	at org.junit.Assert.assertEquals(Assert.java:115)
	at org.junit.Assert.assertEquals(Assert.java:144)
	at com.addthis.codec.config.FeatureTest.autoCollection(FeatureTest.java:82)

inline(com.addthis.codec.config.FeatureTest)  Time elapsed: 0.018 sec  <<< ERROR!
com.fasterxml.jackson.databind.JsonMappingException: Unrecognized field "message" (class com.addthis.codec.plugins.SimpleGreet), not marked as ignorable (one known property: "suffix"])
 at [Source: ConfigString(" INLINED"); line: 1, column: -1] (through reference chain: com.addthis.codec.plugins.SimpleGreet["message"])
	at com.fasterxml.jackson.databind.exc.UnrecognizedPropertyException.from(UnrecognizedPropertyException.java:51)
	at com.fasterxml.jackson.databind.DeserializationContext.reportUnknownProperty(DeserializationContext.java:744)
	at com.fasterxml.jackson.databind.deser.std.StdDeserializer.handleUnknownProperty(StdDeserializer.java:915)
	at com.fasterxml.jackson.databind.deser.BeanDeserializerBase.handleUnknownProperty(BeanDeserializerBase.java:1306)
	at com.fasterxml.jackson.databind.deser.BeanDeserializerBase.handleUnknownVanilla(BeanDeserializerBase.java:1284)
	at com.fasterxml.jackson.databind.deser.BeanDeserializer.vanillaDeserialize(BeanDeserializer.java:243)
	at com.fasterxml.jackson.databind.deser.BeanDeserializer.deserialize(BeanDeserializer.java:118)
	at com.addthis.codec.jackson.CodecBeanDeserializer.deserialize(CodecBeanDeserializer.java:82)
	at com.addthis.codec.jackson.CodecTypeDeserializer._deserializeObjectFromInlinedType(CodecTypeDeserializer.java:220)
	at com.addthis.codec.jackson.CodecTypeDeserializer._deserializeTypedFromObject(CodecTypeDeserializer.java:151)
	at com.addthis.codec.jackson.CodecTypeDeserializer.deserializeTypedFromAny(CodecTypeDeserializer.java:123)
	at com.addthis.codec.jackson.CodecTypeDeserializer.deserializeTypedFromObject(CodecTypeDeserializer.java:83)
	at com.fasterxml.jackson.databind.deser.AbstractDeserializer.deserializeWithType(AbstractDeserializer.java:132)
	at com.fasterxml.jackson.databind.deser.impl.TypeWrappedDeserializer.deserialize(TypeWrappedDeserializer.java:41)
	at com.fasterxml.jackson.databind.ObjectMapper._readValue(ObjectMapper.java:3038)
	at com.fasterxml.jackson.databind.ObjectMapper.readValue(ObjectMapper.java:1652)
	at com.fasterxml.jackson.core.JsonParser.readValueAs(JsonParser.java:1346)
	at com.addthis.codec.jackson.CodecJackson.decodeObject(CodecJackson.java:116)
	at com.addthis.codec.jackson.CodecJackson.decodeObject(CodecJackson.java:205)
	at com.addthis.codec.config.Configs.decodeObject(Configs.java:118)
	at com.addthis.codec.config.FeatureTest.inline(FeatureTest.java:129)

primaryArray(com.addthis.codec.config.FeatureTest)  Time elapsed: 0.004 sec  <<< ERROR!
java.lang.NullPointerException: null
	at com.fasterxml.jackson.databind.JsonMappingException$Reference.toString(JsonMappingException.java:97)
	at com.fasterxml.jackson.databind.JsonMappingException._appendPathDesc(JsonMappingException.java:342)
	at com.fasterxml.jackson.databind.JsonMappingException.getPathReference(JsonMappingException.java:245)
	at com.fasterxml.jackson.databind.JsonMappingException._buildMessage(JsonMappingException.java:318)
	at com.fasterxml.jackson.databind.JsonMappingException.getMessage(JsonMappingException.java:299)
	at org.apache.maven.surefire.report.SmartStackTraceParser.toString(SmartStackTraceParser.java:308)
	at org.apache.maven.surefire.report.SmartStackTraceParser.innerMostWithFocusOnClass(SmartStackTraceParser.java:246)
	at org.apache.maven.surefire.common.junit4.JUnit4StackTraceWriter.writeTrimmedTraceToString(JUnit4StackTraceWriter.java:97)
	at org.apache.maven.surefire.booter.ForkingRunListener.encode(ForkingRunListener.java:330)
	at org.apache.maven.surefire.booter.ForkingRunListener.encode(ForkingRunListener.java:312)
	at org.apache.maven.surefire.booter.ForkingRunListener.toString(ForkingRunListener.java:258)
	at org.apache.maven.surefire.booter.ForkingRunListener.testError(ForkingRunListener.java:132)
	at org.apache.maven.surefire.common.junit4.JUnit4RunListener.testFailure(JUnit4RunListener.java:114)
	at org.junit.runner.notification.RunNotifier$4.notifyListener(RunNotifier.java:139)
	at org.junit.runner.notification.RunNotifier$SafeNotifier.run(RunNotifier.java:61)
	at org.junit.runner.notification.RunNotifier.fireTestFailures(RunNotifier.java:134)
	at org.junit.runner.notification.RunNotifier.fireTestFailure(RunNotifier.java:128)
	at org.junit.internal.runners.model.EachTestNotifier.addFailure(EachTestNotifier.java:23)
	at org.junit.runners.ParentRunner.runLeaf(ParentRunner.java:275)
	at org.junit.runners.BlockJUnit4ClassRunner.runChild(BlockJUnit4ClassRunner.java:70)
	at org.junit.runners.BlockJUnit4ClassRunner.runChild(BlockJUnit4ClassRunner.java:50)
	at org.junit.runners.ParentRunner$3.run(ParentRunner.java:238)
	at org.junit.runners.ParentRunner$1.schedule(ParentRunner.java:63)
	at org.junit.runners.ParentRunner.runChildren(ParentRunner.java:236)
	at org.junit.runners.ParentRunner.access$000(ParentRunner.java:53)
	at org.junit.runners.ParentRunner$2.evaluate(ParentRunner.java:229)
	at org.junit.runners.ParentRunner.run(ParentRunner.java:309)
	at org.apache.maven.surefire.junit4.JUnit4Provider.execute(JUnit4Provider.java:264)
	at org.apache.maven.surefire.junit4.JUnit4Provider.executeTestSet(JUnit4Provider.java:153)
	at org.apache.maven.surefire.junit4.JUnit4Provider.invoke(JUnit4Provider.java:124)
	at org.apache.maven.surefire.booter.ForkedBooter.invokeProviderInSameClassLoader(ForkedBooter.java:200)
	at org.apache.maven.surefire.booter.ForkedBooter.runSuitesInProcess(ForkedBooter.java:153)
	at org.apache.maven.surefire.booter.ForkedBooter.main(ForkedBooter.java:103)

primaryNested(com.addthis.codec.config.FeatureTest)  Time elapsed: 0.002 sec  <<< ERROR!
java.lang.NullPointerException: null
	at com.fasterxml.jackson.databind.JsonMappingException$Reference.toString(JsonMappingException.java:97)
	at com.fasterxml.jackson.databind.JsonMappingException._appendPathDesc(JsonMappingException.java:342)
	at com.fasterxml.jackson.databind.JsonMappingException.getPathReference(JsonMappingException.java:245)
	at com.fasterxml.jackson.databind.JsonMappingException._buildMessage(JsonMappingException.java:318)
	at com.fasterxml.jackson.databind.JsonMappingException.getMessage(JsonMappingException.java:299)
	at org.apache.maven.surefire.report.SmartStackTraceParser.toString(SmartStackTraceParser.java:308)
	at org.apache.maven.surefire.report.SmartStackTraceParser.innerMostWithFocusOnClass(SmartStackTraceParser.java:246)
	at org.apache.maven.surefire.common.junit4.JUnit4StackTraceWriter.writeTrimmedTraceToString(JUnit4StackTraceWriter.java:97)
	at org.apache.maven.surefire.booter.ForkingRunListener.encode(ForkingRunListener.java:330)
	at org.apache.maven.surefire.booter.ForkingRunListener.encode(ForkingRunListener.java:312)
	at org.apache.maven.surefire.booter.ForkingRunListener.toString(ForkingRunListener.java:258)
	at org.apache.maven.surefire.booter.ForkingRunListener.testError(ForkingRunListener.java:132)
	at org.apache.maven.surefire.common.junit4.JUnit4RunListener.testFailure(JUnit4RunListener.java:114)
	at org.junit.runner.notification.RunNotifier$4.notifyListener(RunNotifier.java:139)
	at org.junit.runner.notification.RunNotifier$SafeNotifier.run(RunNotifier.java:61)
	at org.junit.runner.notification.RunNotifier.fireTestFailures(RunNotifier.java:134)
	at org.junit.runner.notification.RunNotifier.fireTestFailure(RunNotifier.java:128)
	at org.junit.internal.runners.model.EachTestNotifier.addFailure(EachTestNotifier.java:23)
	at org.junit.runners.ParentRunner.runLeaf(ParentRunner.java:275)
	at org.junit.runners.BlockJUnit4ClassRunner.runChild(BlockJUnit4ClassRunner.java:70)
	at org.junit.runners.BlockJUnit4ClassRunner.runChild(BlockJUnit4ClassRunner.java:50)
	at org.junit.runners.ParentRunner$3.run(ParentRunner.java:238)
	at org.junit.runners.ParentRunner$1.schedule(ParentRunner.java:63)
	at org.junit.runners.ParentRunner.runChildren(ParentRunner.java:236)
	at org.junit.runners.ParentRunner.access$000(ParentRunner.java:53)
	at org.junit.runners.ParentRunner$2.evaluate(ParentRunner.java:229)
	at org.junit.runners.ParentRunner.run(ParentRunner.java:309)
	at org.apache.maven.surefire.junit4.JUnit4Provider.execute(JUnit4Provider.java:264)
	at org.apache.maven.surefire.junit4.JUnit4Provider.executeTestSet(JUnit4Provider.java:153)
	at org.apache.maven.surefire.junit4.JUnit4Provider.invoke(JUnit4Provider.java:124)
	at org.apache.maven.surefire.booter.ForkedBooter.invokeProviderInSameClassLoader(ForkedBooter.java:200)
	at org.apache.maven.surefire.booter.ForkedBooter.runSuitesInProcess(ForkedBooter.java:153)
	at org.apache.maven.surefire.booter.ForkedBooter.main(ForkedBooter.java:103)

primary(com.addthis.codec.config.FeatureTest)  Time elapsed: 0.002 sec  <<< ERROR!
java.lang.NullPointerException: null
	at com.fasterxml.jackson.databind.JsonMappingException$Reference.toString(JsonMappingException.java:97)
	at com.fasterxml.jackson.databind.JsonMappingException._appendPathDesc(JsonMappingException.java:342)
	at com.fasterxml.jackson.databind.JsonMappingException.getPathReference(JsonMappingException.java:245)
	at com.fasterxml.jackson.databind.JsonMappingException._buildMessage(JsonMappingException.java:318)
	at com.fasterxml.jackson.databind.JsonMappingException.getMessage(JsonMappingException.java:299)
	at org.apache.maven.surefire.report.SmartStackTraceParser.toString(SmartStackTraceParser.java:308)
	at org.apache.maven.surefire.report.SmartStackTraceParser.innerMostWithFocusOnClass(SmartStackTraceParser.java:246)
	at org.apache.maven.surefire.common.junit4.JUnit4StackTraceWriter.writeTrimmedTraceToString(JUnit4StackTraceWriter.java:97)
	at org.apache.maven.surefire.booter.ForkingRunListener.encode(ForkingRunListener.java:330)
	at org.apache.maven.surefire.booter.ForkingRunListener.encode(ForkingRunListener.java:312)
	at org.apache.maven.surefire.booter.ForkingRunListener.toString(ForkingRunListener.java:258)
	at org.apache.maven.surefire.booter.ForkingRunListener.testError(ForkingRunListener.java:132)
	at org.apache.maven.surefire.common.junit4.JUnit4RunListener.testFailure(JUnit4RunListener.java:114)
	at org.junit.runner.notification.RunNotifier$4.notifyListener(RunNotifier.java:139)
	at org.junit.runner.notification.RunNotifier$SafeNotifier.run(RunNotifier.java:61)
	at org.junit.runner.notification.RunNotifier.fireTestFailures(RunNotifier.java:134)
	at org.junit.runner.notification.RunNotifier.fireTestFailure(RunNotifier.java:128)
	at org.junit.internal.runners.model.EachTestNotifier.addFailure(EachTestNotifier.java:23)
	at org.junit.runners.ParentRunner.runLeaf(ParentRunner.java:275)
	at org.junit.runners.BlockJUnit4ClassRunner.runChild(BlockJUnit4ClassRunner.java:70)
	at org.junit.runners.BlockJUnit4ClassRunner.runChild(BlockJUnit4ClassRunner.java:50)
	at org.junit.runners.ParentRunner$3.run(ParentRunner.java:238)
	at org.junit.runners.ParentRunner$1.schedule(ParentRunner.java:63)
	at org.junit.runners.ParentRunner.runChildren(ParentRunner.java:236)
	at org.junit.runners.ParentRunner.access$000(ParentRunner.java:53)
	at org.junit.runners.ParentRunner$2.evaluate(ParentRunner.java:229)
	at org.junit.runners.ParentRunner.run(ParentRunner.java:309)
	at org.apache.maven.surefire.junit4.JUnit4Provider.execute(JUnit4Provider.java:264)
	at org.apache.maven.surefire.junit4.JUnit4Provider.executeTestSet(JUnit4Provider.java:153)
	at org.apache.maven.surefire.junit4.JUnit4Provider.invoke(JUnit4Provider.java:124)
	at org.apache.maven.surefire.booter.ForkedBooter.invokeProviderInSameClassLoader(ForkedBooter.java:200)
	at org.apache.maven.surefire.booter.ForkedBooter.runSuitesInProcess(ForkedBooter.java:153)
	at org.apache.maven.surefire.booter.ForkedBooter.main(ForkedBooter.java:103)

greetArray(com.addthis.codec.config.FeatureTest)  Time elapsed: 0.004 sec  <<< ERROR!
com.fasterxml.jackson.databind.JsonMappingException: Unrecognized field "crowd" (class com.addthis.codec.plugins.SimpleGreet), not marked as ignorable (one known property: "suffix"])
 at [Source: SimpleConfigList([{"simple":{}},{"simple":{}}]); line: 1, column: -1]
	at com.addthis.codec.jackson.Jackson.maybeUnwrapPath(Jackson.java:185)
	at com.addthis.codec.jackson.CodecTypeDeserializer._deserializeTypedFromArray(CodecTypeDeserializer.java:331)
	at com.addthis.codec.jackson.CodecTypeDeserializer.deserializeTypedFromAny(CodecTypeDeserializer.java:120)
	at com.addthis.codec.jackson.CodecTypeDeserializer.deserializeTypedFromObject(CodecTypeDeserializer.java:83)
	at com.fasterxml.jackson.databind.deser.AbstractDeserializer.deserializeWithType(AbstractDeserializer.java:132)
	at com.fasterxml.jackson.databind.deser.impl.TypeWrappedDeserializer.deserialize(TypeWrappedDeserializer.java:41)
	at com.fasterxml.jackson.databind.ObjectMapper._readValue(ObjectMapper.java:3038)
	at com.fasterxml.jackson.databind.ObjectMapper.readValue(ObjectMapper.java:1652)
	at com.fasterxml.jackson.core.JsonParser.readValueAs(JsonParser.java:1346)
	at com.addthis.codec.jackson.CodecJackson.decodeObject(CodecJackson.java:116)
	at com.addthis.codec.jackson.CodecJackson.decodeObject(CodecJackson.java:205)
	at com.addthis.codec.config.Configs.decodeObject(Configs.java:118)
	at com.addthis.codec.config.FeatureTest.greetArray(FeatureTest.java:63)

enums(com.addthis.codec.config.FeatureTest)  Time elapsed: 0.002 sec  <<< ERROR!
java.lang.NullPointerException: null
	at com.fasterxml.jackson.databind.JsonMappingException$Reference.toString(JsonMappingException.java:97)
	at com.fasterxml.jackson.databind.JsonMappingException._appendPathDesc(JsonMappingException.java:342)
	at com.fasterxml.jackson.databind.JsonMappingException.getPathReference(JsonMappingException.java:245)
	at com.fasterxml.jackson.databind.JsonMappingException._buildMessage(JsonMappingException.java:318)
	at com.fasterxml.jackson.databind.JsonMappingException.getMessage(JsonMappingException.java:299)
	at org.apache.maven.surefire.report.SmartStackTraceParser.toString(SmartStackTraceParser.java:308)
	at org.apache.maven.surefire.report.SmartStackTraceParser.innerMostWithFocusOnClass(SmartStackTraceParser.java:246)
	at org.apache.maven.surefire.common.junit4.JUnit4StackTraceWriter.writeTrimmedTraceToString(JUnit4StackTraceWriter.java:97)
	at org.apache.maven.surefire.booter.ForkingRunListener.encode(ForkingRunListener.java:330)
	at org.apache.maven.surefire.booter.ForkingRunListener.encode(ForkingRunListener.java:312)
	at org.apache.maven.surefire.booter.ForkingRunListener.toString(ForkingRunListener.java:258)
	at org.apache.maven.surefire.booter.ForkingRunListener.testError(ForkingRunListener.java:132)
	at org.apache.maven.surefire.common.junit4.JUnit4RunListener.testFailure(JUnit4RunListener.java:114)
	at org.junit.runner.notification.RunNotifier$4.notifyListener(RunNotifier.java:139)
	at org.junit.runner.notification.RunNotifier$SafeNotifier.run(RunNotifier.java:61)
	at org.junit.runner.notification.RunNotifier.fireTestFailures(RunNotifier.java:134)
	at org.junit.runner.notification.RunNotifier.fireTestFailure(RunNotifier.java:128)
	at org.junit.internal.runners.model.EachTestNotifier.addFailure(EachTestNotifier.java:23)
	at org.junit.runners.ParentRunner.runLeaf(ParentRunner.java:275)
	at org.junit.runners.BlockJUnit4ClassRunner.runChild(BlockJUnit4ClassRunner.java:70)
	at org.junit.runners.BlockJUnit4ClassRunner.runChild(BlockJUnit4ClassRunner.java:50)
	at org.junit.runners.ParentRunner$3.run(ParentRunner.java:238)
	at org.junit.runners.ParentRunner$1.schedule(ParentRunner.java:63)
	at org.junit.runners.ParentRunner.runChildren(ParentRunner.java:236)
	at org.junit.runners.ParentRunner.access$000(ParentRunner.java:53)
	at org.junit.runners.ParentRunner$2.evaluate(ParentRunner.java:229)
	at org.junit.runners.ParentRunner.run(ParentRunner.java:309)
	at org.apache.maven.surefire.junit4.JUnit4Provider.execute(JUnit4Provider.java:264)
	at org.apache.maven.surefire.junit4.JUnit4Provider.executeTestSet(JUnit4Provider.java:153)
	at org.apache.maven.surefire.junit4.JUnit4Provider.invoke(JUnit4Provider.java:124)
	at org.apache.maven.surefire.booter.ForkedBooter.invokeProviderInSameClassLoader(ForkedBooter.java:200)
	at org.apache.maven.surefire.booter.ForkedBooter.runSuitesInProcess(ForkedBooter.java:153)
	at org.apache.maven.surefire.booter.ForkedBooter.main(ForkedBooter.java:103)

abstractDelegate(com.addthis.codec.config.FeatureTest)  Time elapsed: 0.002 sec  <<< ERROR!
java.lang.NullPointerException: null
	at com.fasterxml.jackson.databind.JsonMappingException$Reference.toString(JsonMappingException.java:97)
	at com.fasterxml.jackson.databind.JsonMappingException._appendPathDesc(JsonMappingException.java:342)
	at com.fasterxml.jackson.databind.JsonMappingException.getPathReference(JsonMappingException.java:245)
	at com.fasterxml.jackson.databind.JsonMappingException._buildMessage(JsonMappingException.java:318)
	at com.fasterxml.jackson.databind.JsonMappingException.getMessage(JsonMappingException.java:299)
	at org.apache.maven.surefire.report.SmartStackTraceParser.toString(SmartStackTraceParser.java:308)
	at org.apache.maven.surefire.report.SmartStackTraceParser.innerMostWithFocusOnClass(SmartStackTraceParser.java:246)
	at org.apache.maven.surefire.common.junit4.JUnit4StackTraceWriter.writeTrimmedTraceToString(JUnit4StackTraceWriter.java:97)
	at org.apache.maven.surefire.booter.ForkingRunListener.encode(ForkingRunListener.java:330)
	at org.apache.maven.surefire.booter.ForkingRunListener.encode(ForkingRunListener.java:312)
	at org.apache.maven.surefire.booter.ForkingRunListener.toString(ForkingRunListener.java:258)
	at org.apache.maven.surefire.booter.ForkingRunListener.testError(ForkingRunListener.java:132)
	at org.apache.maven.surefire.common.junit4.JUnit4RunListener.testFailure(JUnit4RunListener.java:114)
	at org.junit.runner.notification.RunNotifier$4.notifyListener(RunNotifier.java:139)
	at org.junit.runner.notification.RunNotifier$SafeNotifier.run(RunNotifier.java:61)
	at org.junit.runner.notification.RunNotifier.fireTestFailures(RunNotifier.java:134)
	at org.junit.runner.notification.RunNotifier.fireTestFailure(RunNotifier.java:128)
	at org.junit.internal.runners.model.EachTestNotifier.addFailure(EachTestNotifier.java:23)
	at org.junit.runners.ParentRunner.runLeaf(ParentRunner.java:275)
	at org.junit.runners.BlockJUnit4ClassRunner.runChild(BlockJUnit4ClassRunner.java:70)
	at org.junit.runners.BlockJUnit4ClassRunner.runChild(BlockJUnit4ClassRunner.java:50)
	at org.junit.runners.ParentRunner$3.run(ParentRunner.java:238)
	at org.junit.runners.ParentRunner$1.schedule(ParentRunner.java:63)
	at org.junit.runners.ParentRunner.runChildren(ParentRunner.java:236)
	at org.junit.runners.ParentRunner.access$000(ParentRunner.java:53)
	at org.junit.runners.ParentRunner$2.evaluate(ParentRunner.java:229)
	at org.junit.runners.ParentRunner.run(ParentRunner.java:309)
	at org.apache.maven.surefire.junit4.JUnit4Provider.execute(JUnit4Provider.java:264)
	at org.apache.maven.surefire.junit4.JUnit4Provider.executeTestSet(JUnit4Provider.java:153)
	at org.apache.maven.surefire.junit4.JUnit4Provider.invoke(JUnit4Provider.java:124)
	at org.apache.maven.surefire.booter.ForkedBooter.invokeProviderInSameClassLoader(ForkedBooter.java:200)
	at org.apache.maven.surefire.booter.ForkedBooter.runSuitesInProcess(ForkedBooter.java:153)
	at org.apache.maven.surefire.booter.ForkedBooter.main(ForkedBooter.java:103)

arraySingle(com.addthis.codec.config.FeatureTest)  Time elapsed: 0.002 sec  <<< ERROR!
java.lang.NullPointerException: null
	at com.fasterxml.jackson.databind.JsonMappingException$Reference.toString(JsonMappingException.java:97)
	at com.fasterxml.jackson.databind.JsonMappingException._appendPathDesc(JsonMappingException.java:342)
	at com.fasterxml.jackson.databind.JsonMappingException.getPathReference(JsonMappingException.java:245)
	at com.fasterxml.jackson.databind.JsonMappingException._buildMessage(JsonMappingException.java:318)
	at com.fasterxml.jackson.databind.JsonMappingException.getMessage(JsonMappingException.java:299)
	at org.apache.maven.surefire.report.SmartStackTraceParser.toString(SmartStackTraceParser.java:308)
	at org.apache.maven.surefire.report.SmartStackTraceParser.innerMostWithFocusOnClass(SmartStackTraceParser.java:246)
	at org.apache.maven.surefire.common.junit4.JUnit4StackTraceWriter.writeTrimmedTraceToString(JUnit4StackTraceWriter.java:97)
	at org.apache.maven.surefire.booter.ForkingRunListener.encode(ForkingRunListener.java:330)
	at org.apache.maven.surefire.booter.ForkingRunListener.encode(ForkingRunListener.java:312)
	at org.apache.maven.surefire.booter.ForkingRunListener.toString(ForkingRunListener.java:258)
	at org.apache.maven.surefire.booter.ForkingRunListener.testError(ForkingRunListener.java:132)
	at org.apache.maven.surefire.common.junit4.JUnit4RunListener.testFailure(JUnit4RunListener.java:114)
	at org.junit.runner.notification.RunNotifier$4.notifyListener(RunNotifier.java:139)
	at org.junit.runner.notification.RunNotifier$SafeNotifier.run(RunNotifier.java:61)
	at org.junit.runner.notification.RunNotifier.fireTestFailures(RunNotifier.java:134)
	at org.junit.runner.notification.RunNotifier.fireTestFailure(RunNotifier.java:128)
	at org.junit.internal.runners.model.EachTestNotifier.addFailure(EachTestNotifier.java:23)
	at org.junit.runners.ParentRunner.runLeaf(ParentRunner.java:275)
	at org.junit.runners.BlockJUnit4ClassRunner.runChild(BlockJUnit4ClassRunner.java:70)
	at org.junit.runners.BlockJUnit4ClassRunner.runChild(BlockJUnit4ClassRunner.java:50)
	at org.junit.runners.ParentRunner$3.run(ParentRunner.java:238)
	at org.junit.runners.ParentRunner$1.schedule(ParentRunner.java:63)
	at org.junit.runners.ParentRunner.runChildren(ParentRunner.java:236)
	at org.junit.runners.ParentRunner.access$000(ParentRunner.java:53)
	at org.junit.runners.ParentRunner$2.evaluate(ParentRunner.java:229)
	at org.junit.runners.ParentRunner.run(ParentRunner.java:309)
	at org.apache.maven.surefire.junit4.JUnit4Provider.execute(JUnit4Provider.java:264)
	at org.apache.maven.surefire.junit4.JUnit4Provider.executeTestSet(JUnit4Provider.java:153)
	at org.apache.maven.surefire.junit4.JUnit4Provider.invoke(JUnit4Provider.java:124)
	at org.apache.maven.surefire.booter.ForkedBooter.invokeProviderInSameClassLoader(ForkedBooter.java:200)
	at org.apache.maven.surefire.booter.ForkedBooter.runSuitesInProcess(ForkedBooter.java:153)
	at org.apache.maven.surefire.booter.ForkedBooter.main(ForkedBooter.java:103)

primaryNestedObject(com.addthis.codec.config.FeatureTest)  Time elapsed: 0.003 sec  <<< ERROR!
java.lang.NullPointerException: null
	at com.fasterxml.jackson.databind.JsonMappingException$Reference.toString(JsonMappingException.java:97)
	at com.fasterxml.jackson.databind.JsonMappingException._appendPathDesc(JsonMappingException.java:342)
	at com.fasterxml.jackson.databind.JsonMappingException.getPathReference(JsonMappingException.java:245)
	at com.fasterxml.jackson.databind.JsonMappingException._buildMessage(JsonMappingException.java:318)
	at com.fasterxml.jackson.databind.JsonMappingException.getMessage(JsonMappingException.java:299)
	at org.apache.maven.surefire.report.SmartStackTraceParser.toString(SmartStackTraceParser.java:308)
	at org.apache.maven.surefire.report.SmartStackTraceParser.innerMostWithFocusOnClass(SmartStackTraceParser.java:246)
	at org.apache.maven.surefire.common.junit4.JUnit4StackTraceWriter.writeTrimmedTraceToString(JUnit4StackTraceWriter.java:97)
	at org.apache.maven.surefire.booter.ForkingRunListener.encode(ForkingRunListener.java:330)
	at org.apache.maven.surefire.booter.ForkingRunListener.encode(ForkingRunListener.java:312)
	at org.apache.maven.surefire.booter.ForkingRunListener.toString(ForkingRunListener.java:258)
	at org.apache.maven.surefire.booter.ForkingRunListener.testError(ForkingRunListener.java:132)
	at org.apache.maven.surefire.common.junit4.JUnit4RunListener.testFailure(JUnit4RunListener.java:114)
	at org.junit.runner.notification.RunNotifier$4.notifyListener(RunNotifier.java:139)
	at org.junit.runner.notification.RunNotifier$SafeNotifier.run(RunNotifier.java:61)
	at org.junit.runner.notification.RunNotifier.fireTestFailures(RunNotifier.java:134)
	at org.junit.runner.notification.RunNotifier.fireTestFailure(RunNotifier.java:128)
	at org.junit.internal.runners.model.EachTestNotifier.addFailure(EachTestNotifier.java:23)
	at org.junit.runners.ParentRunner.runLeaf(ParentRunner.java:275)
	at org.junit.runners.BlockJUnit4ClassRunner.runChild(BlockJUnit4ClassRunner.java:70)
	at org.junit.runners.BlockJUnit4ClassRunner.runChild(BlockJUnit4ClassRunner.java:50)
	at org.junit.runners.ParentRunner$3.run(ParentRunner.java:238)
	at org.junit.runners.ParentRunner$1.schedule(ParentRunner.java:63)
	at org.junit.runners.ParentRunner.runChildren(ParentRunner.java:236)
	at org.junit.runners.ParentRunner.access$000(ParentRunner.java:53)
	at org.junit.runners.ParentRunner$2.evaluate(ParentRunner.java:229)
	at org.junit.runners.ParentRunner.run(ParentRunner.java:309)
	at org.apache.maven.surefire.junit4.JUnit4Provider.execute(JUnit4Provider.java:264)
	at org.apache.maven.surefire.junit4.JUnit4Provider.executeTestSet(JUnit4Provider.java:153)
	at org.apache.maven.surefire.junit4.JUnit4Provider.invoke(JUnit4Provider.java:124)
	at org.apache.maven.surefire.booter.ForkedBooter.invokeProviderInSameClassLoader(ForkedBooter.java:200)
	at org.apache.maven.surefire.booter.ForkedBooter.runSuitesInProcess(ForkedBooter.java:153)
	at org.apache.maven.surefire.booter.ForkedBooter.main(ForkedBooter.java:103)

inheritanceJson(com.addthis.codec.config.FeatureTest)  Time elapsed: 0.002 sec  <<< ERROR!
java.lang.IllegalArgumentException: Could not instantiate an instance of the greet category that you have specified with "null".
Perhaps you intended one of the following: [holder, list, easy, subparse, config, enum, crowd, simple, multi, parse]
	at java.lang.Class.forName0(Native Method)
	at java.lang.Class.forName(Class.java:191)
	at com.addthis.codec.plugins.PluginMap.findAndValidateClass(PluginMap.java:270)
	at com.addthis.codec.plugins.PluginMap.getClass(PluginMap.java:222)
	at com.addthis.codec.jackson.CodecTypeIdResolver._typeFromId(CodecTypeIdResolver.java:49)
	at com.addthis.codec.jackson.CodecTypeIdResolver.typeFromId(CodecTypeIdResolver.java:38)
	at com.fasterxml.jackson.databind.jsontype.impl.TypeDeserializerBase._findDeserializer(TypeDeserializerBase.java:159)
	at com.addthis.codec.jackson.CodecTypeDeserializer.deserializeTypedFromAny(CodecTypeDeserializer.java:128)
	at com.addthis.codec.jackson.CodecTypeDeserializer.deserializeTypedFromObject(CodecTypeDeserializer.java:83)
	at com.fasterxml.jackson.databind.deser.BeanDeserializerBase.deserializeWithType(BeanDeserializerBase.java:956)
	at com.fasterxml.jackson.databind.deser.std.DelegatingDeserializer.deserializeWithType(DelegatingDeserializer.java:123)
	at com.fasterxml.jackson.databind.deser.impl.TypeWrappedDeserializer.deserialize(TypeWrappedDeserializer.java:41)
	at com.fasterxml.jackson.databind.ObjectReader._bindAndClose(ObjectReader.java:1269)
	at com.fasterxml.jackson.databind.ObjectReader.readValue(ObjectReader.java:896)
	at com.addthis.codec.json.CodecJSON.decodeString(CodecJSON.java:90)
	at com.addthis.codec.config.FeatureTest.inheritanceJson(FeatureTest.java:211)

bytesAndTime(com.addthis.codec.config.FeatureTest)  Time elapsed: 0.003 sec  <<< ERROR!
java.lang.NullPointerException: null
	at com.fasterxml.jackson.databind.JsonMappingException$Reference.toString(JsonMappingException.java:97)
	at com.fasterxml.jackson.databind.JsonMappingException._appendPathDesc(JsonMappingException.java:342)
	at com.fasterxml.jackson.databind.JsonMappingException.getPathReference(JsonMappingException.java:245)
	at com.fasterxml.jackson.databind.JsonMappingException._buildMessage(JsonMappingException.java:318)
	at com.fasterxml.jackson.databind.JsonMappingException.getMessage(JsonMappingException.java:299)
	at org.apache.maven.surefire.report.SmartStackTraceParser.toString(SmartStackTraceParser.java:308)
	at org.apache.maven.surefire.report.SmartStackTraceParser.innerMostWithFocusOnClass(SmartStackTraceParser.java:246)
	at org.apache.maven.surefire.common.junit4.JUnit4StackTraceWriter.writeTrimmedTraceToString(JUnit4StackTraceWriter.java:97)
	at org.apache.maven.surefire.booter.ForkingRunListener.encode(ForkingRunListener.java:330)
	at org.apache.maven.surefire.booter.ForkingRunListener.encode(ForkingRunListener.java:312)
	at org.apache.maven.surefire.booter.ForkingRunListener.toString(ForkingRunListener.java:258)
	at org.apache.maven.surefire.booter.ForkingRunListener.testError(ForkingRunListener.java:132)
	at org.apache.maven.surefire.common.junit4.JUnit4RunListener.testFailure(JUnit4RunListener.java:114)
	at org.junit.runner.notification.RunNotifier$4.notifyListener(RunNotifier.java:139)
	at org.junit.runner.notification.RunNotifier$SafeNotifier.run(RunNotifier.java:61)
	at org.junit.runner.notification.RunNotifier.fireTestFailures(RunNotifier.java:134)
	at org.junit.runner.notification.RunNotifier.fireTestFailure(RunNotifier.java:128)
	at org.junit.internal.runners.model.EachTestNotifier.addFailure(EachTestNotifier.java:23)
	at org.junit.runners.ParentRunner.runLeaf(ParentRunner.java:275)
	at org.junit.runners.BlockJUnit4ClassRunner.runChild(BlockJUnit4ClassRunner.java:70)
	at org.junit.runners.BlockJUnit4ClassRunner.runChild(BlockJUnit4ClassRunner.java:50)
	at org.junit.runners.ParentRunner$3.run(ParentRunner.java:238)
	at org.junit.runners.ParentRunner$1.schedule(ParentRunner.java:63)
	at org.junit.runners.ParentRunner.runChildren(ParentRunner.java:236)
	at org.junit.runners.ParentRunner.access$000(ParentRunner.java:53)
	at org.junit.runners.ParentRunner$2.evaluate(ParentRunner.java:229)
	at org.junit.runners.ParentRunner.run(ParentRunner.java:309)
	at org.apache.maven.surefire.junit4.JUnit4Provider.execute(JUnit4Provider.java:264)
	at org.apache.maven.surefire.junit4.JUnit4Provider.executeTestSet(JUnit4Provider.java:153)
	at org.apache.maven.surefire.junit4.JUnit4Provider.invoke(JUnit4Provider.java:124)
	at org.apache.maven.surefire.booter.ForkedBooter.invokeProviderInSameClassLoader(ForkedBooter.java:200)
	at org.apache.maven.surefire.booter.ForkedBooter.runSuitesInProcess(ForkedBooter.java:153)
	at org.apache.maven.surefire.booter.ForkedBooter.main(ForkedBooter.java:103)

autoArray(com.addthis.codec.config.FeatureTest)  Time elapsed: 0.003 sec  <<< FAILURE!
org.junit.ComparisonFailure: expected:<Hello World! Wh[ere are all my friends?]> but was:<Hello World! Wh[at a pleasant default suffix we are having!]>
	at org.junit.Assert.assertEquals(Assert.java:115)
	at org.junit.Assert.assertEquals(Assert.java:144)
	at com.addthis.codec.config.FeatureTest.autoArray(FeatureTest.java:74)

Running com.addthis.codec.CodecTest
Tests run: 6, Failures: 0, Errors: 0, Skipped: 0, Time elapsed: 0 sec - in com.addthis.codec.CodecTest
Running com.addthis.codec.CodecJsonBasicTest
Tests run: 5, Failures: 1, Errors: 0, Skipped: 0, Time elapsed: 0.235 sec <<< FAILURE! - in com.addthis.codec.CodecJsonBasicTest
subclasses(com.addthis.codec.CodecJsonBasicTest)  Time elapsed: 0.015 sec  <<< FAILURE!
java.lang.AssertionError: null
	at org.junit.Assert.fail(Assert.java:86)
	at org.junit.Assert.assertTrue(Assert.java:41)
	at org.junit.Assert.assertTrue(Assert.java:52)
	at com.addthis.codec.CodecBasicTests.subclasses(CodecBasicTests.java:57)
	at sun.reflect.NativeMethodAccessorImpl.invoke0(Native Method)
	at sun.reflect.NativeMethodAccessorImpl.invoke(NativeMethodAccessorImpl.java:57)
	at sun.reflect.DelegatingMethodAccessorImpl.invoke(DelegatingMethodAccessorImpl.java:43)
	at java.lang.reflect.Method.invoke(Method.java:606)
	at org.junit.runners.model.FrameworkMethod$1.runReflectiveCall(FrameworkMethod.java:47)
	at org.junit.internal.runners.model.ReflectiveCallable.run(ReflectiveCallable.java:12)
	at org.junit.runners.model.FrameworkMethod.invokeExplosively(FrameworkMethod.java:44)
	at org.junit.internal.runners.statements.InvokeMethod.evaluate(InvokeMethod.java:17)
	at org.junit.internal.runners.statements.RunBefores.evaluate(RunBefores.java:26)
	at org.junit.runners.ParentRunner.runLeaf(ParentRunner.java:271)
	at org.junit.runners.BlockJUnit4ClassRunner.runChild(BlockJUnit4ClassRunner.java:70)
	at org.junit.runners.BlockJUnit4ClassRunner.runChild(BlockJUnit4ClassRunner.java:50)
	at org.junit.runners.ParentRunner$3.run(ParentRunner.java:238)
	at org.junit.runners.ParentRunner$1.schedule(ParentRunner.java:63)
	at org.junit.runners.ParentRunner.runChildren(ParentRunner.java:236)
	at org.junit.runners.ParentRunner.access$000(ParentRunner.java:53)
	at org.junit.runners.ParentRunner$2.evaluate(ParentRunner.java:229)
	at org.junit.runners.ParentRunner.run(ParentRunner.java:309)
	at org.apache.maven.surefire.junit4.JUnit4Provider.execute(JUnit4Provider.java:264)
	at org.apache.maven.surefire.junit4.JUnit4Provider.executeTestSet(JUnit4Provider.java:153)
	at org.apache.maven.surefire.junit4.JUnit4Provider.invoke(JUnit4Provider.java:124)
	at org.apache.maven.surefire.booter.ForkedBooter.invokeProviderInSameClassLoader(ForkedBooter.java:200)
	at org.apache.maven.surefire.booter.ForkedBooter.runSuitesInProcess(ForkedBooter.java:153)
	at org.apache.maven.surefire.booter.ForkedBooter.main(ForkedBooter.java:103)

Running com.addthis.codec.CodecGenericsTest
Tests run: 1, Failures: 0, Errors: 0, Skipped: 0, Time elapsed: 0.016 sec - in com.addthis.codec.CodecGenericsTest
Running com.addthis.codec.CodecUtilTest
[main] INFO com.addthis.codec.CodecUtilTest - compareTest(abc,ab) sc(1) bc(1)
[main] INFO com.addthis.codec.CodecUtilTest - compareTest(abc,abc) sc(0) bc(0)
[main] INFO com.addthis.codec.CodecUtilTest - compareTest(abc,abcd) sc(-1) bc(-1)
[main] INFO com.addthis.codec.CodecUtilTest - compareTest(abc,def) sc(-3) bc(-3)
[main] INFO com.addthis.codec.CodecUtilTest - compareTest(def,abc) sc(3) bc(3)
[main] INFO com.addthis.codec.CodecUtilTest - compareTest(abcd,acbd) sc(-1) bc(-1)
Tests run: 1, Failures: 0, Errors: 0, Skipped: 0, Time elapsed: 0.004 sec - in com.addthis.codec.CodecUtilTest
Running com.addthis.codec.CodecBin2BasicTest
Tests run: 4, Failures: 0, Errors: 0, Skipped: 0, Time elapsed: 0.015 sec - in com.addthis.codec.CodecBin2BasicTest
Running com.addthis.codec.utils.ExecutorServiceBuilderTest
Tests run: 1, Failures: 0, Errors: 0, Skipped: 0, Time elapsed: 0.1 sec - in com.addthis.codec.utils.ExecutorServiceBuilderTest
Running com.addthis.codec.CodecObjectSubclassTest
[main] INFO com.addthis.codec.CodecObjectSubclassTest - en1[111] ->      ok1Bok1ok2Cok1ok2ok3Dok1ok2ok3ok4 ok1Bok1ok2Cok1ok2ok3
[main] INFO com.addthis.codec.CodecObjectSubclassTest - en2[111] ->      ok1Bok1ok2Cok1ok2ok3Dok1ok2ok3ok4 ok1Bok1ok2Cok1ok2ok3
[main] INFO com.addthis.codec.CodecObjectSubclassTest - CodecBin2 --> PASSED
[main] INFO com.addthis.codec.CodecObjectSubclassTest - en1[358] -> {"a":{"type":"A","field1":"ok1"},"b":{"type":"B","field1":"ok1","field2":"ok2"},"c":{"type":"C","field1":"ok1","field2":"ok2","field3":"ok3"},"d":{"type":"D","field1":"ok1","field2":"ok2","field3":"ok3","field4":"ok4","list4":[{"type":"A","field1":"ok1"},{"type":"B","field1":"ok1","field2":"ok2"},{"type":"C","field1":"ok1","field2":"ok2","field3":"ok3"}]}}
[main] INFO com.addthis.codec.CodecObjectSubclassTest - en2[129] -> {"a":{"type":"A","field1":"ok1"},"b":{"type":"A","field1":"ok1"},"c":{"type":"A","field1":"ok1"},"d":{"type":"A","field1":"ok1"}}
[main] INFO com.addthis.codec.CodecObjectSubclassTest - CodecJSON --> FAILED
Tests run: 1, Failures: 1, Errors: 0, Skipped: 0, Time elapsed: 0.019 sec <<< FAILURE! - in com.addthis.codec.CodecObjectSubclassTest
testAll(com.addthis.codec.CodecObjectSubclassTest)  Time elapsed: 0.017 sec  <<< FAILURE!
java.lang.AssertionError: null
	at org.junit.Assert.fail(Assert.java:86)
	at org.junit.Assert.assertTrue(Assert.java:41)
	at org.junit.Assert.assertTrue(Assert.java:52)
	at com.addthis.codec.CodecObjectSubclassTest.testAll(CodecObjectSubclassTest.java:55)

Running com.addthis.codec.plugins.PluginRegistryTest
Tests run: 7, Failures: 0, Errors: 0, Skipped: 0, Time elapsed: 0.031 sec - in com.addthis.codec.plugins.PluginRegistryTest

Results :

Failed tests: 
  FeatureTest.abstractDelegateEmpty:231 expected:<...t a pleasant default[-alias] suffix we are havin...> but was:<...t a pleasant default[] suffix we are havin...>
  FeatureTest.autoCollection:82 expected:<Hello World! Wh[ere are all my friends?]> but was:<Hello World! Wh[at a pleasant default suffix we are having!]>
  FeatureTest.autoArray:74 expected:<Hello World! Wh[ere are all my friends?]> but was:<Hello World! Wh[at a pleasant default suffix we are having!]>
  CodecJsonBasicTest>CodecBasicTests.subclasses:57 null
  CodecObjectSubclassTest.testAll:55 null

Tests in error: 
  CodecJSONTest.arraySugar:87 » JsonMapping Can not construct instance of com.ad...
  CodecJSONTest.typeSugar:79 » JsonMapping
  FeatureTest.inheritance:196 » IllegalArgument Could not instantiate an instanc...
  FeatureTest.concreteValue:204 » IllegalArgument Could not instantiate an insta...
  FeatureTest.inline:129 » JsonMapping Unrecognized field "message" (class com.a...
  FeatureTest.primaryArray:104 » JsonMapping
  FeatureTest.primaryNested:120 » JsonMapping
  FeatureTest.primary:96 » JsonMapping
  FeatureTest.greetArray:63 » JsonMapping Unrecognized field "crowd" (class com....
  FeatureTest.enums:187 » JsonMapping
  FeatureTest.abstractDelegate:220 » JsonMapping
  FeatureTest.arraySingle:145 » JsonMapping
  FeatureTest.primaryNestedObject:112 » JsonMapping
  FeatureTest.inheritanceJson:211 » IllegalArgument Could not instantiate an ins...
  FeatureTest.bytesAndTime:179 » JsonMapping

Tests run: 54, Failures: 5, Errors: 15, Skipped: 0

[INFO] ------------------------------------------------------------------------
[INFO] BUILD FAILURE
[INFO] ------------------------------------------------------------------------
[INFO] Total time: 9.358s
[INFO] Finished at: Sun Aug 02 02:01:29 BST 2015
[INFO] Final Memory: 17M/215M
[INFO] ------------------------------------------------------------------------
[ERROR] Failed to execute goal org.apache.maven.plugins:maven-surefire-plugin:2.17:test (default-test) on project codec: There are test failures.
[ERROR] 
[ERROR] Please refer to /home/perham/Study/LittleDarwin/Cases/codec-3.3.0/target/surefire-reports for the individual test results.
[ERROR] -> [Help 1]
[ERROR] 
[ERROR] To see the full stack trace of the errors, re-run Maven with the -e switch.
[ERROR] Re-run Maven using the -X switch to enable full debug logging.
[ERROR] 
[ERROR] For more information about the errors and possible solutions, please read the following articles:
[ERROR] [Help 1] http://cwiki.apache.org/confluence/display/MAVEN/MojoFailureException
