[INFO] Scanning for projects...
[INFO]                                                                         
[INFO] ------------------------------------------------------------------------
[INFO] Building Codec 3.3.0
[INFO] ------------------------------------------------------------------------
[INFO] 
[INFO] --- jacoco-maven-plugin:0.7.1.201405082137:prepare-agent (default) @ codec ---
[INFO] argLine set to -javaagent:/home/perham/.m2/repository/org/jacoco/org.jacoco.agent/0.7.1.201405082137/org.jacoco.agent-0.7.1.201405082137-runtime.jar=destfile=/home/perham/Study/LittleDarwin/Cases/codec-3.3.0/target/jacoco.exec
[INFO] 
[INFO] --- maven-resources-plugin:2.3:resources (default-resources) @ codec ---
[INFO] Using 'UTF-8' encoding to copy filtered resources.
[INFO] Copying 1 resource
[INFO] 
[INFO] --- maven-compiler-plugin:3.1:compile (default-compile) @ codec ---
[INFO] Changes detected - recompiling the module!
[INFO] Compiling 47 source files to /home/perham/Study/LittleDarwin/Cases/codec-3.3.0/target/classes
[WARNING] /home/perham/Study/LittleDarwin/Cases/codec-3.3.0/src/main/java/com/addthis/codec/jackson/CodecTypeIdResolver.java:[93,31] typeFromId(java.lang.String) in com.fasterxml.jackson.databind.jsontype.impl.TypeIdResolverBase has been deprecated
[WARNING] /home/perham/Study/LittleDarwin/Cases/codec-3.3.0/src/main/java/com/addthis/codec/binary/BufferIn.java:[35,28] readBytes(java.io.InputStream,int) in com.addthis.basis.util.Bytes has been deprecated
[WARNING] /home/perham/Study/LittleDarwin/Cases/codec-3.3.0/src/main/java/com/addthis/codec/binary/CodecBin2.java:[87,14] writeInt(int,java.io.OutputStream) in com.addthis.basis.util.Bytes has been deprecated
[WARNING] /home/perham/Study/LittleDarwin/Cases/codec-3.3.0/src/main/java/com/addthis/codec/binary/CodecBin2.java:[95,24] readInt(java.io.InputStream) in com.addthis.basis.util.Bytes has been deprecated
[WARNING] /home/perham/Study/LittleDarwin/Cases/codec-3.3.0/src/main/java/com/addthis/codec/binary/CodecBin2.java:[181,22] writeInt(int,java.io.OutputStream) in com.addthis.basis.util.Bytes has been deprecated
[WARNING] /home/perham/Study/LittleDarwin/Cases/codec-3.3.0/src/main/java/com/addthis/codec/binary/CodecBin2.java:[186,22] writeLong(long,java.io.OutputStream) in com.addthis.basis.util.Bytes has been deprecated
[WARNING] /home/perham/Study/LittleDarwin/Cases/codec-3.3.0/src/main/java/com/addthis/codec/binary/CodecBin2.java:[210,35] readInt(java.io.InputStream) in com.addthis.basis.util.Bytes has been deprecated
[WARNING] /home/perham/Study/LittleDarwin/Cases/codec-3.3.0/src/main/java/com/addthis/codec/binary/CodecBin2.java:[216,35] readLong(java.io.InputStream) in com.addthis.basis.util.Bytes has been deprecated
[WARNING] /home/perham/Study/LittleDarwin/Cases/codec-3.3.0/src/main/java/com/addthis/codec/binary/CodecBin2.java:[356,18] writeInt(int,java.io.OutputStream) in com.addthis.basis.util.Bytes has been deprecated
[WARNING] /home/perham/Study/LittleDarwin/Cases/codec-3.3.0/src/main/java/com/addthis/codec/binary/CodecBin2.java:[358,18] writeLong(long,java.io.OutputStream) in com.addthis.basis.util.Bytes has been deprecated
[WARNING] /home/perham/Study/LittleDarwin/Cases/codec-3.3.0/src/main/java/com/addthis/codec/binary/CodecBin2.java:[360,18] writeShort(short,java.io.OutputStream) in com.addthis.basis.util.Bytes has been deprecated
[WARNING] /home/perham/Study/LittleDarwin/Cases/codec-3.3.0/src/main/java/com/addthis/codec/binary/CodecBin2.java:[364,18] writeInt(int,java.io.OutputStream) in com.addthis.basis.util.Bytes has been deprecated
[WARNING] /home/perham/Study/LittleDarwin/Cases/codec-3.3.0/src/main/java/com/addthis/codec/binary/CodecBin2.java:[366,18] writeLong(long,java.io.OutputStream) in com.addthis.basis.util.Bytes has been deprecated
[WARNING] /home/perham/Study/LittleDarwin/Cases/codec-3.3.0/src/main/java/com/addthis/codec/binary/CodecBin2.java:[368,18] writeLong(long,java.io.OutputStream) in com.addthis.basis.util.Bytes has been deprecated
[WARNING] /home/perham/Study/LittleDarwin/Cases/codec-3.3.0/src/main/java/com/addthis/codec/binary/CodecBin2.java:[370,18] writeInt(int,java.io.OutputStream) in com.addthis.basis.util.Bytes has been deprecated
[WARNING] /home/perham/Study/LittleDarwin/Cases/codec-3.3.0/src/main/java/com/addthis/codec/binary/CodecBin2.java:[388,27] readInt(java.io.InputStream) in com.addthis.basis.util.Bytes has been deprecated
[WARNING] /home/perham/Study/LittleDarwin/Cases/codec-3.3.0/src/main/java/com/addthis/codec/binary/CodecBin2.java:[390,27] readLong(java.io.InputStream) in com.addthis.basis.util.Bytes has been deprecated
[WARNING] /home/perham/Study/LittleDarwin/Cases/codec-3.3.0/src/main/java/com/addthis/codec/binary/CodecBin2.java:[392,27] readShort(java.io.InputStream) in com.addthis.basis.util.Bytes has been deprecated
[WARNING] /home/perham/Study/LittleDarwin/Cases/codec-3.3.0/src/main/java/com/addthis/codec/binary/CodecBin2.java:[396,51] readLong(java.io.InputStream) in com.addthis.basis.util.Bytes has been deprecated
[WARNING] /home/perham/Study/LittleDarwin/Cases/codec-3.3.0/src/main/java/com/addthis/codec/binary/CodecBin2.java:[398,48] readInt(java.io.InputStream) in com.addthis.basis.util.Bytes has been deprecated
[WARNING] /home/perham/Study/LittleDarwin/Cases/codec-3.3.0/src/main/java/com/addthis/codec/binary/CodecBin2.java:[400,42] readLong(java.io.InputStream) in com.addthis.basis.util.Bytes has been deprecated
[WARNING] /home/perham/Study/LittleDarwin/Cases/codec-3.3.0/src/main/java/com/addthis/codec/binary/CodecBin2.java:[402,45] readInt(java.io.InputStream) in com.addthis.basis.util.Bytes has been deprecated
[WARNING] /home/perham/Study/LittleDarwin/Cases/codec-3.3.0/src/main/java/com/addthis/codec/binary/CodecBin2.java:[419,25] readCharString(java.io.InputStream) in com.addthis.basis.util.Bytes has been deprecated
[WARNING] /home/perham/Study/LittleDarwin/Cases/codec-3.3.0/src/main/java/com/addthis/codec/binary/CodecBin2.java:[421,25] readString(java.io.InputStream) in com.addthis.basis.util.Bytes has been deprecated
[WARNING] /home/perham/Study/LittleDarwin/Cases/codec-3.3.0/src/main/java/com/addthis/codec/binary/CodecBin2.java:[427,18] writeCharString(java.lang.String,java.io.OutputStream) in com.addthis.basis.util.Bytes has been deprecated
[WARNING] /home/perham/Study/LittleDarwin/Cases/codec-3.3.0/src/main/java/com/addthis/codec/binary/CodecBin2.java:[429,18] writeString(java.lang.String,java.io.OutputStream) in com.addthis.basis.util.Bytes has been deprecated
[WARNING] /home/perham/Study/LittleDarwin/Cases/codec-3.3.0/src/main/java/com/addthis/codec/jackson/CodecJackson.java: Some input files use unchecked or unsafe operations.
[WARNING] /home/perham/Study/LittleDarwin/Cases/codec-3.3.0/src/main/java/com/addthis/codec/jackson/CodecJackson.java: Recompile with -Xlint:unchecked for details.
[INFO] 
[INFO] --- maven-resources-plugin:2.3:testResources (default-testResources) @ codec ---
[INFO] Using 'UTF-8' encoding to copy filtered resources.
[INFO] Copying 10 resources
[INFO] 
[INFO] --- maven-compiler-plugin:3.1:testCompile (default-testCompile) @ codec ---
[INFO] Nothing to compile - all classes are up to date
[INFO] 
[INFO] --- maven-surefire-plugin:2.17:test (default-test) @ codec ---
[INFO] Surefire report directory: /home/perham/Study/LittleDarwin/Cases/codec-3.3.0/target/surefire-reports

-------------------------------------------------------
 T E S T S
-------------------------------------------------------
Running com.addthis.codec.jackson.WriteonlyPropertyIgnorerTest
Aug 02, 2015 1:57:11 AM org.hibernate.validator.internal.util.Version <clinit>
INFO: HV000001: Hibernate Validator 5.1.1.Final
Tests run: 1, Failures: 0, Errors: 0, Skipped: 0, Time elapsed: 3.023 sec - in com.addthis.codec.jackson.WriteonlyPropertyIgnorerTest
Running com.addthis.codec.CodecRWOnlyTest
{"read1":123,"read2":234,"write1":456,"write2":567}
r1:111,r2:222,w1:333,w2:444
Tests run: 1, Failures: 0, Errors: 0, Skipped: 0, Time elapsed: 0.009 sec - in com.addthis.codec.CodecRWOnlyTest
Running com.addthis.codec.json.CodecJSONTest
Tests run: 4, Failures: 0, Errors: 0, Skipped: 0, Time elapsed: 0.061 sec - in com.addthis.codec.json.CodecJSONTest
Running com.addthis.codec.config.FeatureTest
[main] INFO com.addthis.codec.config.FeatureTest - unresolved {
    # config/defaultgreeter.conf: 1
    "greet" : {}
}

[main] INFO com.addthis.codec.config.FeatureTest - resolved {
    # plugins/greet-complex.conf: 38
    "_class" : "simple",
    # plugins/greet-complex.conf: 39
    "suffix" : "! What a pleasant default-alias suffix we are having!",
    # greet default type : plugins/greet-complex.conf: 37
    "type" : "simple"
}

Tests run: 22, Failures: 0, Errors: 5, Skipped: 0, Time elapsed: 0.255 sec <<< FAILURE! - in com.addthis.codec.config.FeatureTest
inheritance(com.addthis.codec.config.FeatureTest)  Time elapsed: 0.043 sec  <<< ERROR!
com.fasterxml.jackson.databind.JsonMappingException: Can not construct instance of com.addthis.codec.plugins.ParseGreetSub, problem: no type specified, more than one key, and both multi-array-primary and multi-simple-primary match for inlined types.
 at [Source: SimpleConfigObject({"bytes":"512KB","other":{"enum":{"timeUnit":"SECONDS"}}}); line: 1, column: -1] (through reference chain: com.fasterxml.jackson.databind.type.SimpleType["multi-array-primary"])
	at com.fasterxml.jackson.databind.JsonMappingException.from(JsonMappingException.java:148)
	at com.fasterxml.jackson.databind.DeserializationContext.instantiationException(DeserializationContext.java:784)
	at com.addthis.codec.jackson.CodecTypeDeserializer._deserializeObjectFromInlinedType(CodecTypeDeserializer.java:89)
	at com.addthis.codec.jackson.CodecTypeDeserializer._deserializeTypedFromObject(CodecTypeDeserializer.java:70)
	at com.addthis.codec.jackson.CodecTypeDeserializer.deserializeTypedFromAny(CodecTypeDeserializer.java:59)
	at com.addthis.codec.jackson.CodecTypeDeserializer.deserializeTypedFromObject(CodecTypeDeserializer.java:47)
	at com.fasterxml.jackson.databind.deser.BeanDeserializerBase.deserializeWithType(BeanDeserializerBase.java:956)
	at com.fasterxml.jackson.databind.deser.std.DelegatingDeserializer.deserializeWithType(DelegatingDeserializer.java:123)
	at com.fasterxml.jackson.databind.deser.impl.TypeWrappedDeserializer.deserialize(TypeWrappedDeserializer.java:41)
	at com.fasterxml.jackson.databind.ObjectMapper._readValue(ObjectMapper.java:3038)
	at com.fasterxml.jackson.databind.ObjectMapper.readValue(ObjectMapper.java:1652)
	at com.fasterxml.jackson.core.JsonParser.readValueAs(JsonParser.java:1346)
	at com.addthis.codec.jackson.CodecJackson.decodeObject(CodecJackson.java:116)
	at com.addthis.codec.jackson.CodecJackson.decodeObject(CodecJackson.java:174)
	at com.addthis.codec.config.Configs.decodeObject(Configs.java:71)
	at com.addthis.codec.config.FeatureTest.inheritance(FeatureTest.java:196)

abstractDelegateEmpty(com.addthis.codec.config.FeatureTest)  Time elapsed: 0.008 sec  <<< ERROR!
com.fasterxml.jackson.databind.JsonMappingException: Can not construct instance of com.addthis.codec.plugins.Greeter, problem: no type specified, more than one key, and both multi-array-primary and multi-simple-primary match for inlined types.
 at [Source: SimpleConfigObject({}); line: 1, column: -1] (through reference chain: com.fasterxml.jackson.databind.type.SimpleType["holder"]->com.fasterxml.jackson.databind.type.SimpleType["multi-array-primary"])
	at com.fasterxml.jackson.databind.JsonMappingException.from(JsonMappingException.java:148)
	at com.fasterxml.jackson.databind.DeserializationContext.instantiationException(DeserializationContext.java:784)
	at com.addthis.codec.jackson.CodecTypeDeserializer._deserializeObjectFromInlinedType(CodecTypeDeserializer.java:89)
	at com.addthis.codec.jackson.CodecTypeDeserializer._deserializeTypedFromObject(CodecTypeDeserializer.java:70)
	at com.addthis.codec.jackson.CodecTypeDeserializer.deserializeTypedFromAny(CodecTypeDeserializer.java:59)
	at com.addthis.codec.jackson.CodecTypeDeserializer.deserializeTypedFromObject(CodecTypeDeserializer.java:47)
	at com.fasterxml.jackson.databind.deser.AbstractDeserializer.deserializeWithType(AbstractDeserializer.java:132)
	at com.fasterxml.jackson.databind.deser.impl.TypeWrappedDeserializer.deserialize(TypeWrappedDeserializer.java:41)
	at com.fasterxml.jackson.databind.deser.BeanDeserializerBase.deserializeFromObjectUsingNonDefault(BeanDeserializerBase.java:1060)
	at com.fasterxml.jackson.databind.deser.BeanDeserializer.deserializeFromObject(BeanDeserializer.java:264)
	at com.fasterxml.jackson.databind.deser.BeanDeserializer.deserialize(BeanDeserializer.java:124)
	at com.addthis.codec.jackson.CodecBeanDeserializer.deserialize(CodecBeanDeserializer.java:82)
	at com.addthis.codec.jackson.CodecTypeDeserializer._deserializeObjectFromSingleKey(CodecTypeDeserializer.java:125)
	at com.addthis.codec.jackson.CodecTypeDeserializer._deserializeTypedFromObject(CodecTypeDeserializer.java:68)
	at com.addthis.codec.jackson.CodecTypeDeserializer.deserializeTypedFromAny(CodecTypeDeserializer.java:59)
	at com.addthis.codec.jackson.CodecTypeDeserializer.deserializeTypedFromObject(CodecTypeDeserializer.java:47)
	at com.fasterxml.jackson.databind.deser.AbstractDeserializer.deserializeWithType(AbstractDeserializer.java:132)
	at com.fasterxml.jackson.databind.deser.impl.TypeWrappedDeserializer.deserialize(TypeWrappedDeserializer.java:41)
	at com.fasterxml.jackson.databind.ObjectMapper._readValue(ObjectMapper.java:3038)
	at com.fasterxml.jackson.databind.ObjectMapper.readValue(ObjectMapper.java:1652)
	at com.fasterxml.jackson.core.JsonParser.readValueAs(JsonParser.java:1346)
	at com.addthis.codec.jackson.CodecJackson.decodeObject(CodecJackson.java:116)
	at com.addthis.codec.jackson.CodecJackson.decodeObject(CodecJackson.java:174)
	at com.addthis.codec.jackson.CodecJackson.decodeObject(CodecJackson.java:152)
	at com.addthis.codec.config.Configs.decodeObject(Configs.java:90)
	at com.addthis.codec.config.FeatureTest.abstractDelegateEmpty(FeatureTest.java:229)

inline(com.addthis.codec.config.FeatureTest)  Time elapsed: 0.008 sec  <<< ERROR!
com.fasterxml.jackson.databind.JsonMappingException: Unrecognized field "multi-simple-primary" (class com.addthis.codec.plugins.MultiGreet), not marked as ignorable (4 known properties: "parts", "suffix", "prefix", "message"])
 at [Source: ConfigString(" even simpler"); line: 1, column: -1] (through reference chain: com.addthis.codec.plugins.MultiGreet["multi-simple-primary"])
	at com.fasterxml.jackson.databind.exc.UnrecognizedPropertyException.from(UnrecognizedPropertyException.java:51)
	at com.fasterxml.jackson.databind.DeserializationContext.reportUnknownProperty(DeserializationContext.java:744)
	at com.fasterxml.jackson.databind.deser.std.StdDeserializer.handleUnknownProperty(StdDeserializer.java:915)
	at com.fasterxml.jackson.databind.deser.BeanDeserializerBase.handleUnknownProperty(BeanDeserializerBase.java:1306)
	at com.fasterxml.jackson.databind.deser.BeanDeserializerBase.handleUnknownVanilla(BeanDeserializerBase.java:1284)
	at com.fasterxml.jackson.databind.deser.BeanDeserializer.vanillaDeserialize(BeanDeserializer.java:243)
	at com.fasterxml.jackson.databind.deser.BeanDeserializer.deserialize(BeanDeserializer.java:118)
	at com.addthis.codec.jackson.CodecBeanDeserializer.deserialize(CodecBeanDeserializer.java:82)
	at com.addthis.codec.jackson.CodecTypeDeserializer._deserializeObjectFromInlinedType(CodecTypeDeserializer.java:103)
	at com.addthis.codec.jackson.CodecTypeDeserializer._deserializeTypedFromObject(CodecTypeDeserializer.java:70)
	at com.addthis.codec.jackson.CodecTypeDeserializer.deserializeTypedFromAny(CodecTypeDeserializer.java:59)
	at com.addthis.codec.jackson.CodecTypeDeserializer.deserializeTypedFromObject(CodecTypeDeserializer.java:47)
	at com.fasterxml.jackson.databind.deser.AbstractDeserializer.deserializeWithType(AbstractDeserializer.java:132)
	at com.fasterxml.jackson.databind.deser.impl.TypeWrappedDeserializer.deserialize(TypeWrappedDeserializer.java:41)
	at com.fasterxml.jackson.databind.ObjectMapper._readValue(ObjectMapper.java:3038)
	at com.fasterxml.jackson.databind.ObjectMapper.readValue(ObjectMapper.java:1652)
	at com.fasterxml.jackson.core.JsonParser.readValueAs(JsonParser.java:1346)
	at com.addthis.codec.jackson.CodecJackson.decodeObject(CodecJackson.java:116)
	at com.addthis.codec.jackson.CodecJackson.decodeObject(CodecJackson.java:205)
	at com.addthis.codec.config.Configs.decodeObject(Configs.java:118)
	at com.addthis.codec.config.FeatureTest.inline(FeatureTest.java:129)

greetDefault(com.addthis.codec.config.FeatureTest)  Time elapsed: 0.002 sec  <<< ERROR!
com.fasterxml.jackson.databind.JsonMappingException: Can not construct instance of com.addthis.codec.plugins.Greeter, problem: no type specified, more than one key, and both multi-array-primary and multi-simple-primary match for inlined types.
 at [Source: SimpleConfigObject({}); line: 1, column: -1] (through reference chain: com.fasterxml.jackson.databind.type.SimpleType["multi-array-primary"])
	at com.fasterxml.jackson.databind.JsonMappingException.from(JsonMappingException.java:148)
	at com.fasterxml.jackson.databind.DeserializationContext.instantiationException(DeserializationContext.java:784)
	at com.addthis.codec.jackson.CodecTypeDeserializer._deserializeObjectFromInlinedType(CodecTypeDeserializer.java:89)
	at com.addthis.codec.jackson.CodecTypeDeserializer._deserializeTypedFromObject(CodecTypeDeserializer.java:70)
	at com.addthis.codec.jackson.CodecTypeDeserializer.deserializeTypedFromAny(CodecTypeDeserializer.java:59)
	at com.addthis.codec.jackson.CodecTypeDeserializer.deserializeTypedFromObject(CodecTypeDeserializer.java:47)
	at com.fasterxml.jackson.databind.deser.AbstractDeserializer.deserializeWithType(AbstractDeserializer.java:132)
	at com.fasterxml.jackson.databind.deser.impl.TypeWrappedDeserializer.deserialize(TypeWrappedDeserializer.java:41)
	at com.fasterxml.jackson.databind.ObjectMapper._readValue(ObjectMapper.java:3038)
	at com.fasterxml.jackson.databind.ObjectMapper.readValue(ObjectMapper.java:1652)
	at com.fasterxml.jackson.core.JsonParser.readValueAs(JsonParser.java:1346)
	at com.addthis.codec.jackson.CodecJackson.decodeObject(CodecJackson.java:116)
	at com.addthis.codec.jackson.CodecJackson.decodeObject(CodecJackson.java:205)
	at com.addthis.codec.config.Configs.decodeObject(Configs.java:118)
	at com.addthis.codec.config.FeatureTest.greetDefault(FeatureTest.java:44)

inheritanceJson(com.addthis.codec.config.FeatureTest)  Time elapsed: 0.001 sec  <<< ERROR!
com.fasterxml.jackson.databind.JsonMappingException: Can not construct instance of com.addthis.codec.plugins.ParseGreetSub, problem: no type specified, more than one key, and both multi-array-primary and multi-simple-primary match for inlined types.
 at [Source: {bytes: 512, other: {enum: {timeUnit: ["SECONDS"]}}}; line: 1, column: 52] (through reference chain: com.fasterxml.jackson.databind.type.SimpleType["multi-array-primary"])
	at com.fasterxml.jackson.databind.JsonMappingException.from(JsonMappingException.java:148)
	at com.fasterxml.jackson.databind.DeserializationContext.instantiationException(DeserializationContext.java:784)
	at com.addthis.codec.jackson.CodecTypeDeserializer._deserializeObjectFromInlinedType(CodecTypeDeserializer.java:89)
	at com.addthis.codec.jackson.CodecTypeDeserializer._deserializeTypedFromObject(CodecTypeDeserializer.java:70)
	at com.addthis.codec.jackson.CodecTypeDeserializer.deserializeTypedFromAny(CodecTypeDeserializer.java:59)
	at com.addthis.codec.jackson.CodecTypeDeserializer.deserializeTypedFromObject(CodecTypeDeserializer.java:47)
	at com.fasterxml.jackson.databind.deser.BeanDeserializerBase.deserializeWithType(BeanDeserializerBase.java:956)
	at com.fasterxml.jackson.databind.deser.std.DelegatingDeserializer.deserializeWithType(DelegatingDeserializer.java:123)
	at com.fasterxml.jackson.databind.deser.impl.TypeWrappedDeserializer.deserialize(TypeWrappedDeserializer.java:41)
	at com.fasterxml.jackson.databind.ObjectReader._bindAndClose(ObjectReader.java:1269)
	at com.fasterxml.jackson.databind.ObjectReader.readValue(ObjectReader.java:896)
	at com.addthis.codec.json.CodecJSON.decodeString(CodecJSON.java:90)
	at com.addthis.codec.config.FeatureTest.inheritanceJson(FeatureTest.java:211)

Running com.addthis.codec.CodecTest
Tests run: 6, Failures: 0, Errors: 0, Skipped: 0, Time elapsed: 0.001 sec - in com.addthis.codec.CodecTest
Running com.addthis.codec.CodecJsonBasicTest
Tests run: 5, Failures: 0, Errors: 0, Skipped: 0, Time elapsed: 0.197 sec - in com.addthis.codec.CodecJsonBasicTest
Running com.addthis.codec.CodecGenericsTest
Tests run: 1, Failures: 0, Errors: 0, Skipped: 0, Time elapsed: 0.017 sec - in com.addthis.codec.CodecGenericsTest
Running com.addthis.codec.CodecUtilTest
[main] INFO com.addthis.codec.CodecUtilTest - compareTest(abc,ab) sc(1) bc(1)
[main] INFO com.addthis.codec.CodecUtilTest - compareTest(abc,abc) sc(0) bc(0)
[main] INFO com.addthis.codec.CodecUtilTest - compareTest(abc,abcd) sc(-1) bc(-1)
[main] INFO com.addthis.codec.CodecUtilTest - compareTest(abc,def) sc(-3) bc(-3)
[main] INFO com.addthis.codec.CodecUtilTest - compareTest(def,abc) sc(3) bc(3)
[main] INFO com.addthis.codec.CodecUtilTest - compareTest(abcd,acbd) sc(-1) bc(-1)
Tests run: 1, Failures: 0, Errors: 0, Skipped: 0, Time elapsed: 0.001 sec - in com.addthis.codec.CodecUtilTest
Running com.addthis.codec.CodecBin2BasicTest
Tests run: 4, Failures: 0, Errors: 0, Skipped: 0, Time elapsed: 0.008 sec - in com.addthis.codec.CodecBin2BasicTest
Running com.addthis.codec.utils.ExecutorServiceBuilderTest
Tests run: 1, Failures: 0, Errors: 0, Skipped: 0, Time elapsed: 0.089 sec - in com.addthis.codec.utils.ExecutorServiceBuilderTest
Running com.addthis.codec.CodecObjectSubclassTest
[main] INFO com.addthis.codec.CodecObjectSubclassTest - en1[111] ->      ok1Bok1ok2Cok1ok2ok3Dok1ok2ok3ok4 ok1Bok1ok2Cok1ok2ok3
[main] INFO com.addthis.codec.CodecObjectSubclassTest - en2[111] ->      ok1Bok1ok2Cok1ok2ok3Dok1ok2ok3ok4 ok1Bok1ok2Cok1ok2ok3
[main] INFO com.addthis.codec.CodecObjectSubclassTest - CodecBin2 --> PASSED
[main] INFO com.addthis.codec.CodecObjectSubclassTest - en1[358] -> {"a":{"type":"A","field1":"ok1"},"b":{"type":"B","field1":"ok1","field2":"ok2"},"c":{"type":"C","field1":"ok1","field2":"ok2","field3":"ok3"},"d":{"type":"D","field1":"ok1","field2":"ok2","field3":"ok3","field4":"ok4","list4":[{"type":"A","field1":"ok1"},{"type":"B","field1":"ok1","field2":"ok2"},{"type":"C","field1":"ok1","field2":"ok2","field3":"ok3"}]}}
[main] INFO com.addthis.codec.CodecObjectSubclassTest - en2[358] -> {"a":{"type":"A","field1":"ok1"},"b":{"type":"B","field1":"ok1","field2":"ok2"},"c":{"type":"C","field1":"ok1","field2":"ok2","field3":"ok3"},"d":{"type":"D","field1":"ok1","field2":"ok2","field3":"ok3","field4":"ok4","list4":[{"type":"A","field1":"ok1"},{"type":"B","field1":"ok1","field2":"ok2"},{"type":"C","field1":"ok1","field2":"ok2","field3":"ok3"}]}}
[main] INFO com.addthis.codec.CodecObjectSubclassTest - CodecJSON --> PASSED
Tests run: 1, Failures: 0, Errors: 0, Skipped: 0, Time elapsed: 0.025 sec - in com.addthis.codec.CodecObjectSubclassTest
Running com.addthis.codec.plugins.PluginRegistryTest
Tests run: 7, Failures: 0, Errors: 0, Skipped: 0, Time elapsed: 0.036 sec - in com.addthis.codec.plugins.PluginRegistryTest

Results :

Tests in error: 
  FeatureTest.inheritance:196 » JsonMapping Can not construct instance of com.ad...
  FeatureTest.abstractDelegateEmpty:229 » JsonMapping Can not construct instance...
  FeatureTest.inline:129 » JsonMapping Unrecognized field "multi-simple-primary"...
  FeatureTest.greetDefault:44 » JsonMapping Can not construct instance of com.ad...
  FeatureTest.inheritanceJson:211 » JsonMapping Can not construct instance of co...

Tests run: 54, Failures: 0, Errors: 5, Skipped: 0

[INFO] ------------------------------------------------------------------------
[INFO] BUILD FAILURE
[INFO] ------------------------------------------------------------------------
[INFO] Total time: 9.154s
[INFO] Finished at: Sun Aug 02 01:57:12 BST 2015
[INFO] Final Memory: 17M/219M
[INFO] ------------------------------------------------------------------------
[ERROR] Failed to execute goal org.apache.maven.plugins:maven-surefire-plugin:2.17:test (default-test) on project codec: There are test failures.
[ERROR] 
[ERROR] Please refer to /home/perham/Study/LittleDarwin/Cases/codec-3.3.0/target/surefire-reports for the individual test results.
[ERROR] -> [Help 1]
[ERROR] 
[ERROR] To see the full stack trace of the errors, re-run Maven with the -e switch.
[ERROR] Re-run Maven using the -X switch to enable full debug logging.
[ERROR] 
[ERROR] For more information about the errors and possible solutions, please read the following articles:
[ERROR] [Help 1] http://cwiki.apache.org/confluence/display/MAVEN/MojoFailureException
