[INFO] Scanning for projects...
[INFO]                                                                         
[INFO] ------------------------------------------------------------------------
[INFO] Building Codec 3.3.0
[INFO] ------------------------------------------------------------------------
[INFO] 
[INFO] --- jacoco-maven-plugin:0.7.1.201405082137:prepare-agent (default) @ codec ---
[INFO] argLine set to -javaagent:/home/perham/.m2/repository/org/jacoco/org.jacoco.agent/0.7.1.201405082137/org.jacoco.agent-0.7.1.201405082137-runtime.jar=destfile=/home/perham/Study/LittleDarwin/Cases/codec-3.3.0/target/jacoco.exec
[INFO] 
[INFO] --- maven-resources-plugin:2.3:resources (default-resources) @ codec ---
[INFO] Using 'UTF-8' encoding to copy filtered resources.
[INFO] Copying 1 resource
[INFO] 
[INFO] --- maven-compiler-plugin:3.1:compile (default-compile) @ codec ---
[INFO] Changes detected - recompiling the module!
[INFO] Compiling 47 source files to /home/perham/Study/LittleDarwin/Cases/codec-3.3.0/target/classes
[WARNING] /home/perham/Study/LittleDarwin/Cases/codec-3.3.0/src/main/java/com/addthis/codec/jackson/CodecTypeIdResolver.java:[93,31] typeFromId(java.lang.String) in com.fasterxml.jackson.databind.jsontype.impl.TypeIdResolverBase has been deprecated
[WARNING] /home/perham/Study/LittleDarwin/Cases/codec-3.3.0/src/main/java/com/addthis/codec/binary/BufferIn.java:[35,28] readBytes(java.io.InputStream,int) in com.addthis.basis.util.Bytes has been deprecated
[WARNING] /home/perham/Study/LittleDarwin/Cases/codec-3.3.0/src/main/java/com/addthis/codec/binary/CodecBin2.java:[87,14] writeInt(int,java.io.OutputStream) in com.addthis.basis.util.Bytes has been deprecated
[WARNING] /home/perham/Study/LittleDarwin/Cases/codec-3.3.0/src/main/java/com/addthis/codec/binary/CodecBin2.java:[95,24] readInt(java.io.InputStream) in com.addthis.basis.util.Bytes has been deprecated
[WARNING] /home/perham/Study/LittleDarwin/Cases/codec-3.3.0/src/main/java/com/addthis/codec/binary/CodecBin2.java:[181,22] writeInt(int,java.io.OutputStream) in com.addthis.basis.util.Bytes has been deprecated
[WARNING] /home/perham/Study/LittleDarwin/Cases/codec-3.3.0/src/main/java/com/addthis/codec/binary/CodecBin2.java:[186,22] writeLong(long,java.io.OutputStream) in com.addthis.basis.util.Bytes has been deprecated
[WARNING] /home/perham/Study/LittleDarwin/Cases/codec-3.3.0/src/main/java/com/addthis/codec/binary/CodecBin2.java:[210,35] readInt(java.io.InputStream) in com.addthis.basis.util.Bytes has been deprecated
[WARNING] /home/perham/Study/LittleDarwin/Cases/codec-3.3.0/src/main/java/com/addthis/codec/binary/CodecBin2.java:[216,35] readLong(java.io.InputStream) in com.addthis.basis.util.Bytes has been deprecated
[WARNING] /home/perham/Study/LittleDarwin/Cases/codec-3.3.0/src/main/java/com/addthis/codec/binary/CodecBin2.java:[356,18] writeInt(int,java.io.OutputStream) in com.addthis.basis.util.Bytes has been deprecated
[WARNING] /home/perham/Study/LittleDarwin/Cases/codec-3.3.0/src/main/java/com/addthis/codec/binary/CodecBin2.java:[358,18] writeLong(long,java.io.OutputStream) in com.addthis.basis.util.Bytes has been deprecated
[WARNING] /home/perham/Study/LittleDarwin/Cases/codec-3.3.0/src/main/java/com/addthis/codec/binary/CodecBin2.java:[360,18] writeShort(short,java.io.OutputStream) in com.addthis.basis.util.Bytes has been deprecated
[WARNING] /home/perham/Study/LittleDarwin/Cases/codec-3.3.0/src/main/java/com/addthis/codec/binary/CodecBin2.java:[364,18] writeInt(int,java.io.OutputStream) in com.addthis.basis.util.Bytes has been deprecated
[WARNING] /home/perham/Study/LittleDarwin/Cases/codec-3.3.0/src/main/java/com/addthis/codec/binary/CodecBin2.java:[366,18] writeLong(long,java.io.OutputStream) in com.addthis.basis.util.Bytes has been deprecated
[WARNING] /home/perham/Study/LittleDarwin/Cases/codec-3.3.0/src/main/java/com/addthis/codec/binary/CodecBin2.java:[368,18] writeLong(long,java.io.OutputStream) in com.addthis.basis.util.Bytes has been deprecated
[WARNING] /home/perham/Study/LittleDarwin/Cases/codec-3.3.0/src/main/java/com/addthis/codec/binary/CodecBin2.java:[370,18] writeInt(int,java.io.OutputStream) in com.addthis.basis.util.Bytes has been deprecated
[WARNING] /home/perham/Study/LittleDarwin/Cases/codec-3.3.0/src/main/java/com/addthis/codec/binary/CodecBin2.java:[388,27] readInt(java.io.InputStream) in com.addthis.basis.util.Bytes has been deprecated
[WARNING] /home/perham/Study/LittleDarwin/Cases/codec-3.3.0/src/main/java/com/addthis/codec/binary/CodecBin2.java:[390,27] readLong(java.io.InputStream) in com.addthis.basis.util.Bytes has been deprecated
[WARNING] /home/perham/Study/LittleDarwin/Cases/codec-3.3.0/src/main/java/com/addthis/codec/binary/CodecBin2.java:[392,27] readShort(java.io.InputStream) in com.addthis.basis.util.Bytes has been deprecated
[WARNING] /home/perham/Study/LittleDarwin/Cases/codec-3.3.0/src/main/java/com/addthis/codec/binary/CodecBin2.java:[396,51] readLong(java.io.InputStream) in com.addthis.basis.util.Bytes has been deprecated
[WARNING] /home/perham/Study/LittleDarwin/Cases/codec-3.3.0/src/main/java/com/addthis/codec/binary/CodecBin2.java:[398,48] readInt(java.io.InputStream) in com.addthis.basis.util.Bytes has been deprecated
[WARNING] /home/perham/Study/LittleDarwin/Cases/codec-3.3.0/src/main/java/com/addthis/codec/binary/CodecBin2.java:[400,42] readLong(java.io.InputStream) in com.addthis.basis.util.Bytes has been deprecated
[WARNING] /home/perham/Study/LittleDarwin/Cases/codec-3.3.0/src/main/java/com/addthis/codec/binary/CodecBin2.java:[402,45] readInt(java.io.InputStream) in com.addthis.basis.util.Bytes has been deprecated
[WARNING] /home/perham/Study/LittleDarwin/Cases/codec-3.3.0/src/main/java/com/addthis/codec/binary/CodecBin2.java:[419,25] readCharString(java.io.InputStream) in com.addthis.basis.util.Bytes has been deprecated
[WARNING] /home/perham/Study/LittleDarwin/Cases/codec-3.3.0/src/main/java/com/addthis/codec/binary/CodecBin2.java:[421,25] readString(java.io.InputStream) in com.addthis.basis.util.Bytes has been deprecated
[WARNING] /home/perham/Study/LittleDarwin/Cases/codec-3.3.0/src/main/java/com/addthis/codec/binary/CodecBin2.java:[427,18] writeCharString(java.lang.String,java.io.OutputStream) in com.addthis.basis.util.Bytes has been deprecated
[WARNING] /home/perham/Study/LittleDarwin/Cases/codec-3.3.0/src/main/java/com/addthis/codec/binary/CodecBin2.java:[429,18] writeString(java.lang.String,java.io.OutputStream) in com.addthis.basis.util.Bytes has been deprecated
[WARNING] /home/perham/Study/LittleDarwin/Cases/codec-3.3.0/src/main/java/com/addthis/codec/jackson/CodecJackson.java: Some input files use unchecked or unsafe operations.
[WARNING] /home/perham/Study/LittleDarwin/Cases/codec-3.3.0/src/main/java/com/addthis/codec/jackson/CodecJackson.java: Recompile with -Xlint:unchecked for details.
[INFO] 
[INFO] --- maven-resources-plugin:2.3:testResources (default-testResources) @ codec ---
[INFO] Using 'UTF-8' encoding to copy filtered resources.
[INFO] Copying 10 resources
[INFO] 
[INFO] --- maven-compiler-plugin:3.1:testCompile (default-testCompile) @ codec ---
[INFO] Nothing to compile - all classes are up to date
[INFO] 
[INFO] --- maven-surefire-plugin:2.17:test (default-test) @ codec ---
[INFO] Surefire report directory: /home/perham/Study/LittleDarwin/Cases/codec-3.3.0/target/surefire-reports

-------------------------------------------------------
 T E S T S
-------------------------------------------------------
Running com.addthis.codec.jackson.WriteonlyPropertyIgnorerTest
Aug 02, 2015 1:37:11 AM org.hibernate.validator.internal.util.Version <clinit>
INFO: HV000001: Hibernate Validator 5.1.1.Final
Tests run: 1, Failures: 0, Errors: 0, Skipped: 0, Time elapsed: 2.954 sec - in com.addthis.codec.jackson.WriteonlyPropertyIgnorerTest
Running com.addthis.codec.CodecRWOnlyTest
{"read1":123,"read2":234,"write1":456,"write2":567}
r1:111,r2:222,w1:333,w2:444
Tests run: 1, Failures: 0, Errors: 0, Skipped: 0, Time elapsed: 0.021 sec - in com.addthis.codec.CodecRWOnlyTest
Running com.addthis.codec.json.CodecJSONTest
Tests run: 4, Failures: 0, Errors: 0, Skipped: 0, Time elapsed: 0.084 sec - in com.addthis.codec.json.CodecJSONTest
Running com.addthis.codec.config.FeatureTest
[main] INFO com.addthis.codec.config.FeatureTest - unresolved {
    # config/defaultgreeter.conf: 1
    "greet" : {}
}

[main] INFO com.addthis.codec.config.FeatureTest - resolved {
    # plugins/greet-complex.conf: 38
    "_class" : "simple",
    # plugins/greet-complex.conf: 39
    "suffix" : "! What a pleasant default-alias suffix we are having!",
    # greet default type : plugins/greet-complex.conf: 37
    "type" : "simple"
}

Tests run: 22, Failures: 17, Errors: 1, Skipped: 0, Time elapsed: 0.303 sec <<< FAILURE! - in com.addthis.codec.config.FeatureTest
inheritance(com.addthis.codec.config.FeatureTest)  Time elapsed: 0.13 sec  <<< FAILURE!
org.junit.ComparisonFailure: expected:<extra extra! other [[SECONDS] bytes: 52428]8 millis: 1000> but was:<extra extra! other [Hello World from other bytes: 204]8 millis: 1000>
	at org.junit.Assert.assertEquals(Assert.java:115)
	at org.junit.Assert.assertEquals(Assert.java:144)
	at com.addthis.codec.config.FeatureTest.inheritance(FeatureTest.java:198)

concreteValue(com.addthis.codec.config.FeatureTest)  Time elapsed: 0.014 sec  <<< ERROR!
com.fasterxml.jackson.databind.JsonMappingException: No content to map due to end-of-input
 at [Source: N/A; line: -1, column: -1]
	at com.fasterxml.jackson.databind.JsonMappingException.from(JsonMappingException.java:148)
	at com.fasterxml.jackson.databind.ObjectMapper._initForReading(ObjectMapper.java:3110)
	at com.fasterxml.jackson.databind.ObjectMapper._readValue(ObjectMapper.java:3024)
	at com.fasterxml.jackson.databind.ObjectMapper.readValue(ObjectMapper.java:1652)
	at com.fasterxml.jackson.core.JsonParser.readValueAs(JsonParser.java:1346)
	at com.addthis.codec.jackson.CodecJackson.decodeObject(CodecJackson.java:116)
	at com.addthis.codec.config.FeatureTest.concreteValue(FeatureTest.java:204)

autoCollection(com.addthis.codec.config.FeatureTest)  Time elapsed: 0.002 sec  <<< FAILURE!
org.junit.ComparisonFailure: expected:<Hello World! Wh[ere are all my friends?]> but was:<Hello World! Wh[at a pleasant default-alias suffix we are having!]>
	at org.junit.Assert.assertEquals(Assert.java:115)
	at org.junit.Assert.assertEquals(Assert.java:144)
	at com.addthis.codec.config.FeatureTest.autoCollection(FeatureTest.java:82)

inline(com.addthis.codec.config.FeatureTest)  Time elapsed: 0.002 sec  <<< FAILURE!
org.junit.ComparisonFailure: expected:<Hello World[ INLINED even simpler]> but was:<Hello World[! What a pleasant default-alias suffix we are having!]>
	at org.junit.Assert.assertEquals(Assert.java:115)
	at org.junit.Assert.assertEquals(Assert.java:144)
	at com.addthis.codec.config.FeatureTest.inline(FeatureTest.java:131)

primaryArray(com.addthis.codec.config.FeatureTest)  Time elapsed: 0.002 sec  <<< FAILURE!
org.junit.ComparisonFailure: expected:<[listing parts: [a, b, c]]> but was:<[Hello World! What a pleasant default-alias suffix we are having!]>
	at org.junit.Assert.assertEquals(Assert.java:115)
	at org.junit.Assert.assertEquals(Assert.java:144)
	at com.addthis.codec.config.FeatureTest.primaryArray(FeatureTest.java:106)

bytesConstructor(com.addthis.codec.config.FeatureTest)  Time elapsed: 0.015 sec  <<< FAILURE!
java.lang.AssertionError: expected:<1073741824> but was:<0>
	at org.junit.Assert.fail(Assert.java:88)
	at org.junit.Assert.failNotEquals(Assert.java:743)
	at org.junit.Assert.assertEquals(Assert.java:118)
	at org.junit.Assert.assertEquals(Assert.java:555)
	at org.junit.Assert.assertEquals(Assert.java:542)
	at com.addthis.codec.config.FeatureTest.bytesConstructor(FeatureTest.java:173)

aliasInheritance(com.addthis.codec.config.FeatureTest)  Time elapsed: 0.001 sec  <<< FAILURE!
org.junit.ComparisonFailure: expected:<Hello World[ even simpler]> but was:<Hello World[! What a pleasant default-alias suffix we are having!]>
	at org.junit.Assert.assertEquals(Assert.java:115)
	at org.junit.Assert.assertEquals(Assert.java:144)
	at com.addthis.codec.config.FeatureTest.aliasInheritance(FeatureTest.java:139)

primaryNested(com.addthis.codec.config.FeatureTest)  Time elapsed: 0.002 sec  <<< FAILURE!
org.junit.ComparisonFailure: expected:<[extra extra! other Hello WorldWOW bytes: 2048 millis: 1000]> but was:<[Hello World! What a pleasant default-alias suffix we are having!]>
	at org.junit.Assert.assertEquals(Assert.java:115)
	at org.junit.Assert.assertEquals(Assert.java:144)
	at com.addthis.codec.config.FeatureTest.primaryNested(FeatureTest.java:122)

primary(com.addthis.codec.config.FeatureTest)  Time elapsed: 0.001 sec  <<< FAILURE!
org.junit.ComparisonFailure: expected:<Hello World[ even simpler]> but was:<Hello World[! What a pleasant default-alias suffix we are having!]>
	at org.junit.Assert.assertEquals(Assert.java:115)
	at org.junit.Assert.assertEquals(Assert.java:144)
	at com.addthis.codec.config.FeatureTest.primary(FeatureTest.java:98)

greetArray(com.addthis.codec.config.FeatureTest)  Time elapsed: 0.013 sec  <<< FAILURE!
org.junit.ComparisonFailure: expected:<[Hello World! What a pleasant default suffix we are having!Hello World! What a pleasant default suffix we are having!]> but was:<[]>
	at org.junit.Assert.assertEquals(Assert.java:115)
	at org.junit.Assert.assertEquals(Assert.java:144)
	at com.addthis.codec.config.FeatureTest.greetArray(FeatureTest.java:66)

bytesSetter(com.addthis.codec.config.FeatureTest)  Time elapsed: 0 sec  <<< FAILURE!
java.lang.AssertionError: expected:<1073741824> but was:<0>
	at org.junit.Assert.fail(Assert.java:88)
	at org.junit.Assert.failNotEquals(Assert.java:743)
	at org.junit.Assert.assertEquals(Assert.java:118)
	at org.junit.Assert.assertEquals(Assert.java:555)
	at org.junit.Assert.assertEquals(Assert.java:542)
	at com.addthis.codec.config.FeatureTest.bytesSetter(FeatureTest.java:166)

alias(com.addthis.codec.config.FeatureTest)  Time elapsed: 0.001 sec  <<< FAILURE!
org.junit.ComparisonFailure: expected:<Hello World[ even simpler]> but was:<Hello World[! What a pleasant default-alias suffix we are having!]>
	at org.junit.Assert.assertEquals(Assert.java:115)
	at org.junit.Assert.assertEquals(Assert.java:144)
	at com.addthis.codec.config.FeatureTest.alias(FeatureTest.java:90)

enums(com.addthis.codec.config.FeatureTest)  Time elapsed: 0.002 sec  <<< FAILURE!
org.junit.ComparisonFailure: expected:<[[MILLISECONDS, HOURS]]> but was:<[Hello World! What a pleasant default-alias suffix we are having!]>
	at org.junit.Assert.assertEquals(Assert.java:115)
	at org.junit.Assert.assertEquals(Assert.java:144)
	at com.addthis.codec.config.FeatureTest.enums(FeatureTest.java:189)

abstractDelegate(com.addthis.codec.config.FeatureTest)  Time elapsed: 0.002 sec  <<< FAILURE!
org.junit.ComparisonFailure: expected:<Hello World[s]> but was:<Hello World[! What a pleasant default-alias suffix we are having!]>
	at org.junit.Assert.assertEquals(Assert.java:115)
	at org.junit.Assert.assertEquals(Assert.java:144)
	at com.addthis.codec.config.FeatureTest.abstractDelegate(FeatureTest.java:222)

arraySingle(com.addthis.codec.config.FeatureTest)  Time elapsed: 0.001 sec  <<< FAILURE!
org.junit.ComparisonFailure: expected:<[heya]> but was:<[Hello World! What a pleasant default-alias suffix we are having!]>
	at org.junit.Assert.assertEquals(Assert.java:115)
	at org.junit.Assert.assertEquals(Assert.java:144)
	at com.addthis.codec.config.FeatureTest.arraySingle(FeatureTest.java:147)

primaryNestedObject(com.addthis.codec.config.FeatureTest)  Time elapsed: 0.001 sec  <<< FAILURE!
org.junit.ComparisonFailure: expected:<[extra extra! other Hello WorldWOW bytes: 2048 millis: 1000]> but was:<[Hello World! What a pleasant default-alias suffix we are having!]>
	at org.junit.Assert.assertEquals(Assert.java:115)
	at org.junit.Assert.assertEquals(Assert.java:144)
	at com.addthis.codec.config.FeatureTest.primaryNestedObject(FeatureTest.java:114)

bytesAndTime(com.addthis.codec.config.FeatureTest)  Time elapsed: 0.002 sec  <<< FAILURE!
org.junit.ComparisonFailure: expected:<[bytes: 1073741824 millis: 5000]> but was:<[Hello World! What a pleasant default-alias suffix we are having!]>
	at org.junit.Assert.assertEquals(Assert.java:115)
	at org.junit.Assert.assertEquals(Assert.java:144)
	at com.addthis.codec.config.FeatureTest.bytesAndTime(FeatureTest.java:181)

autoArray(com.addthis.codec.config.FeatureTest)  Time elapsed: 0.003 sec  <<< FAILURE!
org.junit.ComparisonFailure: expected:<Hello World! Wh[ere are all my friends?]> but was:<Hello World! Wh[at a pleasant default-alias suffix we are having!]>
	at org.junit.Assert.assertEquals(Assert.java:115)
	at org.junit.Assert.assertEquals(Assert.java:144)
	at com.addthis.codec.config.FeatureTest.autoArray(FeatureTest.java:74)

Running com.addthis.codec.CodecTest
Tests run: 6, Failures: 0, Errors: 0, Skipped: 0, Time elapsed: 0 sec - in com.addthis.codec.CodecTest
Running com.addthis.codec.CodecJsonBasicTest
Tests run: 5, Failures: 0, Errors: 0, Skipped: 0, Time elapsed: 0.232 sec - in com.addthis.codec.CodecJsonBasicTest
Running com.addthis.codec.CodecGenericsTest
Tests run: 1, Failures: 0, Errors: 0, Skipped: 0, Time elapsed: 0.018 sec - in com.addthis.codec.CodecGenericsTest
Running com.addthis.codec.CodecUtilTest
[main] INFO com.addthis.codec.CodecUtilTest - compareTest(abc,ab) sc(1) bc(1)
[main] INFO com.addthis.codec.CodecUtilTest - compareTest(abc,abc) sc(0) bc(0)
[main] INFO com.addthis.codec.CodecUtilTest - compareTest(abc,abcd) sc(-1) bc(-1)
[main] INFO com.addthis.codec.CodecUtilTest - compareTest(abc,def) sc(-3) bc(-3)
[main] INFO com.addthis.codec.CodecUtilTest - compareTest(def,abc) sc(3) bc(3)
[main] INFO com.addthis.codec.CodecUtilTest - compareTest(abcd,acbd) sc(-1) bc(-1)
Tests run: 1, Failures: 0, Errors: 0, Skipped: 0, Time elapsed: 0.003 sec - in com.addthis.codec.CodecUtilTest
Running com.addthis.codec.CodecBin2BasicTest
Tests run: 4, Failures: 0, Errors: 0, Skipped: 0, Time elapsed: 0.015 sec - in com.addthis.codec.CodecBin2BasicTest
Running com.addthis.codec.utils.ExecutorServiceBuilderTest
Tests run: 1, Failures: 0, Errors: 1, Skipped: 0, Time elapsed: 0.064 sec <<< FAILURE! - in com.addthis.codec.utils.ExecutorServiceBuilderTest
dontError(com.addthis.codec.utils.ExecutorServiceBuilderTest)  Time elapsed: 0.064 sec  <<< ERROR!
com.fasterxml.jackson.databind.JsonMappingException: Instantiation of [simple type, class com.addthis.codec.utils.ExecutorServiceBuilder] value failed: null
 at [Source: SimpleConfigObject({"core-threads":2,"keep-alive":0,"max-threads":5,"queue-size":100,"thread-factory":{"nameFormat":"ianRules"}}); line: 1, column: -1]
	at java.util.concurrent.LinkedBlockingQueue.<init>(LinkedBlockingQueue.java:259)
	at com.addthis.codec.utils.ExecutorServiceBuilder.<init>(ExecutorServiceBuilder.java:57)
	at sun.reflect.NativeConstructorAccessorImpl.newInstance0(Native Method)
	at sun.reflect.NativeConstructorAccessorImpl.newInstance(NativeConstructorAccessorImpl.java:57)
	at sun.reflect.DelegatingConstructorAccessorImpl.newInstance(DelegatingConstructorAccessorImpl.java:45)
	at java.lang.reflect.Constructor.newInstance(Constructor.java:526)
	at com.fasterxml.jackson.databind.introspect.AnnotatedConstructor.call(AnnotatedConstructor.java:125)
	at com.fasterxml.jackson.databind.deser.std.StdValueInstantiator.createFromObjectWith(StdValueInstantiator.java:230)
	at com.fasterxml.jackson.databind.deser.impl.PropertyBasedCreator.build(PropertyBasedCreator.java:167)
	at com.fasterxml.jackson.databind.deser.BuilderBasedDeserializer._deserializeUsingPropertyBased(BuilderBasedDeserializer.java:389)
	at com.fasterxml.jackson.databind.deser.BeanDeserializerBase.deserializeFromObjectUsingNonDefault(BeanDeserializerBase.java:1064)
	at com.fasterxml.jackson.databind.deser.BuilderBasedDeserializer.deserializeFromObject(BuilderBasedDeserializer.java:277)
	at com.fasterxml.jackson.databind.deser.BuilderBasedDeserializer.deserialize(BuilderBasedDeserializer.java:143)
	at com.addthis.codec.jackson.CodecBeanDeserializer.deserialize(CodecBeanDeserializer.java:82)
	at com.addthis.codec.jackson.CodecTypeDeserializer._deserializeTypedFromObject(CodecTypeDeserializer.java:162)
	at com.addthis.codec.jackson.CodecTypeDeserializer.deserializeTypedFromAny(CodecTypeDeserializer.java:123)
	at com.addthis.codec.jackson.CodecTypeDeserializer.deserializeTypedFromObject(CodecTypeDeserializer.java:83)
	at com.fasterxml.jackson.databind.deser.BeanDeserializerBase.deserializeWithType(BeanDeserializerBase.java:956)
	at com.fasterxml.jackson.databind.deser.std.DelegatingDeserializer.deserializeWithType(DelegatingDeserializer.java:123)
	at com.fasterxml.jackson.databind.deser.impl.TypeWrappedDeserializer.deserialize(TypeWrappedDeserializer.java:41)
	at com.fasterxml.jackson.databind.ObjectMapper._readValue(ObjectMapper.java:3038)
	at com.fasterxml.jackson.databind.ObjectMapper.readValue(ObjectMapper.java:1652)
	at com.fasterxml.jackson.core.JsonParser.readValueAs(JsonParser.java:1346)
	at com.addthis.codec.jackson.CodecJackson.decodeObject(CodecJackson.java:116)
	at com.addthis.codec.jackson.CodecJackson.decodeObject(CodecJackson.java:174)
	at com.addthis.codec.jackson.CodecJackson.decodeObject(CodecJackson.java:152)
	at com.addthis.codec.utils.ExecutorServiceBuilderTest.dontError(ExecutorServiceBuilderTest.java:33)

Running com.addthis.codec.CodecObjectSubclassTest
[main] INFO com.addthis.codec.CodecObjectSubclassTest - en1[111] ->      ok1Bok1ok2Cok1ok2ok3Dok1ok2ok3ok4 ok1Bok1ok2Cok1ok2ok3
[main] INFO com.addthis.codec.CodecObjectSubclassTest - en2[111] ->      ok1Bok1ok2Cok1ok2ok3Dok1ok2ok3ok4 ok1Bok1ok2Cok1ok2ok3
[main] INFO com.addthis.codec.CodecObjectSubclassTest - CodecBin2 --> PASSED
[main] INFO com.addthis.codec.CodecObjectSubclassTest - en1[358] -> {"a":{"type":"A","field1":"ok1"},"b":{"type":"B","field1":"ok1","field2":"ok2"},"c":{"type":"C","field1":"ok1","field2":"ok2","field3":"ok3"},"d":{"type":"D","field1":"ok1","field2":"ok2","field3":"ok3","field4":"ok4","list4":[{"type":"A","field1":"ok1"},{"type":"B","field1":"ok1","field2":"ok2"},{"type":"C","field1":"ok1","field2":"ok2","field3":"ok3"}]}}
[main] INFO com.addthis.codec.CodecObjectSubclassTest - en2[358] -> {"a":{"type":"A","field1":"ok1"},"b":{"type":"B","field1":"ok1","field2":"ok2"},"c":{"type":"C","field1":"ok1","field2":"ok2","field3":"ok3"},"d":{"type":"D","field1":"ok1","field2":"ok2","field3":"ok3","field4":"ok4","list4":[{"type":"A","field1":"ok1"},{"type":"B","field1":"ok1","field2":"ok2"},{"type":"C","field1":"ok1","field2":"ok2","field3":"ok3"}]}}
[main] INFO com.addthis.codec.CodecObjectSubclassTest - CodecJSON --> PASSED
Tests run: 1, Failures: 0, Errors: 0, Skipped: 0, Time elapsed: 0.028 sec - in com.addthis.codec.CodecObjectSubclassTest
Running com.addthis.codec.plugins.PluginRegistryTest
Tests run: 7, Failures: 0, Errors: 0, Skipped: 0, Time elapsed: 0.043 sec - in com.addthis.codec.plugins.PluginRegistryTest

Results :

Failed tests: 
  FeatureTest.inheritance:198 expected:<extra extra! other [[SECONDS] bytes: 52428]8 millis: 1000> but was:<extra extra! other [Hello World from other bytes: 204]8 millis: 1000>
  FeatureTest.autoCollection:82 expected:<Hello World! Wh[ere are all my friends?]> but was:<Hello World! Wh[at a pleasant default-alias suffix we are having!]>
  FeatureTest.inline:131 expected:<Hello World[ INLINED even simpler]> but was:<Hello World[! What a pleasant default-alias suffix we are having!]>
  FeatureTest.primaryArray:106 expected:<[listing parts: [a, b, c]]> but was:<[Hello World! What a pleasant default-alias suffix we are having!]>
  FeatureTest.bytesConstructor:173 expected:<1073741824> but was:<0>
  FeatureTest.aliasInheritance:139 expected:<Hello World[ even simpler]> but was:<Hello World[! What a pleasant default-alias suffix we are having!]>
  FeatureTest.primaryNested:122 expected:<[extra extra! other Hello WorldWOW bytes: 2048 millis: 1000]> but was:<[Hello World! What a pleasant default-alias suffix we are having!]>
  FeatureTest.primary:98 expected:<Hello World[ even simpler]> but was:<Hello World[! What a pleasant default-alias suffix we are having!]>
  FeatureTest.greetArray:66 expected:<[Hello World! What a pleasant default suffix we are having!Hello World! What a pleasant default suffix we are having!]> but was:<[]>
  FeatureTest.bytesSetter:166 expected:<1073741824> but was:<0>
  FeatureTest.alias:90 expected:<Hello World[ even simpler]> but was:<Hello World[! What a pleasant default-alias suffix we are having!]>
  FeatureTest.enums:189 expected:<[[MILLISECONDS, HOURS]]> but was:<[Hello World! What a pleasant default-alias suffix we are having!]>
  FeatureTest.abstractDelegate:222 expected:<Hello World[s]> but was:<Hello World[! What a pleasant default-alias suffix we are having!]>
  FeatureTest.arraySingle:147 expected:<[heya]> but was:<[Hello World! What a pleasant default-alias suffix we are having!]>
  FeatureTest.primaryNestedObject:114 expected:<[extra extra! other Hello WorldWOW bytes: 2048 millis: 1000]> but was:<[Hello World! What a pleasant default-alias suffix we are having!]>
  FeatureTest.bytesAndTime:181 expected:<[bytes: 1073741824 millis: 5000]> but was:<[Hello World! What a pleasant default-alias suffix we are having!]>
  FeatureTest.autoArray:74 expected:<Hello World! Wh[ere are all my friends?]> but was:<Hello World! Wh[at a pleasant default-alias suffix we are having!]>

Tests in error: 
  FeatureTest.concreteValue:204 » JsonMapping No content to map due to end-of-in...
  ExecutorServiceBuilderTest.dontError:33 » JsonMapping Instantiation of [simple...

Tests run: 54, Failures: 17, Errors: 2, Skipped: 0

[INFO] ------------------------------------------------------------------------
[INFO] BUILD FAILURE
[INFO] ------------------------------------------------------------------------
[INFO] Total time: 8.945s
[INFO] Finished at: Sun Aug 02 01:37:12 BST 2015
[INFO] Final Memory: 17M/215M
[INFO] ------------------------------------------------------------------------
[ERROR] Failed to execute goal org.apache.maven.plugins:maven-surefire-plugin:2.17:test (default-test) on project codec: There are test failures.
[ERROR] 
[ERROR] Please refer to /home/perham/Study/LittleDarwin/Cases/codec-3.3.0/target/surefire-reports for the individual test results.
[ERROR] -> [Help 1]
[ERROR] 
[ERROR] To see the full stack trace of the errors, re-run Maven with the -e switch.
[ERROR] Re-run Maven using the -X switch to enable full debug logging.
[ERROR] 
[ERROR] For more information about the errors and possible solutions, please read the following articles:
[ERROR] [Help 1] http://cwiki.apache.org/confluence/display/MAVEN/MojoFailureException
