[INFO] Scanning for projects...
[INFO]                                                                         
[INFO] ------------------------------------------------------------------------
[INFO] Building JSQLParser library 0.9.4
[INFO] ------------------------------------------------------------------------
[INFO] 
[INFO] --- javacc-maven-plugin:2.6:jjtree-javacc (javacc) @ jsqlparser ---
[INFO] Skipping - all parsers are up to date
[INFO] 
[INFO] --- license-maven-plugin:1.6:update-file-header (first) @ jsqlparser ---
[INFO] Will search files to update from root /home/perham/Study/Experiments/2015-10-23-ICST/LittleDarwin/Cases/JSqlParser-jsqlparser-0.9.4/src/main/java
[INFO]  - adding license header on file /home/perham/Study/Experiments/2015-10-23-ICST/LittleDarwin/Cases/JSqlParser-jsqlparser-0.9.4/src/main/java/net/sf/jsqlparser/util/deparser/SelectDeParser.java
[INFO] Scan 164 files header done in 229.055ms.
[INFO] 
 * uptodate header on 163 files.
 * add header on 1 file.
[INFO] 
[INFO] --- maven-resources-plugin:2.6:resources (default-resources) @ jsqlparser ---
[INFO] Using 'UTF-8' encoding to copy filtered resources.
[INFO] skip non existing resourceDirectory /home/perham/Study/Experiments/2015-10-23-ICST/LittleDarwin/Cases/JSqlParser-jsqlparser-0.9.4/src/main/resources
[INFO] 
[INFO] --- maven-compiler-plugin:3.3:compile (default-compile) @ jsqlparser ---
[INFO] Changes detected - recompiling the module!
[INFO] Compiling 177 source files to /home/perham/Study/Experiments/2015-10-23-ICST/LittleDarwin/Cases/JSqlParser-jsqlparser-0.9.4/target/classes
[WARNING] bootstrap class path not set in conjunction with -source 1.6
[INFO] /home/perham/Study/Experiments/2015-10-23-ICST/LittleDarwin/Cases/JSqlParser-jsqlparser-0.9.4/target/generated-sources/javacc/net/sf/jsqlparser/parser/CCJSqlParser.java: /home/perham/Study/Experiments/2015-10-23-ICST/LittleDarwin/Cases/JSqlParser-jsqlparser-0.9.4/target/generated-sources/javacc/net/sf/jsqlparser/parser/CCJSqlParser.java uses unchecked or unsafe operations.
[INFO] /home/perham/Study/Experiments/2015-10-23-ICST/LittleDarwin/Cases/JSqlParser-jsqlparser-0.9.4/target/generated-sources/javacc/net/sf/jsqlparser/parser/CCJSqlParser.java: Recompile with -Xlint:unchecked for details.
[INFO] 
[INFO] --- maven-resources-plugin:2.6:testResources (default-testResources) @ jsqlparser ---
[INFO] Using 'UTF-8' encoding to copy filtered resources.
[INFO] Copying 280 resources
[INFO] 
[INFO] --- maven-compiler-plugin:3.3:testCompile (default-testCompile) @ jsqlparser ---
[INFO] Nothing to compile - all classes are up to date
[INFO] 
[INFO] --- maven-surefire-plugin:2.10:test (default-test) @ jsqlparser ---
[INFO] Surefire report directory: /home/perham/Study/Experiments/2015-10-23-ICST/LittleDarwin/Cases/JSqlParser-jsqlparser-0.9.4/target/surefire-reports

-------------------------------------------------------
 T E S T S
-------------------------------------------------------
Running net.sf.jsqlparser.test.alter.AlterTest
Tests run: 3, Failures: 0, Errors: 0, Skipped: 0, Time elapsed: 0.054 sec
Running net.sf.jsqlparser.test.create.CreateTableTest
Tests run: 27, Failures: 0, Errors: 0, Skipped: 0, Time elapsed: 0.125 sec
Running net.sf.jsqlparser.test.create.CreateIndexTest
Tests run: 6, Failures: 0, Errors: 0, Skipped: 0, Time elapsed: 0 sec
Running net.sf.jsqlparser.test.create.CreateViewTest
Tests run: 8, Failures: 0, Errors: 0, Skipped: 0, Time elapsed: 0.009 sec
Running net.sf.jsqlparser.test.delete.DeleteTest
Tests run: 2, Failures: 0, Errors: 0, Skipped: 0, Time elapsed: 0.005 sec
Running net.sf.jsqlparser.test.simpleparsing.CCJSqlParserManagerTest
Tests run: 1, Failures: 0, Errors: 0, Skipped: 0, Time elapsed: 0.167 sec
Running net.sf.jsqlparser.test.drop.DropTest
Tests run: 2, Failures: 0, Errors: 0, Skipped: 0, Time elapsed: 0.001 sec
Running net.sf.jsqlparser.test.insert.InsertTest
Tests run: 15, Failures: 0, Errors: 2, Skipped: 0, Time elapsed: 0.043 sec <<< FAILURE!
Running net.sf.jsqlparser.test.TestUtils
Tests run: 1, Failures: 0, Errors: 0, Skipped: 0, Time elapsed: 0 sec
Running net.sf.jsqlparser.test.update.UpdateTest
Tests run: 7, Failures: 0, Errors: 2, Skipped: 0, Time elapsed: 0.002 sec <<< FAILURE!
Running net.sf.jsqlparser.test.replace.ReplaceTest
Tests run: 4, Failures: 0, Errors: 0, Skipped: 0, Time elapsed: 0.002 sec
Running net.sf.jsqlparser.test.select.SelectASTTest
*Statement
* Column
* Column
* Table
* Column
* Column
Tests run: 2, Failures: 0, Errors: 0, Skipped: 0, Time elapsed: 0.005 sec
Running net.sf.jsqlparser.test.select.SpecialOracleTest
Oct 06, 2015 8:57:16 AM net.sf.jsqlparser.test.select.SpecialOracleTest testAllSqlsParseDeparse
INFO: testing string01.sql
Oct 06, 2015 8:57:16 AM net.sf.jsqlparser.test.select.SpecialOracleTest testAllSqlsParseDeparse
INFO:    -> PROBLEM net.sf.jsqlparser.JSQLParserException
Oct 06, 2015 8:57:16 AM net.sf.jsqlparser.test.select.SpecialOracleTest testAllSqlsParseDeparse
INFO: testing returning01.sql
Oct 06, 2015 8:57:16 AM net.sf.jsqlparser.test.select.SpecialOracleTest testAllSqlsParseDeparse
INFO:    -> PROBLEM net.sf.jsqlparser.JSQLParserException
Oct 06, 2015 8:57:16 AM net.sf.jsqlparser.test.select.SpecialOracleTest testAllSqlsParseDeparse
INFO: testing keywordasidentifier05.sql
Oct 06, 2015 8:57:16 AM net.sf.jsqlparser.test.select.SpecialOracleTest testAllSqlsParseDeparse
INFO:    -> PROBLEM java.lang.NullPointerException
Oct 06, 2015 8:57:16 AM net.sf.jsqlparser.test.select.SpecialOracleTest testAllSqlsParseDeparse
INFO: testing function07.sql
Oct 06, 2015 8:57:16 AM net.sf.jsqlparser.test.select.SpecialOracleTest testAllSqlsParseDeparse
INFO:    -> PROBLEM net.sf.jsqlparser.JSQLParserException
Oct 06, 2015 8:57:16 AM net.sf.jsqlparser.test.select.SpecialOracleTest testAllSqlsParseDeparse
INFO: testing cast_multiset15.sql
Oct 06, 2015 8:57:16 AM net.sf.jsqlparser.test.select.SpecialOracleTest testAllSqlsParseDeparse
INFO:    -> PROBLEM net.sf.jsqlparser.JSQLParserException
Oct 06, 2015 8:57:16 AM net.sf.jsqlparser.test.select.SpecialOracleTest testAllSqlsParseDeparse
INFO: testing interval01.sql
Oct 06, 2015 8:57:16 AM net.sf.jsqlparser.test.select.SpecialOracleTest testAllSqlsParseDeparse
INFO:    -> PROBLEM net.sf.jsqlparser.JSQLParserException
Oct 06, 2015 8:57:16 AM net.sf.jsqlparser.test.select.SpecialOracleTest testAllSqlsParseDeparse
INFO: testing analytic_query04.sql
Oct 06, 2015 8:57:16 AM net.sf.jsqlparser.test.select.SpecialOracleTest testAllSqlsParseDeparse
INFO:    -> PROBLEM net.sf.jsqlparser.JSQLParserException
Oct 06, 2015 8:57:16 AM net.sf.jsqlparser.test.select.SpecialOracleTest testAllSqlsParseDeparse
INFO: testing join10.sql
Oct 06, 2015 8:57:16 AM net.sf.jsqlparser.test.select.SpecialOracleTest testAllSqlsParseDeparse
INFO:    -> PROBLEM java.lang.NullPointerException
Oct 06, 2015 8:57:16 AM net.sf.jsqlparser.test.select.SpecialOracleTest testAllSqlsParseDeparse
INFO: testing pivot04.sql
Oct 06, 2015 8:57:16 AM net.sf.jsqlparser.test.select.SpecialOracleTest testAllSqlsParseDeparse
INFO:    -> PROBLEM net.sf.jsqlparser.JSQLParserException
Oct 06, 2015 8:57:16 AM net.sf.jsqlparser.test.select.SpecialOracleTest testAllSqlsParseDeparse
INFO: testing condition08.sql
Oct 06, 2015 8:57:16 AM net.sf.jsqlparser.test.select.SpecialOracleTest testAllSqlsParseDeparse
INFO:    -> PROBLEM net.sf.jsqlparser.JSQLParserException
Oct 06, 2015 8:57:16 AM net.sf.jsqlparser.test.select.SpecialOracleTest testAllSqlsParseDeparse
INFO: testing function03.sql
Oct 06, 2015 8:57:16 AM net.sf.jsqlparser.test.select.SpecialOracleTest testAllSqlsParseDeparse
INFO:    -> PROBLEM net.sf.jsqlparser.JSQLParserException
Oct 06, 2015 8:57:16 AM net.sf.jsqlparser.test.select.SpecialOracleTest testAllSqlsParseDeparse
INFO: testing merge03.sql
Oct 06, 2015 8:57:16 AM net.sf.jsqlparser.test.select.SpecialOracleTest testAllSqlsParseDeparse
INFO:    -> PROBLEM net.sf.jsqlparser.JSQLParserException
Oct 06, 2015 8:57:16 AM net.sf.jsqlparser.test.select.SpecialOracleTest testAllSqlsParseDeparse
INFO: testing insert02.sql
Oct 06, 2015 8:57:16 AM net.sf.jsqlparser.test.select.SpecialOracleTest testAllSqlsParseDeparse
INFO:    -> PROBLEM net.sf.jsqlparser.JSQLParserException
Oct 06, 2015 8:57:16 AM net.sf.jsqlparser.test.select.SpecialOracleTest testAllSqlsParseDeparse
INFO: testing insert11.sql
Oct 06, 2015 8:57:16 AM net.sf.jsqlparser.test.select.SpecialOracleTest testAllSqlsParseDeparse
INFO:    -> PROBLEM net.sf.jsqlparser.JSQLParserException
Oct 06, 2015 8:57:16 AM net.sf.jsqlparser.test.select.SpecialOracleTest testAllSqlsParseDeparse
INFO: testing interval02.sql
Oct 06, 2015 8:57:16 AM net.sf.jsqlparser.test.select.SpecialOracleTest testAllSqlsParseDeparse
INFO:    -> PROBLEM java.lang.NullPointerException
Oct 06, 2015 8:57:16 AM net.sf.jsqlparser.test.select.SpecialOracleTest testAllSqlsParseDeparse
INFO: testing cast_multiset18.sql
Oct 06, 2015 8:57:16 AM net.sf.jsqlparser.test.select.SpecialOracleTest testAllSqlsParseDeparse
INFO:    -> PROBLEM net.sf.jsqlparser.JSQLParserException
Oct 06, 2015 8:57:16 AM net.sf.jsqlparser.test.select.SpecialOracleTest testAllSqlsParseDeparse
INFO: testing query_factoring08.sql
Oct 06, 2015 8:57:16 AM net.sf.jsqlparser.test.select.SpecialOracleTest testAllSqlsParseDeparse
INFO:    -> PROBLEM java.lang.NullPointerException
Oct 06, 2015 8:57:16 AM net.sf.jsqlparser.test.select.SpecialOracleTest testAllSqlsParseDeparse
INFO: testing condition04.sql
Oct 06, 2015 8:57:22 AM net.sf.jsqlparser.test.select.SpecialOracleTest testAllSqlsParseDeparse
INFO:    -> PROBLEM java.lang.NullPointerException
Oct 06, 2015 8:57:22 AM net.sf.jsqlparser.test.select.SpecialOracleTest testAllSqlsParseDeparse
INFO: testing xmltable02.sql
Oct 06, 2015 8:57:22 AM net.sf.jsqlparser.test.select.SpecialOracleTest testAllSqlsParseDeparse
INFO:    -> PROBLEM net.sf.jsqlparser.JSQLParserException
Oct 06, 2015 8:57:22 AM net.sf.jsqlparser.test.select.SpecialOracleTest testAllSqlsParseDeparse
INFO: testing for_update08.sql
Oct 06, 2015 8:57:22 AM net.sf.jsqlparser.test.select.SpecialOracleTest testAllSqlsParseDeparse
INFO:    -> PROBLEM net.sf.jsqlparser.JSQLParserException
Oct 06, 2015 8:57:22 AM net.sf.jsqlparser.test.select.SpecialOracleTest testAllSqlsParseDeparse
INFO: testing for_update03.sql
Oct 06, 2015 8:57:22 AM net.sf.jsqlparser.test.select.SpecialOracleTest testAllSqlsParseDeparse
INFO:    -> PROBLEM java.lang.NullPointerException
Oct 06, 2015 8:57:22 AM net.sf.jsqlparser.test.select.SpecialOracleTest testAllSqlsParseDeparse
INFO: testing condition06.sql
Oct 06, 2015 8:57:22 AM net.sf.jsqlparser.test.select.SpecialOracleTest testAllSqlsParseDeparse
INFO:    -> PROBLEM net.sf.jsqlparser.JSQLParserException
Oct 06, 2015 8:57:22 AM net.sf.jsqlparser.test.select.SpecialOracleTest testAllSqlsParseDeparse
INFO: testing cast_multiset29.sql
Oct 06, 2015 8:57:22 AM net.sf.jsqlparser.test.select.SpecialOracleTest testAllSqlsParseDeparse
INFO:    -> PROBLEM java.lang.NullPointerException
Oct 06, 2015 8:57:22 AM net.sf.jsqlparser.test.select.SpecialOracleTest testAllSqlsParseDeparse
INFO: testing cast_multiset38.sql
Oct 06, 2015 8:57:22 AM net.sf.jsqlparser.test.select.SpecialOracleTest testAllSqlsParseDeparse
INFO:    -> PROBLEM net.sf.jsqlparser.JSQLParserException
Oct 06, 2015 8:57:22 AM net.sf.jsqlparser.test.select.SpecialOracleTest testAllSqlsParseDeparse
INFO: testing query_factoring09.sql
Oct 06, 2015 8:57:22 AM net.sf.jsqlparser.test.select.SpecialOracleTest testAllSqlsParseDeparse
INFO:    -> PROBLEM java.lang.NullPointerException
Oct 06, 2015 8:57:22 AM net.sf.jsqlparser.test.select.SpecialOracleTest testAllSqlsParseDeparse
INFO: testing condition19.sql
Oct 06, 2015 8:57:22 AM net.sf.jsqlparser.test.select.SpecialOracleTest testAllSqlsParseDeparse
INFO:    -> PROBLEM net.sf.jsqlparser.JSQLParserException
Oct 06, 2015 8:57:22 AM net.sf.jsqlparser.test.select.SpecialOracleTest testAllSqlsParseDeparse
INFO: testing union02.sql
Oct 06, 2015 8:57:22 AM net.sf.jsqlparser.test.select.SpecialOracleTest testAllSqlsParseDeparse
INFO:    -> PROBLEM java.lang.NullPointerException
Oct 06, 2015 8:57:22 AM net.sf.jsqlparser.test.select.SpecialOracleTest testAllSqlsParseDeparse
INFO: testing groupby22.sql
Oct 06, 2015 8:57:22 AM net.sf.jsqlparser.test.select.SpecialOracleTest testAllSqlsParseDeparse
INFO:    -> PROBLEM java.lang.NullPointerException
Oct 06, 2015 8:57:22 AM net.sf.jsqlparser.test.select.SpecialOracleTest testAllSqlsParseDeparse
INFO: testing set02.sql
Oct 06, 2015 8:57:22 AM net.sf.jsqlparser.test.select.SpecialOracleTest testAllSqlsParseDeparse
INFO:    -> PROBLEM net.sf.jsqlparser.JSQLParserException
Oct 06, 2015 8:57:22 AM net.sf.jsqlparser.test.select.SpecialOracleTest testAllSqlsParseDeparse
INFO: testing cast_multiset10.sql
Oct 06, 2015 8:57:22 AM net.sf.jsqlparser.test.select.SpecialOracleTest testAllSqlsParseDeparse
INFO:    -> PROBLEM java.lang.NullPointerException
Oct 06, 2015 8:57:22 AM net.sf.jsqlparser.test.select.SpecialOracleTest testAllSqlsParseDeparse
INFO: testing simple06.sql
Oct 06, 2015 8:57:22 AM net.sf.jsqlparser.test.select.SpecialOracleTest testAllSqlsParseDeparse
INFO:    -> PROBLEM java.lang.NullPointerException
Oct 06, 2015 8:57:22 AM net.sf.jsqlparser.test.select.SpecialOracleTest testAllSqlsParseDeparse
INFO: testing groupby12.sql
Oct 06, 2015 8:57:22 AM net.sf.jsqlparser.test.select.SpecialOracleTest testAllSqlsOnlyParse
INFO: testing comment02.sql
Oct 06, 2015 8:57:22 AM net.sf.jsqlparser.test.select.SpecialOracleTest testAllSqlsOnlyParse
INFO:    -> SUCCESS
Oct 06, 2015 8:57:22 AM net.sf.jsqlparser.test.select.SpecialOracleTest testAllSqlsOnlyParse
INFO: testing numbers02.sql
Oct 06, 2015 8:57:22 AM net.sf.jsqlparser.test.select.SpecialOracleTest testAllSqlsOnlyParse
INFO:    -> SUCCESS
Oct 06, 2015 8:57:22 AM net.sf.jsqlparser.test.select.SpecialOracleTest testAllSqlsOnlyParse
INFO: testing comment01.sql
Oct 06, 2015 8:57:22 AM net.sf.jsqlparser.test.select.SpecialOracleTest testAllSqlsOnlyParse
INFO:    -> SUCCESS
Tests run: 2, Failures: 1, Errors: 0, Skipped: 0, Time elapsed: 6.721 sec <<< FAILURE!
Running net.sf.jsqlparser.test.select.SelectTest
Tests run: 228, Failures: 21, Errors: 196, Skipped: 0, Time elapsed: 0.272 sec <<< FAILURE!
Running net.sf.jsqlparser.test.select.SpeedTest
42500 statements parsed in 7935 milliseconds
 (5356 statements per second,  0.0001867 seconds per statement )
38500 select scans for table name executed in 135 milliseconds
 (285185 select scans for table name per second,  0.0000035 seconds per select scans for table name)
Tests run: 1, Failures: 0, Errors: 0, Skipped: 0, Time elapsed: 8.058 sec
Running net.sf.jsqlparser.test.truncate.TruncateTest
Tests run: 1, Failures: 0, Errors: 0, Skipped: 0, Time elapsed: 0 sec
Running net.sf.jsqlparser.util.TablesNamesFinderTest
Tests run: 19, Failures: 0, Errors: 0, Skipped: 0, Time elapsed: 0.013 sec
Running net.sf.jsqlparser.util.ConnectExpressionsVisitorTest
Tests run: 2, Failures: 0, Errors: 0, Skipped: 0, Time elapsed: 0.003 sec
Running net.sf.jsqlparser.util.AddAliasesVisitorTest
Tests run: 4, Failures: 0, Errors: 0, Skipped: 0, Time elapsed: 0.001 sec
Running net.sf.jsqlparser.util.SelectUtilsTest
Tests run: 6, Failures: 0, Errors: 0, Skipped: 0, Time elapsed: 0.001 sec
Running net.sf.jsqlparser.expression.ExpressionVisitorAdapterTest
Tests run: 2, Failures: 0, Errors: 0, Skipped: 0, Time elapsed: 0.002 sec
Running net.sf.jsqlparser.expression.SignedExpressionTest
Tests run: 1, Failures: 0, Errors: 0, Skipped: 0, Time elapsed: 0.001 sec
Running net.sf.jsqlparser.schema.ServerTest
Tests run: 2, Failures: 0, Errors: 0, Skipped: 0, Time elapsed: 0 sec
Running net.sf.jsqlparser.parser.CCJSqlParserUtilTest
Tests run: 3, Failures: 0, Errors: 0, Skipped: 0, Time elapsed: 0.001 sec
Running net.sf.jsqlparser.statement.SetStatementTest
Tests run: 1, Failures: 0, Errors: 0, Skipped: 0, Time elapsed: 0.002 sec
Running net.sf.jsqlparser.statement.AdaptersTest
Tests run: 1, Failures: 0, Errors: 0, Skipped: 0, Time elapsed: 0.002 sec
Running net.sf.jsqlparser.statement.StatementsTest
Tests run: 1, Failures: 0, Errors: 0, Skipped: 0, Time elapsed: 0.001 sec
Running net.sf.jsqlparser.statement.execute.ExecuteTest
Tests run: 1, Failures: 0, Errors: 0, Skipped: 0, Time elapsed: 0 sec

Results :

Failed tests:   testAllSqlsParseDeparse(net.sf.jsqlparser.test.select.SpecialOracleTest): expected:<...fact_2_id,fact_3_id)[order by fact_1_id,fact_2_id,fact_3_id]> but was:<...fact_2_id,fact_3_id)[]>
  testOrderBy(net.sf.jsqlparser.test.select.SelectTest): expected:<...> 34 GROUP BY tab1.b[ ORDER BY tab1.a DESC, tab1.b ASC]> but was:<...> 34 GROUP BY tab1.b[]>
  testFirst(net.sf.jsqlparser.test.select.SelectTest): expected:<...Name.tableName alias[ ORDER BY alias.columnName2 DESC]> but was:<...Name.tableName alias[]>
  testSkip(net.sf.jsqlparser.test.select.SelectTest): expected:<...Name.tableName alias[ ORDER BY alias.columnName2 DESC]> but was:<...Name.tableName alias[]>
  testProblemSqlAnalytic8Complex(net.sf.jsqlparser.test.select.SelectTest): expected:<... STAFF WHERE ID < 60[ ORDER BY ID]> but was:<... STAFF WHERE ID < 60[]>
  testOrderByNullsFirst(net.sf.jsqlparser.test.select.SelectTest): expected:<SELECT a FROM tab1[ ORDER BY a NULLS FIRST]> but was:<SELECT a FROM tab1[]>
  testFirstWithKeywordLimit(net.sf.jsqlparser.test.select.SelectTest): expected:<...Name.tableName alias[ ORDER BY alias.columnName2 DESC]> but was:<...Name.tableName alias[]>
  testSelectKeepOver(net.sf.jsqlparser.test.select.SelectTest): expected:<...orst" FROM employees[ ORDER BY department_id, salary]> but was:<...orst" FROM employees[]>
  testLimitSqlServer1(net.sf.jsqlparser.test.select.SelectTest): expected:<...RE mytable.col = 9 O[RDER BY mytable.id O]FFSET 3 ROWS FETCH N...> but was:<...RE mytable.col = 9 O[]FFSET 3 ROWS FETCH N...>
  testLimitSqlServer2(net.sf.jsqlparser.test.select.SelectTest): expected:<...RE mytable.col = 9 O[RDER BY mytable.id O]FFSET 3 ROW FETCH FI...> but was:<...RE mytable.col = 9 O[]FFSET 3 ROW FETCH FI...>
  testLimitSqlServer3(net.sf.jsqlparser.test.select.SelectTest): expected:<...RE mytable.col = 9 O[RDER BY mytable.id O]FFSET 3 ROWS> but was:<...RE mytable.col = 9 O[]FFSET 3 ROWS>
  testLimitSqlServer4(net.sf.jsqlparser.test.select.SelectTest): expected:<...ERE mytable.col = 9 [ORDER BY mytable.id ]FETCH NEXT 5 ROWS ON...> but was:<...ERE mytable.col = 9 []FETCH NEXT 5 ROWS ON...>
  testSelectOrderHaving(net.sf.jsqlparser.test.select.SelectTest): expected:<...ING count(units) > 1[ ORDER BY num]> but was:<...ING count(units) > 1[]>
  testIssue154_2(net.sf.jsqlparser.test.select.SelectTest): expected:<...deleted_time IS NULL[ ORDER BY r.id DESC]> but was:<...deleted_time IS NULL[]>
  testIssue154(net.sf.jsqlparser.test.select.SelectTest): expected:<...D modified_time >= ?[ ORDER BY modified_time]> but was:<...D modified_time >= ?[]>
  testTopWithParenthesis(net.sf.jsqlparser.test.select.SelectTest): expected:<...Name.tableName alias[ ORDER BY alias.columnName2 DESC]> but was:<...Name.tableName alias[]>
  testOracleHierarchicalQuery(net.sf.jsqlparser.test.select.SelectTest): expected:<...oyee_id = manager_id[ ORDER BY last_name]> but was:<...oyee_id = manager_id[]>
  testOracleHierarchicalQuery3(net.sf.jsqlparser.test.select.SelectTest): expected:<...oyee_id = manager_id[ ORDER SIBLINGS BY last_name]> but was:<...oyee_id = manager_id[]>
  testOracleHierarchicalQuery4(net.sf.jsqlparser.test.select.SelectTest): expected:<...TH employee_id = 100[ ORDER SIBLINGS BY last_name]> but was:<...TH employee_id = 100[]>
  testLimitSqlServerJdbcParameters(net.sf.jsqlparser.test.select.SelectTest): expected:<...RE mytable.col = 9 O[RDER BY mytable.id O]FFSET ? ROWS FETCH N...> but was:<...RE mytable.col = 9 O[]FFSET ? ROWS FETCH N...>
  testSelectJoin(net.sf.jsqlparser.test.select.SelectTest): expected:<..._constraint.conkey))[ ORDER BY pg_constraint.conname]> but was:<..._constraint.conkey))[]>
  testSelectKeep(net.sf.jsqlparser.test.select.SelectTest): expected:<...table1 GROUP BY col5[ ORDER BY col3]> but was:<...table1 GROUP BY col5[]>

Tests in error: 
  testInsertWithSelect(net.sf.jsqlparser.test.insert.InsertTest)
  testInsertSelect(net.sf.jsqlparser.test.insert.InsertTest)
  testUpdateWithSelect2(net.sf.jsqlparser.test.update.UpdateTest)
  testUpdateWithSelect(net.sf.jsqlparser.test.update.UpdateTest)
  testSelectAliasWithoutAs(net.sf.jsqlparser.test.select.SelectTest)
  testAllConditionSubSelect(net.sf.jsqlparser.test.select.SelectTest)
  testSimpleSigns(net.sf.jsqlparser.test.select.SelectTest)
  testMultiValueIn2(net.sf.jsqlparser.test.select.SelectTest)
  testSelectForUpdateOfTable(net.sf.jsqlparser.test.select.SelectTest)
  testPostgreSQLRegExpCaseSensitiveMatch(net.sf.jsqlparser.test.select.SelectTest)
  testOracleJoin2(net.sf.jsqlparser.test.select.SelectTest)
  testOracleJoin3(net.sf.jsqlparser.test.select.SelectTest)
  testOracleJoin4(net.sf.jsqlparser.test.select.SelectTest)
  testMultiPartTableNameWithSchemaName(net.sf.jsqlparser.test.select.SelectTest)
  testSelectBrackets2(net.sf.jsqlparser.test.select.SelectTest)
  testSelectBrackets3(net.sf.jsqlparser.test.select.SelectTest)
  testSelectBrackets4(net.sf.jsqlparser.test.select.SelectTest)
  testSimpleAdditionsAndSubtractionsWithSigns(net.sf.jsqlparser.test.select.SelectTest)
  testSelectAliasInQuotes(net.sf.jsqlparser.test.select.SelectTest)
  testCastTypeProblem2(net.sf.jsqlparser.test.select.SelectTest)
  testCastTypeProblem3(net.sf.jsqlparser.test.select.SelectTest)
  testCastTypeProblem4(net.sf.jsqlparser.test.select.SelectTest)
  testCastTypeProblem5(net.sf.jsqlparser.test.select.SelectTest)
  testCastTypeProblem6(net.sf.jsqlparser.test.select.SelectTest)
  testCastTypeProblem7(net.sf.jsqlparser.test.select.SelectTest)
  testCastInCast(net.sf.jsqlparser.test.select.SelectTest)
  testSkipFirst(net.sf.jsqlparser.test.select.SelectTest)
  testMultiPartTableNameWithDatabaseNameAndSchemaName(net.sf.jsqlparser.test.select.SelectTest)
  testSelectJoinWithComma(net.sf.jsqlparser.test.select.SelectTest)
  testAdditionalLettersGerman(net.sf.jsqlparser.test.select.SelectTest)
  testTop(net.sf.jsqlparser.test.select.SelectTest)
  testWithUnionProblem(net.sf.jsqlparser.test.select.SelectTest)
  testMysqlQuote(net.sf.jsqlparser.test.select.SelectTest)
  testSelectInnerWith(net.sf.jsqlparser.test.select.SelectTest)
  testReservedKeyword2(net.sf.jsqlparser.test.select.SelectTest)
  testIlike(net.sf.jsqlparser.test.select.SelectTest)
  testIsNot(net.sf.jsqlparser.test.select.SelectTest)
  testLimit(net.sf.jsqlparser.test.select.SelectTest)
  testSigns(net.sf.jsqlparser.test.select.SelectTest)
  testUnion(net.sf.jsqlparser.test.select.SelectTest)
  testRegexpLike1(net.sf.jsqlparser.test.select.SelectTest)
  testRegexpLike2(net.sf.jsqlparser.test.select.SelectTest)
  testRegexpMySQL(net.sf.jsqlparser.test.select.SelectTest)
  testCase(net.sf.jsqlparser.test.select.SelectTest)
  testCast(net.sf.jsqlparser.test.select.SelectTest)
  testFrom(net.sf.jsqlparser.test.select.SelectTest)
  testJoin(net.sf.jsqlparser.test.select.SelectTest)
  testLike(net.sf.jsqlparser.test.select.SelectTest)
  testTime(net.sf.jsqlparser.test.select.SelectTest)
  testWith(net.sf.jsqlparser.test.select.SelectTest)
  testJsonExpression(net.sf.jsqlparser.test.select.SelectTest)
  testConcatProblem2_5_1(net.sf.jsqlparser.test.select.SelectTest)
  testConcatProblem2_5_2(net.sf.jsqlparser.test.select.SelectTest)
  testWithUnionAllProblem(net.sf.jsqlparser.test.select.SelectTest)
  testOracleJoin2_1(net.sf.jsqlparser.test.select.SelectTest)
  testOracleJoin2_2(net.sf.jsqlparser.test.select.SelectTest)
  testOracleJoin3_1(net.sf.jsqlparser.test.select.SelectTest)
  testAnyConditionSubSelect(net.sf.jsqlparser.test.select.SelectTest)
  testPivotXml1(net.sf.jsqlparser.test.select.SelectTest)
  testPivotXml2(net.sf.jsqlparser.test.select.SelectTest)
  testPivotXml3(net.sf.jsqlparser.test.select.SelectTest)
  testIssue162_doubleUserVar(net.sf.jsqlparser.test.select.SelectTest)
  testSelectWithBrackets2(net.sf.jsqlparser.test.select.SelectTest)
  testMultiTableJoin(net.sf.jsqlparser.test.select.SelectTest)
  testProblemSqlServer_Modulo_mod(net.sf.jsqlparser.test.select.SelectTest)
  testProblemSqlAnalytic(net.sf.jsqlparser.test.select.SelectTest)
  testIssue160_signedParameter2(net.sf.jsqlparser.test.select.SelectTest)
  testAdditionalLettersSpanish(net.sf.jsqlparser.test.select.SelectTest)
  testLateral1(net.sf.jsqlparser.test.select.SelectTest)
  testSelectNumericBind(net.sf.jsqlparser.test.select.SelectTest)
  testRegexpBinaryMySQL(net.sf.jsqlparser.test.select.SelectTest)
  testMultiValueIn(net.sf.jsqlparser.test.select.SelectTest)
  testProblemSqlIntersect(net.sf.jsqlparser.test.select.SelectTest)
  testProblemFunction(net.sf.jsqlparser.test.select.SelectTest)
  testConcatProblem2(net.sf.jsqlparser.test.select.SelectTest)
  testBitwise(net.sf.jsqlparser.test.select.SelectTest)
  testSelectInto1(net.sf.jsqlparser.test.select.SelectTest)
  testSelectItems(net.sf.jsqlparser.test.select.SelectTest)
  testSelectJoin2(net.sf.jsqlparser.test.select.SelectTest)
  testBrackets2(net.sf.jsqlparser.test.select.SelectTest)
  testProblemSqlServer_Modulo_Proz(net.sf.jsqlparser.test.select.SelectTest)
  testGroupConcat(net.sf.jsqlparser.test.select.SelectTest)
  testWithRecursive(net.sf.jsqlparser.test.select.SelectTest)
  testFunctionRight(net.sf.jsqlparser.test.select.SelectTest)
  testSelectBrackets(net.sf.jsqlparser.test.select.SelectTest)
  testMultiPartColumnName(net.sf.jsqlparser.test.select.SelectTest)
  testWithUnionProblem3(net.sf.jsqlparser.test.select.SelectTest)
  testWithUnionProblem4(net.sf.jsqlparser.test.select.SelectTest)
  testWithUnionProblem5(net.sf.jsqlparser.test.select.SelectTest)
  testValues2(net.sf.jsqlparser.test.select.SelectTest)
  testValues3(net.sf.jsqlparser.test.select.SelectTest)
  testValues4(net.sf.jsqlparser.test.select.SelectTest)
  testValues5(net.sf.jsqlparser.test.select.SelectTest)
  testGroupBy(net.sf.jsqlparser.test.select.SelectTest)
  testMultiPartColumnNameWithTableName(net.sf.jsqlparser.test.select.SelectTest)
  testMultiPartTableNameWithDatabaseName(net.sf.jsqlparser.test.select.SelectTest)
  testPivotFunction(net.sf.jsqlparser.test.select.SelectTest)
  testMultiPartTableNameWithServerNameAndDatabaseName(net.sf.jsqlparser.test.select.SelectTest)
  testConcatProblem2_1(net.sf.jsqlparser.test.select.SelectTest)
  testConcatProblem2_2(net.sf.jsqlparser.test.select.SelectTest)
  testConcatProblem2_3(net.sf.jsqlparser.test.select.SelectTest)
  testConcatProblem2_4(net.sf.jsqlparser.test.select.SelectTest)
  testConcatProblem2_5(net.sf.jsqlparser.test.select.SelectTest)
  testConcatProblem2_6(net.sf.jsqlparser.test.select.SelectTest)
  testMultiPartColumnNameWithDatabaseNameAndSchemaNameAndTableName(net.sf.jsqlparser.test.select.SelectTest)
  testMultiPartColumnNameWithDatabaseNameAndTableName(net.sf.jsqlparser.test.select.SelectTest)
  testReplaceAsFunction(net.sf.jsqlparser.test.select.SelectTest)
  testSelectJPQLPositionalParameter(net.sf.jsqlparser.test.select.SelectTest)
  testSelectWithinGroup(net.sf.jsqlparser.test.select.SelectTest)
  testNotEqualsTo(net.sf.jsqlparser.test.select.SelectTest)
  testSelectForUpdate(net.sf.jsqlparser.test.select.SelectTest)
  testProblemSqlAnalytic10Lag(net.sf.jsqlparser.test.select.SelectTest)
  testProblemSqlAnalytic11Lag(net.sf.jsqlparser.test.select.SelectTest)
  testMatches(net.sf.jsqlparser.test.select.SelectTest)
  testAnalyticFunctionProblem1(net.sf.jsqlparser.test.select.SelectTest)
  testFunctions(net.sf.jsqlparser.test.select.SelectTest)
  testProblemFunction2(net.sf.jsqlparser.test.select.SelectTest)
  testProblemFunction3(net.sf.jsqlparser.test.select.SelectTest)
  testAnalyticFunction12(net.sf.jsqlparser.test.select.SelectTest)
  testAnalyticFunction13(net.sf.jsqlparser.test.select.SelectTest)
  testAnalyticFunction14(net.sf.jsqlparser.test.select.SelectTest)
  testAnalyticFunction15(net.sf.jsqlparser.test.select.SelectTest)
  testAnalyticFunction16(net.sf.jsqlparser.test.select.SelectTest)
  testAnalyticFunction17(net.sf.jsqlparser.test.select.SelectTest)
  testAnalyticFunction18(net.sf.jsqlparser.test.select.SelectTest)
  testMultiPartTableNameWithServerNameAndDatabaseNameAndSchemaName(net.sf.jsqlparser.test.select.SelectTest)
  testBrackets(net.sf.jsqlparser.test.select.SelectTest)
  testWithStatement(net.sf.jsqlparser.test.select.SelectTest)
  testTimestamp(net.sf.jsqlparser.test.select.SelectTest)
  testProblemSqlAnalytic5AggregateColumnValue(net.sf.jsqlparser.test.select.SelectTest)
  testMultiPartTableNameWithColumnName(net.sf.jsqlparser.test.select.SelectTest)
  testFunctionLeft(net.sf.jsqlparser.test.select.SelectTest)
  testCharacterSetClause(net.sf.jsqlparser.test.select.SelectTest)
  testComplexUnion1(net.sf.jsqlparser.test.select.SelectTest)
  testProblemSqlAnalytic6AggregateColumnValue(net.sf.jsqlparser.test.select.SelectTest)
  testDistinct(net.sf.jsqlparser.test.select.SelectTest)
  testMultiPartColumnNameWithSchemaNameAndTableName(net.sf.jsqlparser.test.select.SelectTest)
  testMultiPartTableNameWithServerName(net.sf.jsqlparser.test.select.SelectTest)
  testProblemSqlAnalytic7Count(net.sf.jsqlparser.test.select.SelectTest)
  testSelectFunction(net.sf.jsqlparser.test.select.SelectTest)
  testIssue160_signedParameter(net.sf.jsqlparser.test.select.SelectTest)
  testAllColumnsFromTable(net.sf.jsqlparser.test.select.SelectTest)
  testProblemSqlCombinedSets(net.sf.jsqlparser.test.select.SelectTest)
  testInterval1(net.sf.jsqlparser.test.select.SelectTest)
  testInterval2(net.sf.jsqlparser.test.select.SelectTest)
  testInterval3(net.sf.jsqlparser.test.select.SelectTest)
  testInterval4(net.sf.jsqlparser.test.select.SelectTest)
  testConcat(net.sf.jsqlparser.test.select.SelectTest)
  testCount2(net.sf.jsqlparser.test.select.SelectTest)
  testSignedColumns(net.sf.jsqlparser.test.select.SelectTest)
  testDouble(net.sf.jsqlparser.test.select.SelectTest)
  testProblemSqlMinus(net.sf.jsqlparser.test.select.SelectTest)
  testExists(net.sf.jsqlparser.test.select.SelectTest)
  testMultiPartTableNameWithServerProblem(net.sf.jsqlparser.test.select.SelectTest)
  testGroupByExpression(net.sf.jsqlparser.test.select.SelectTest)
  testHaving(net.sf.jsqlparser.test.select.SelectTest)
  testDistinctTop(net.sf.jsqlparser.test.select.SelectTest)
  testSelectUserVariable(net.sf.jsqlparser.test.select.SelectTest)
  testIsNot2(net.sf.jsqlparser.test.select.SelectTest)
  testSelectOracleColl(net.sf.jsqlparser.test.select.SelectTest)
  testOracleJoin(net.sf.jsqlparser.test.select.SelectTest)
  testPostgreSQLRegExpCaseSensitiveMatch2(net.sf.jsqlparser.test.select.SelectTest)
  testPostgreSQLRegExpCaseSensitiveMatch3(net.sf.jsqlparser.test.select.SelectTest)
  testPostgreSQLRegExpCaseSensitiveMatch4(net.sf.jsqlparser.test.select.SelectTest)
  testRowConstructor1(net.sf.jsqlparser.test.select.SelectTest)
  testRowConstructor2(net.sf.jsqlparser.test.select.SelectTest)
  testLimit2(net.sf.jsqlparser.test.select.SelectTest)
  testTableCrossJoin(net.sf.jsqlparser.test.select.SelectTest)
  testProblemSqlAnalytic2(net.sf.jsqlparser.test.select.SelectTest)
  testProblemSqlAnalytic3(net.sf.jsqlparser.test.select.SelectTest)
  testProblemSqlAnalytic9CommaListPartition(net.sf.jsqlparser.test.select.SelectTest)
  testSelectWithoutFrom(net.sf.jsqlparser.test.select.SelectTest)
  testPivot1(net.sf.jsqlparser.test.select.SelectTest)
  testPivot2(net.sf.jsqlparser.test.select.SelectTest)
  testPivot3(net.sf.jsqlparser.test.select.SelectTest)
  testPivot4(net.sf.jsqlparser.test.select.SelectTest)
  testPivot5(net.sf.jsqlparser.test.select.SelectTest)
  testSelectWithBrackets(net.sf.jsqlparser.test.select.SelectTest)
  testAnalyticFunctionProblem1b(net.sf.jsqlparser.test.select.SelectTest)
  testDeparser(net.sf.jsqlparser.test.select.SelectTest)
  testPivotXmlSubquery1(net.sf.jsqlparser.test.select.SelectTest)
  testOracleHierarchicalQuery2(net.sf.jsqlparser.test.select.SelectTest)
  testExtractFrom1(net.sf.jsqlparser.test.select.SelectTest)
  testExtractFrom2(net.sf.jsqlparser.test.select.SelectTest)
  testExtractFrom3(net.sf.jsqlparser.test.select.SelectTest)
  testExtractFrom4(net.sf.jsqlparser.test.select.SelectTest)
  testProblemSqlAnalytic4EmptyOver(net.sf.jsqlparser.test.select.SelectTest)
  testCastTypeProblem(net.sf.jsqlparser.test.select.SelectTest)
  testSelectKeywordPercent(net.sf.jsqlparser.test.select.SelectTest)
  testValues(net.sf.jsqlparser.test.select.SelectTest)
  testValues6BothVariants(net.sf.jsqlparser.test.select.SelectTest)
  testProblemSqlExcept(net.sf.jsqlparser.test.select.SelectTest)
  testMultiPartTableNameWithServerNameAndSchemaName(net.sf.jsqlparser.test.select.SelectTest)
  testProblemSqlServer_Modulo(net.sf.jsqlparser.test.select.SelectTest)
  testReservedKeyword(net.sf.jsqlparser.test.select.SelectTest)
  testCaseElseAddition(net.sf.jsqlparser.test.select.SelectTest)
  testNamedParameter2(net.sf.jsqlparser.test.select.SelectTest)
  testBooleanFunction1(net.sf.jsqlparser.test.select.SelectTest)
  testCastInCast2(net.sf.jsqlparser.test.select.SelectTest)
  testNamedParameter(net.sf.jsqlparser.test.select.SelectTest)

Tests run: 353, Failures: 22, Errors: 200, Skipped: 0

[INFO] ------------------------------------------------------------------------
[INFO] BUILD FAILURE
[INFO] ------------------------------------------------------------------------
[INFO] Total time: 22.260s
[INFO] Finished at: Tue Oct 06 08:57:31 CEST 2015
[INFO] Final Memory: 23M/346M
[INFO] ------------------------------------------------------------------------
[ERROR] Failed to execute goal org.apache.maven.plugins:maven-surefire-plugin:2.10:test (default-test) on project jsqlparser: There are test failures.
[ERROR] 
[ERROR] Please refer to /home/perham/Study/Experiments/2015-10-23-ICST/LittleDarwin/Cases/JSqlParser-jsqlparser-0.9.4/target/surefire-reports for the individual test results.
[ERROR] -> [Help 1]
[ERROR] 
[ERROR] To see the full stack trace of the errors, re-run Maven with the -e switch.
[ERROR] Re-run Maven using the -X switch to enable full debug logging.
[ERROR] 
[ERROR] For more information about the errors and possible solutions, please read the following articles:
[ERROR] [Help 1] http://cwiki.apache.org/confluence/display/MAVEN/MojoFailureException
