[INFO] Scanning for projects...
[INFO]                                                                         
[INFO] ------------------------------------------------------------------------
[INFO] Building JSQLParser library 0.9.4
[INFO] ------------------------------------------------------------------------
[INFO] 
[INFO] --- javacc-maven-plugin:2.6:jjtree-javacc (javacc) @ jsqlparser ---
[INFO] Skipping - all parsers are up to date
[INFO] 
[INFO] --- license-maven-plugin:1.6:update-file-header (first) @ jsqlparser ---
[INFO] Will search files to update from root /home/perham/Study/Experiments/2015-10-23-ICST/LittleDarwin/Cases/JSqlParser-jsqlparser-0.9.4/src/main/java
[INFO]  - adding license header on file /home/perham/Study/Experiments/2015-10-23-ICST/LittleDarwin/Cases/JSqlParser-jsqlparser-0.9.4/src/main/java/net/sf/jsqlparser/util/deparser/ExpressionDeParser.java
[INFO] Scan 164 files header done in 232.225ms.
[INFO] 
 * uptodate header on 163 files.
 * add header on 1 file.
[INFO] 
[INFO] --- maven-resources-plugin:2.6:resources (default-resources) @ jsqlparser ---
[INFO] Using 'UTF-8' encoding to copy filtered resources.
[INFO] skip non existing resourceDirectory /home/perham/Study/Experiments/2015-10-23-ICST/LittleDarwin/Cases/JSqlParser-jsqlparser-0.9.4/src/main/resources
[INFO] 
[INFO] --- maven-compiler-plugin:3.3:compile (default-compile) @ jsqlparser ---
[INFO] Changes detected - recompiling the module!
[INFO] Compiling 177 source files to /home/perham/Study/Experiments/2015-10-23-ICST/LittleDarwin/Cases/JSqlParser-jsqlparser-0.9.4/target/classes
[WARNING] bootstrap class path not set in conjunction with -source 1.6
[INFO] /home/perham/Study/Experiments/2015-10-23-ICST/LittleDarwin/Cases/JSqlParser-jsqlparser-0.9.4/target/generated-sources/javacc/net/sf/jsqlparser/parser/CCJSqlParser.java: /home/perham/Study/Experiments/2015-10-23-ICST/LittleDarwin/Cases/JSqlParser-jsqlparser-0.9.4/target/generated-sources/javacc/net/sf/jsqlparser/parser/CCJSqlParser.java uses unchecked or unsafe operations.
[INFO] /home/perham/Study/Experiments/2015-10-23-ICST/LittleDarwin/Cases/JSqlParser-jsqlparser-0.9.4/target/generated-sources/javacc/net/sf/jsqlparser/parser/CCJSqlParser.java: Recompile with -Xlint:unchecked for details.
[INFO] 
[INFO] --- maven-resources-plugin:2.6:testResources (default-testResources) @ jsqlparser ---
[INFO] Using 'UTF-8' encoding to copy filtered resources.
[INFO] Copying 280 resources
[INFO] 
[INFO] --- maven-compiler-plugin:3.3:testCompile (default-testCompile) @ jsqlparser ---
[INFO] Nothing to compile - all classes are up to date
[INFO] 
[INFO] --- maven-surefire-plugin:2.10:test (default-test) @ jsqlparser ---
[INFO] Surefire report directory: /home/perham/Study/Experiments/2015-10-23-ICST/LittleDarwin/Cases/JSqlParser-jsqlparser-0.9.4/target/surefire-reports

-------------------------------------------------------
 T E S T S
-------------------------------------------------------
Running net.sf.jsqlparser.test.alter.AlterTest
Tests run: 3, Failures: 0, Errors: 0, Skipped: 0, Time elapsed: 0.053 sec
Running net.sf.jsqlparser.test.create.CreateTableTest
Tests run: 27, Failures: 0, Errors: 0, Skipped: 0, Time elapsed: 0.128 sec
Running net.sf.jsqlparser.test.create.CreateIndexTest
Tests run: 6, Failures: 0, Errors: 0, Skipped: 0, Time elapsed: 0 sec
Running net.sf.jsqlparser.test.create.CreateViewTest
Tests run: 8, Failures: 0, Errors: 0, Skipped: 0, Time elapsed: 0.007 sec
Running net.sf.jsqlparser.test.delete.DeleteTest
Tests run: 2, Failures: 1, Errors: 0, Skipped: 0, Time elapsed: 0.012 sec <<< FAILURE!
Running net.sf.jsqlparser.test.simpleparsing.CCJSqlParserManagerTest
Tests run: 1, Failures: 0, Errors: 0, Skipped: 0, Time elapsed: 0.166 sec
Running net.sf.jsqlparser.test.drop.DropTest
Tests run: 2, Failures: 0, Errors: 0, Skipped: 0, Time elapsed: 0.001 sec
Running net.sf.jsqlparser.test.insert.InsertTest
Tests run: 15, Failures: 6, Errors: 0, Skipped: 0, Time elapsed: 0.046 sec <<< FAILURE!
Running net.sf.jsqlparser.test.TestUtils
Tests run: 1, Failures: 0, Errors: 0, Skipped: 0, Time elapsed: 0 sec
Running net.sf.jsqlparser.test.update.UpdateTest
Tests run: 7, Failures: 1, Errors: 0, Skipped: 0, Time elapsed: 0.005 sec <<< FAILURE!
Running net.sf.jsqlparser.test.replace.ReplaceTest
Tests run: 4, Failures: 0, Errors: 0, Skipped: 0, Time elapsed: 0.001 sec
Running net.sf.jsqlparser.test.select.SelectASTTest
*Statement
* Column
* Column
* Table
* Column
* Column
Tests run: 2, Failures: 0, Errors: 0, Skipped: 0, Time elapsed: 0.003 sec
Running net.sf.jsqlparser.test.select.SpecialOracleTest
Oct 06, 2015 8:37:25 AM net.sf.jsqlparser.test.select.SpecialOracleTest testAllSqlsParseDeparse
INFO: testing string01.sql
Oct 06, 2015 8:37:25 AM net.sf.jsqlparser.test.select.SpecialOracleTest testAllSqlsParseDeparse
INFO:    -> PROBLEM net.sf.jsqlparser.JSQLParserException
Oct 06, 2015 8:37:25 AM net.sf.jsqlparser.test.select.SpecialOracleTest testAllSqlsParseDeparse
INFO: testing returning01.sql
Oct 06, 2015 8:37:25 AM net.sf.jsqlparser.test.select.SpecialOracleTest testAllSqlsParseDeparse
INFO:    -> PROBLEM net.sf.jsqlparser.JSQLParserException
Oct 06, 2015 8:37:25 AM net.sf.jsqlparser.test.select.SpecialOracleTest testAllSqlsParseDeparse
INFO: testing keywordasidentifier05.sql
Oct 06, 2015 8:37:25 AM net.sf.jsqlparser.test.select.SpecialOracleTest testAllSqlsOnlyParse
INFO: testing comment02.sql
Oct 06, 2015 8:37:25 AM net.sf.jsqlparser.test.select.SpecialOracleTest testAllSqlsOnlyParse
INFO:    -> SUCCESS
Oct 06, 2015 8:37:25 AM net.sf.jsqlparser.test.select.SpecialOracleTest testAllSqlsOnlyParse
INFO: testing numbers02.sql
Oct 06, 2015 8:37:25 AM net.sf.jsqlparser.test.select.SpecialOracleTest testAllSqlsOnlyParse
INFO:    -> SUCCESS
Oct 06, 2015 8:37:25 AM net.sf.jsqlparser.test.select.SpecialOracleTest testAllSqlsOnlyParse
INFO: testing comment01.sql
Oct 06, 2015 8:37:25 AM net.sf.jsqlparser.test.select.SpecialOracleTest testAllSqlsOnlyParse
INFO:    -> SUCCESS
Tests run: 2, Failures: 1, Errors: 0, Skipped: 0, Time elapsed: 0.086 sec <<< FAILURE!
Running net.sf.jsqlparser.test.select.SelectTest
Tests run: 228, Failures: 106, Errors: 0, Skipped: 0, Time elapsed: 0.532 sec <<< FAILURE!
Running net.sf.jsqlparser.test.select.SpeedTest
42500 statements parsed in 7906 milliseconds
 (5375 statements per second,  0.000186 seconds per statement )
38500 select scans for table name executed in 132 milliseconds
 (291666 select scans for table name per second,  0.0000034 seconds per select scans for table name)
Tests run: 1, Failures: 0, Errors: 0, Skipped: 0, Time elapsed: 8.031 sec
Running net.sf.jsqlparser.test.truncate.TruncateTest
Tests run: 1, Failures: 0, Errors: 0, Skipped: 0, Time elapsed: 0.001 sec
Running net.sf.jsqlparser.util.TablesNamesFinderTest
Tests run: 19, Failures: 0, Errors: 0, Skipped: 0, Time elapsed: 0.014 sec
Running net.sf.jsqlparser.util.ConnectExpressionsVisitorTest
Tests run: 2, Failures: 0, Errors: 0, Skipped: 0, Time elapsed: 0.002 sec
Running net.sf.jsqlparser.util.AddAliasesVisitorTest
Tests run: 4, Failures: 0, Errors: 0, Skipped: 0, Time elapsed: 0.001 sec
Running net.sf.jsqlparser.util.SelectUtilsTest
Tests run: 6, Failures: 0, Errors: 0, Skipped: 0, Time elapsed: 0.003 sec
Running net.sf.jsqlparser.expression.ExpressionVisitorAdapterTest
Tests run: 2, Failures: 0, Errors: 0, Skipped: 0, Time elapsed: 0.003 sec
Running net.sf.jsqlparser.expression.SignedExpressionTest
Tests run: 1, Failures: 0, Errors: 0, Skipped: 0, Time elapsed: 0 sec
Running net.sf.jsqlparser.schema.ServerTest
Tests run: 2, Failures: 0, Errors: 0, Skipped: 0, Time elapsed: 0 sec
Running net.sf.jsqlparser.parser.CCJSqlParserUtilTest
Tests run: 3, Failures: 0, Errors: 0, Skipped: 0, Time elapsed: 0 sec
Running net.sf.jsqlparser.statement.SetStatementTest
Tests run: 1, Failures: 0, Errors: 0, Skipped: 0, Time elapsed: 0.002 sec
Running net.sf.jsqlparser.statement.AdaptersTest
Tests run: 1, Failures: 0, Errors: 0, Skipped: 0, Time elapsed: 0.002 sec
Running net.sf.jsqlparser.statement.StatementsTest
Tests run: 1, Failures: 0, Errors: 0, Skipped: 0, Time elapsed: 0.002 sec
Running net.sf.jsqlparser.statement.execute.ExecuteTest
Tests run: 1, Failures: 0, Errors: 0, Skipped: 0, Time elapsed: 0.001 sec

Results :

Failed tests:   testDeleteWhereProblem1(net.sf.jsqlparser.test.delete.DeleteTest): expected:<...ROM tablename WHERE [a = 1 AND ]b = 1> but was:<...ROM tablename WHERE [.a = 1 AND .]b = 1>
  testInsertMultiRowValue(net.sf.jsqlparser.test.insert.InsertTest): expected:<...col1, col2) VALUES ([a, b), (d, ]e)> but was:<...col1, col2) VALUES ([.a, .b), (.d, .]e)>
  testHexValues2(net.sf.jsqlparser.test.insert.InsertTest): expected:<...TABLE2 VALUES ('1', []"DSDD", 0xEFBFBDC7AB...> but was:<...TABLE2 VALUES ('1', [.]"DSDD", 0xEFBFBDC7AB...>
  testHexValues3(net.sf.jsqlparser.test.insert.InsertTest): expected:<...TABLE2 VALUES ('1', []"DSDD", 0xabcde)> but was:<...TABLE2 VALUES ('1', [.]"DSDD", 0xabcde)>
  testHexValues(net.sf.jsqlparser.test.insert.InsertTest): expected:<...TABLE2 VALUES ('1', []"DSDD", x'EFBFBDC7AB...> but was:<...TABLE2 VALUES ('1', [.]"DSDD", x'EFBFBDC7AB...>
  testInsertWithSelect(net.sf.jsqlparser.test.insert.InsertTest): expected:<...) WITH a AS (SELECT [mycolumn FROM mytable) SELECT ]mycolumn FROM a> but was:<...) WITH a AS (SELECT [.mycolumn FROM mytable) SELECT .]mycolumn FROM a>
  testInsertSelect(net.sf.jsqlparser.test.insert.InsertTest): expected:<...e (mycolumn) SELECT []mycolumn FROM mytabl...> but was:<...e (mycolumn) SELECT [.]mycolumn FROM mytabl...>
  testUpdateWithSelect2(net.sf.jsqlparser.test.update.UpdateTest): expected:<...l2, col3) = (SELECT [a, b, ]c FROM mytable2)> but was:<...l2, col3) = (SELECT [.a, .b, .]c FROM mytable2)>
  testAllSqlsParseDeparse(net.sf.jsqlparser.test.select.SpecialOracleTest): expected:<select []exception from excep...> but was:<select [.]exception from excep...>
  testSelectAliasWithoutAs(net.sf.jsqlparser.test.select.SelectTest): expected:<SELECT []mycolumn "My Column ...> but was:<SELECT [.]mycolumn "My Column ...>
  testMultiValueIn2(net.sf.jsqlparser.test.select.SelectTest): expected:<...mytable WHERE (trim([a), trim(b)) IN (SELECT a, ]b FROM mytable2)> but was:<...mytable WHERE (trim([.a), trim(.b)) IN (SELECT .a, .]b FROM mytable2)>
  testPostgreSQLRegExpCaseSensitiveMatch(net.sf.jsqlparser.test.select.SelectTest): expected:<SELECT [a, b FROM foo WHERE ]a ~ '[help].*'> but was:<SELECT [.a, .b FROM foo WHERE .]a ~ '[help].*'>
  testMultiPartTableNameWithSchemaName(net.sf.jsqlparser.test.select.SelectTest): expected:<SELECT []columnName FROM sche...> but was:<SELECT [.]columnName FROM sche...>
  testSelectAliasInQuotes(net.sf.jsqlparser.test.select.SelectTest): expected:<SELECT []mycolumn AS "My Colu...> but was:<SELECT [.]mycolumn AS "My Colu...>
  testOrderBy(net.sf.jsqlparser.test.select.SelectTest): expected:<...T * FROM tab1 WHERE []a > 34 GROUP BY tab1...> but was:<...T * FROM tab1 WHERE [.]a > 34 GROUP BY tab1...>
  testSkipFirst(net.sf.jsqlparser.test.select.SelectTest): expected:<...CT SKIP ?1 FIRST f1 [c1, ]c2 FROM t1> but was:<...CT SKIP ?1 FIRST f1 [.c1, .]c2 FROM t1>
  testMultiPartTableNameWithDatabaseNameAndSchemaName(net.sf.jsqlparser.test.select.SelectTest): expected:<SELECT []columnName FROM data...> but was:<SELECT [.]columnName FROM data...>
  testSelectJoinWithComma(net.sf.jsqlparser.test.select.SelectTest): expected:<...s WHERE es.nombre = []"Tamaulipas" AND cb....> but was:<...s WHERE es.nombre = [.]"Tamaulipas" AND cb....>
  testAdditionalLettersGerman(net.sf.jsqlparser.test.select.SelectTest): expected:<SELECT [colä, colö, ]colü FROM testtableä...> but was:<SELECT [.colä, .colö, .]colü FROM testtableä...>
  testWithUnionProblem(net.sf.jsqlparser.test.select.SelectTest): expected:<...TH test AS ((SELECT [mslink FROM tablea) UNION (SELECT mslink FROM tableb)) SELECT * FROM tablea WHERE mslink IN (SELECT ]mslink FROM test)> but was:<...TH test AS ((SELECT [.mslink FROM tablea) UNION (SELECT .mslink FROM tableb)) SELECT * FROM tablea WHERE .mslink IN (SELECT .]mslink FROM test)>
  testMysqlQuote(net.sf.jsqlparser.test.select.SelectTest): expected:<SELECT [`a.OWNERLASTNAME`, ]`OWNERFIRSTNAME` FRO...> but was:<SELECT [.`a.OWNERLASTNAME`, .]`OWNERFIRSTNAME` FRO...>
  testSelectInnerWith(net.sf.jsqlparser.test.select.SelectTest): expected:<...d FROM DUAL) SELECT []aid FROM actor)> but was:<...d FROM DUAL) SELECT [.]aid FROM actor)>
  testReservedKeyword2(net.sf.jsqlparser.test.select.SelectTest): expected:<SELECT []open FROM tableName> but was:<SELECT [.]open FROM tableName>
  testFirst(net.sf.jsqlparser.test.select.SelectTest): expected:<...LECT FIRST firstVar [c1, ]c2 FROM t> but was:<...LECT FIRST firstVar [.c1, .]c2 FROM t>
  testIlike(net.sf.jsqlparser.test.select.SelectTest): expected:<SELECT [col1 FROM table1 WHERE ]col1 ILIKE '%hello%'> but was:<SELECT [.col1 FROM table1 WHERE .]col1 ILIKE '%hello%'>
  testIsNot(net.sf.jsqlparser.test.select.SelectTest): expected:<...T * FROM test WHERE []a IS NOT NULL> but was:<...T * FROM test WHERE [.]a IS NOT NULL>
  testSigns(net.sf.jsqlparser.test.select.SelectTest): expected:<...CT (-(1)), -(1), (-([columnName)), -(columnName), (-1), -1, (-columnName), -]columnName FROM tabl...> but was:<...CT (-(1)), -(1), (-([.columnName)), -(.columnName), (-1), -1, (-.columnName), -.]columnName FROM tabl...>
  testWhere(net.sf.jsqlparser.test.select.SelectTest): expected:<([a + b + c / d + e * f) * (a / b * (a + ]b)) > ?> but was:<([.a + .b + .c / .d + .e * .f) * (.a / .b * (.a + .]b)) > ?>
  testRegexpLike1(net.sf.jsqlparser.test.select.SelectTest): expected:<...e WHERE REGEXP_LIKE([]first_name, '^Ste(v|...> but was:<...e WHERE REGEXP_LIKE([.]first_name, '^Ste(v|...>
  testRegexpLike2(net.sf.jsqlparser.test.select.SelectTest): expected:<...SE WHEN REGEXP_LIKE([]first_name, '^Ste(v|...> but was:<...SE WHEN REGEXP_LIKE([.]first_name, '^Ste(v|...>
  testRegexpMySQL(net.sf.jsqlparser.test.select.SelectTest): expected:<... FROM mytable WHERE []first_name REGEXP '^...> but was:<... FROM mytable WHERE [.]first_name REGEXP '^...>
  testCase(net.sf.jsqlparser.test.select.SelectTest): expected:<SELECT [a, CASE ]b WHEN 1 THEN 2 END ...> but was:<SELECT [.a, CASE .]b WHEN 1 THEN 2 END ...>
  testJoin(net.sf.jsqlparser.test.select.SelectTest): expected:<...OasSD = 'asdf' AND ([kj >= 4 OR ]l < 'sdf')> but was:<...OasSD = 'asdf' AND ([.kj >= 4 OR .]l < 'sdf')>
  testLike(net.sf.jsqlparser.test.select.SelectTest): expected:<...T * FROM tab1 WHERE []a LIKE 'test'> but was:<...T * FROM tab1 WHERE [.]a LIKE 'test'>
  testSkip(net.sf.jsqlparser.test.select.SelectTest): expected:<SELECT SKIP skipVar [c1, ]c2 FROM t> but was:<SELECT SKIP skipVar [.c1, .]c2 FROM t>
  testTime(net.sf.jsqlparser.test.select.SelectTest): expected:<...T * FROM tab1 WHERE []a > {t '04:05:34'}> but was:<...T * FROM tab1 WHERE [.]a > {t '04:05:34'}>
  testWith(net.sf.jsqlparser.test.select.SelectTest): expected:<...OMAX AS (SELECT MAX([]AVGSALARY) AS AVGMAX...> but was:<...OMAX AS (SELECT MAX([.]AVGSALARY) AS AVGMAX...>
  testConcatProblem2_5_1(net.sf.jsqlparser.test.select.SelectTest): expected:<SELECT ([a || b) || ]c FROM testtable> but was:<SELECT ([.a || .b) || .]c FROM testtable>
  testConcatProblem2_5_2(net.sf.jsqlparser.test.select.SelectTest): expected:<SELECT ([a + b) + ]c FROM testtable> but was:<SELECT ([.a + .b) + .]c FROM testtable>
  testProblemSqlAnalytic8Complex(net.sf.jsqlparser.test.select.SelectTest): expected:<SELECT [ID, NAME, SALARY, SUM(SALARY) OVER () AS SUM_SAL, AVG(SALARY) OVER () AS AVG_SAL, MIN(SALARY) OVER () AS MIN_SAL, MAX(SALARY) OVER () AS MAX_SAL, COUNT(*) OVER () AS ROWS2 FROM STAFF WHERE ID < 60 ORDER BY ]ID> but was:<SELECT [.ID, .NAME, .SALARY, SUM(SALARY) OVER () AS SUM_SAL, AVG(SALARY) OVER () AS AVG_SAL, MIN(SALARY) OVER () AS MIN_SAL, MAX(SALARY) OVER () AS MAX_SAL, COUNT(*) OVER () AS ROWS2 FROM STAFF WHERE .ID < 60 ORDER BY .]ID>
  testWithUnionAllProblem(net.sf.jsqlparser.test.select.SelectTest): expected:<...TH test AS ((SELECT [mslink FROM tablea) UNION ALL (SELECT mslink FROM tableb)) SELECT * FROM tablea WHERE mslink IN (SELECT ]mslink FROM test)> but was:<...TH test AS ((SELECT [.mslink FROM tablea) UNION ALL (SELECT .mslink FROM tableb)) SELECT * FROM tablea WHERE .mslink IN (SELECT .]mslink FROM test)>
  testIssue162_doubleUserVar(net.sf.jsqlparser.test.select.SelectTest): expected:<...ELECT @@SPID AS ID, [SYSTEM_USER AS "Login Name", ]USER AS "User Name"> but was:<...ELECT @@SPID AS ID, [.SYSTEM_USER AS "Login Name", .]USER AS "User Name">
  testOrderByNullsFirst(net.sf.jsqlparser.test.select.SelectTest): expected:<SELECT [a FROM tab1 ORDER BY ]a NULLS FIRST> but was:<SELECT [.a FROM tab1 ORDER BY .]a NULLS FIRST>
  testProblemSqlAnalytic(net.sf.jsqlparser.test.select.SelectTest): expected:<SELECT []a, row_number() OVER...> but was:<SELECT [.]a, row_number() OVER...>
  testSelectNumericBind(net.sf.jsqlparser.test.select.SelectTest): expected:<SELECT [a FROM b WHERE ]c = :1> but was:<SELECT [.a FROM b WHERE .]c = :1>
  testRegexpBinaryMySQL(net.sf.jsqlparser.test.select.SelectTest): expected:<... FROM mytable WHERE []first_name REGEXP BI...> but was:<... FROM mytable WHERE [.]first_name REGEXP BI...>
  testMultiValueIn(net.sf.jsqlparser.test.select.SelectTest): expected:<...FROM mytable WHERE ([a, b, c) IN (SELECT a, b, ]c FROM mytable2)> but was:<...FROM mytable WHERE ([.a, .b, .c) IN (SELECT .a, .b, .]c FROM mytable2)>
  testBitwise(net.sf.jsqlparser.test.select.SelectTest): expected:<SELECT [col1 & 32, col2 ^ col1, col1 | ]col2 FROM table1> but was:<SELECT [.col1 & 32, .col2 ^ .col1, .col1 | .]col2 FROM table1>
  testSelectItems(net.sf.jsqlparser.test.select.SelectTest): expected:<SELECT [myid AS MYID, ]mycol, tab.*, schema...> but was:<SELECT [.myid AS MYID, .]mycol, tab.*, schema...>
  testBrackets2(net.sf.jsqlparser.test.select.SelectTest): expected:<SELECT [][a] FROM t> but was:<SELECT [.][a] FROM t>
  testGroupConcat(net.sf.jsqlparser.test.select.SelectTest): expected:<SELECT [student_name, GROUP_CONCAT(DISTINCT test_score ORDER BY test_score DESC SEPARATOR ' ') FROM student GROUP BY ]student_name> but was:<SELECT [.student_name, GROUP_CONCAT(DISTINCT test_score ORDER BY test_score DESC SEPARATOR ' ') FROM student GROUP BY .]student_name>
  testWithRecursive(net.sf.jsqlparser.test.select.SelectTest): expected:<...) UNION ALL (SELECT [n + 1 FROM t WHERE n < 100)) SELECT sum(]n) FROM t> but was:<...) UNION ALL (SELECT [.n + 1 FROM t WHERE .n < 100)) SELECT sum(.]n) FROM t>
  testSelectKeepOver(net.sf.jsqlparser.test.select.SelectTest): expected:<... employees ORDER BY [department_id, ]salary> but was:<... employees ORDER BY [.department_id, .]salary>
  testMultiPartColumnName(net.sf.jsqlparser.test.select.SelectTest): expected:<SELECT []columnName FROM tabl...> but was:<SELECT [.]columnName FROM tabl...>
  testWithUnionProblem3(net.sf.jsqlparser.test.select.SelectTest): expected:<...TH test AS ((SELECT [mslink, CAST(tablea.fname AS varchar) FROM tablea INNER JOIN tableb ON tablea.mslink = tableb.mslink AND tableb.deleted = 0 WHERE tablea.fname IS NULL AND 1 = 0) UNION ALL (SELECT mslink FROM tableb)) SELECT * FROM tablea WHERE mslink IN (SELECT ]mslink FROM test)> but was:<...TH test AS ((SELECT [.mslink, CAST(tablea.fname AS varchar) FROM tablea INNER JOIN tableb ON tablea.mslink = tableb.mslink AND tableb.deleted = 0 WHERE tablea.fname IS NULL AND 1 = 0) UNION ALL (SELECT .mslink FROM tableb)) SELECT * FROM tablea WHERE .mslink IN (SELECT .]mslink FROM test)>
  testWithUnionProblem4(net.sf.jsqlparser.test.select.SelectTest): expected:<...slink <> 0)) SELECT [mslink, space(level * 4) + txt AS txt, nr, feature, path FROM hist WHERE EXISTS (SELECT feature FROM tablec WHERE mslink = 0 AND ((feature IN (1, 2) AND hist.feature = 3) OR (]feature IN (4) AND h...> but was:<...slink <> 0)) SELECT [.mslink, space(.level * 4) + .txt AS txt, .nr, .feature, .path FROM hist WHERE EXISTS (SELECT .feature FROM tablec WHERE .mslink = 0 AND ((.feature IN (1, 2) AND hist.feature = 3) OR (.]feature IN (4) AND h...>
  testValues5(net.sf.jsqlparser.test.select.SelectTest): expected:<SELECT [X, ]Y FROM (VALUES (0, '...> but was:<SELECT [.X, .]Y FROM (VALUES (0, '...>
  testGroupBy(net.sf.jsqlparser.test.select.SelectTest): expected:<...T * FROM tab1 WHERE []a > 34 GROUP BY tab1...> but was:<...T * FROM tab1 WHERE [.]a > 34 GROUP BY tab1...>
  testMultiPartTableNameWithDatabaseName(net.sf.jsqlparser.test.select.SelectTest): expected:<SELECT []columnName FROM data...> but was:<SELECT [.]columnName FROM data...>
  testPivotFunction(net.sf.jsqlparser.test.select.SelectTest): expected:<...ECT to_char((SELECT [col1 FROM (SELECT times_purchased, state_code FROM customers t) PIVOT (count(state_code) FOR state_code IN ('NY', 'CT', 'NJ', 'FL', 'MO')) ORDER BY ]times_purchased)) FR...> but was:<...ECT to_char((SELECT [.col1 FROM (SELECT .times_purchased, .state_code FROM customers t) PIVOT (count(state_code) FOR state_code IN ('NY', 'CT', 'NJ', 'FL', 'MO')) ORDER BY .]times_purchased)) FR...>
  testMultiPartTableNameWithServerNameAndDatabaseName(net.sf.jsqlparser.test.select.SelectTest): expected:<SELECT []columnName FROM [ser...> but was:<SELECT [.]columnName FROM [ser...>
  testConcatProblem2_5(net.sf.jsqlparser.test.select.SelectTest): expected:<SELECT max(([a || b) || ]c) FROM testtable> but was:<SELECT max(([.a || .b) || .]c) FROM testtable>
  testConcatProblem2_6(net.sf.jsqlparser.test.select.SelectTest): expected:<SELECT max([a || b || ]c) FROM testtable> but was:<SELECT max([.a || .b || .]c) FROM testtable>
  testReplaceAsFunction(net.sf.jsqlparser.test.select.SelectTest): expected:<SELECT REPLACE([a, 'b', ]c) FROM tab1> but was:<SELECT REPLACE([.a, 'b', .]c) FROM tab1>
  testSelectJPQLPositionalParameter(net.sf.jsqlparser.test.select.SelectTest): expected:<SELECT [email FROM users WHERE (type LIKE 'B') AND (]username LIKE ?1)> but was:<SELECT [.email FROM users WHERE (.type LIKE 'B') AND (.]username LIKE ?1)>
  testNotEqualsTo(net.sf.jsqlparser.test.select.SelectTest): expected:<...CT * FROM foo WHERE [a != ]b> but was:<...CT * FROM foo WHERE [.a != .]b>
  testProblemSqlAnalytic10Lag(net.sf.jsqlparser.test.select.SelectTest): expected:<SELECT []a, lag(a, 1) OVER (P...> but was:<SELECT [.]a, lag(a, 1) OVER (P...>
  testProblemSqlAnalytic11Lag(net.sf.jsqlparser.test.select.SelectTest): expected:<SELECT []a, lag(a, 1, 0) OVER...> but was:<SELECT [.]a, lag(a, 1, 0) OVER...>
  testFunctions(net.sf.jsqlparser.test.select.SelectTest): expected:<SELECT MAX([]id) AS max FROM myta...> but was:<SELECT MAX([.]id) AS max FROM myta...>
  testProblemFunction2(net.sf.jsqlparser.test.select.SelectTest): expected:<SELECT []sysdate FROM testtab...> but was:<SELECT [.]sysdate FROM testtab...>
  testProblemFunction3(net.sf.jsqlparser.test.select.SelectTest): expected:<SELECT TRUNCATE([]col) FROM testtable> but was:<SELECT TRUNCATE([.]col) FROM testtable>
  testSelectOrderHaving(net.sf.jsqlparser.test.select.SelectTest): expected:<SELECT [units, count(units) AS num FROM currency GROUP BY units HAVING count(units) > 1 ORDER BY ]num> but was:<SELECT [.units, count(.units) AS num FROM currency GROUP BY .units HAVING count(.units) > 1 ORDER BY .]num>
  testMultiPartTableNameWithServerNameAndDatabaseNameAndSchemaName(net.sf.jsqlparser.test.select.SelectTest): expected:<SELECT []columnName FROM [ser...> but was:<SELECT [.]columnName FROM [ser...>
  testWithStatement(net.sf.jsqlparser.test.select.SelectTest): expected:<...ITH test AS (SELECT [mslink FROM feature) SELECT * FROM feature WHERE mslink IN (SELECT ]mslink FROM test)> but was:<...ITH test AS (SELECT [.mslink FROM feature) SELECT * FROM feature WHERE .mslink IN (SELECT .]mslink FROM test)>
  testTimestamp(net.sf.jsqlparser.test.select.SelectTest): expected:<...T * FROM tab1 WHERE []a > {ts '2004-04-30 ...> but was:<...T * FROM tab1 WHERE [.]a > {ts '2004-04-30 ...>
  testProblemSqlAnalytic5AggregateColumnValue(net.sf.jsqlparser.test.select.SelectTest): expected:<SELECT []a, sum(b) OVER () AS...> but was:<SELECT [.]a, sum(b) OVER () AS...>
  testMultiPartTableNameWithColumnName(net.sf.jsqlparser.test.select.SelectTest): expected:<SELECT []columnName FROM tabl...> but was:<SELECT [.]columnName FROM tabl...>
  testProblemSqlAnalytic6AggregateColumnValue(net.sf.jsqlparser.test.select.SelectTest): expected:<SELECT []a, sum(b + 5) OVER (...> but was:<SELECT [.]a, sum(b + 5) OVER (...>
  testDistinct(net.sf.jsqlparser.test.select.SelectTest): expected:<SELECT DISTINCT ON ([myid) myid, ]mycol FROM mytable W...> but was:<SELECT DISTINCT ON ([.myid) .myid, .]mycol FROM mytable W...>
  testMultiPartTableNameWithServerName(net.sf.jsqlparser.test.select.SelectTest): expected:<SELECT []columnName FROM [ser...> but was:<SELECT [.]columnName FROM [ser...>
  testIssue160_signedParameter(net.sf.jsqlparser.test.select.SelectTest): expected:<SELECT [start_date WHERE start_date > DATEADD(]HH, -?, GETDATE())> but was:<SELECT [.start_date WHERE .start_date > DATEADD(.]HH, -?, GETDATE())>
  testConcat(net.sf.jsqlparser.test.select.SelectTest): expected:<SELECT [a || b || ]c + 4 FROM t> but was:<SELECT [.a || .b || .]c + 4 FROM t>
  testCount2(net.sf.jsqlparser.test.select.SelectTest): expected:<SELECT count(ALL [col1 + ]col2) FROM mytable> but was:<SELECT count(ALL [.col1 + .]col2) FROM mytable>
  testSignedColumns(net.sf.jsqlparser.test.select.SelectTest): expected:<SELECT -[columnName, +columnName, +(columnName), -(]columnName) FROM tab...> but was:<SELECT -[.columnName, +.columnName, +(.columnName), -(.]columnName) FROM tab...>
  testGroupByExpression(net.sf.jsqlparser.test.select.SelectTest): expected:<SELECT [col1, col2, col1 + col2, sum(col8) FROM table1 GROUP BY col1, col2, col1 + ]col2> but was:<SELECT [.col1, .col2, .col1 + .col2, sum(.col8) FROM table1 GROUP BY .col1, .col2, .col1 + .]col2>
  testHaving(net.sf.jsqlparser.test.select.SelectTest): expected:<....b) FROM tab1 WHERE []a > 34 GROUP BY tab1...> but was:<....b) FROM tab1 WHERE [.]a > 34 GROUP BY tab1...>
  testIssue154(net.sf.jsqlparser.test.select.SelectTest): expected:<...c.discount_id WHERE [merchant_id = ? AND deleted = ? AND dc.discount_id IS NULL AND modified_time < ? AND modified_time >= ? ORDER BY ]modified_time> but was:<...c.discount_id WHERE [.merchant_id = ? AND .deleted = ? AND dc.discount_id IS NULL AND .modified_time < ? AND .modified_time >= ? ORDER BY .]modified_time>
  testDistinctTop(net.sf.jsqlparser.test.select.SelectTest): expected:<...LECT DISTINCT TOP 5 [myid, ]mycol FROM mytable W...> but was:<...LECT DISTINCT TOP 5 [.myid, .]mycol FROM mytable W...>
  testIsNot2(net.sf.jsqlparser.test.select.SelectTest): expected:<...T * FROM test WHERE []a IS NOT NULL> but was:<...T * FROM test WHERE [.]a IS NOT NULL>
  testSelectOracleColl(net.sf.jsqlparser.test.select.SelectTest): expected:<...ERE TT.COL1 = lines([]idx).COL1> but was:<...ERE TT.COL1 = lines([.]idx).COL1>
  testPostgreSQLRegExpCaseSensitiveMatch2(net.sf.jsqlparser.test.select.SelectTest): expected:<SELECT [a, b FROM foo WHERE ]a ~* '[help].*'> but was:<SELECT [.a, .b FROM foo WHERE .]a ~* '[help].*'>
  testPostgreSQLRegExpCaseSensitiveMatch3(net.sf.jsqlparser.test.select.SelectTest): expected:<SELECT [a, b FROM foo WHERE ]a !~ '[help].*'> but was:<SELECT [.a, .b FROM foo WHERE .]a !~ '[help].*'>
  testPostgreSQLRegExpCaseSensitiveMatch4(net.sf.jsqlparser.test.select.SelectTest): expected:<SELECT [a, b FROM foo WHERE ]a !~* '[help].*'> but was:<SELECT [.a, .b FROM foo WHERE .]a !~* '[help].*'>
  testRowConstructor1(net.sf.jsqlparser.test.select.SelectTest): expected:<...CT * FROM t1 WHERE ([col1, col2) = (SELECT col3, col4 FROM t2 WHERE ]id = 10)> but was:<...CT * FROM t1 WHERE ([.col1, .col2) = (SELECT .col3, .col4 FROM t2 WHERE .]id = 10)>
  testRowConstructor2(net.sf.jsqlparser.test.select.SelectTest): expected:<...* FROM t1 WHERE ROW([col1, col2) = (SELECT col3, col4 FROM t2 WHERE ]id = 10)> but was:<...* FROM t1 WHERE ROW([.col1, .col2) = (SELECT .col3, .col4 FROM t2 WHERE .]id = 10)>
  testProblemSqlAnalytic2(net.sf.jsqlparser.test.select.SelectTest): expected:<SELECT []a, row_number() OVER...> but was:<SELECT [.]a, row_number() OVER...>
  testProblemSqlAnalytic3(net.sf.jsqlparser.test.select.SelectTest): expected:<SELECT []a, row_number() OVER...> but was:<SELECT [.]a, row_number() OVER...>
  testProblemSqlAnalytic9CommaListPartition(net.sf.jsqlparser.test.select.SelectTest): expected:<SELECT []a, row_number() OVER...> but was:<SELECT [.]a, row_number() OVER...>
  testOracleHierarchicalQuery(net.sf.jsqlparser.test.select.SelectTest): expected:<SELECT [last_name, employee_id, manager_id FROM employees CONNECT BY employee_id = manager_id ORDER BY ]last_name> but was:<SELECT [.last_name, .employee_id, .manager_id FROM employees CONNECT BY employee_id = manager_id ORDER BY .]last_name>
  testDeparser(net.sf.jsqlparser.test.select.SelectTest): expected:<...LECT count(DISTINCT []f + 4) FROM a> but was:<...LECT count(DISTINCT [.]f + 4) FROM a>
  testPivotXmlSubquery1(net.sf.jsqlparser.test.select.SelectTest): expected:<...LECT * FROM (SELECT [times_purchased, state_code FROM customers t) PIVOT (count(state_code) FOR state_code IN ('NY', 'CT', 'NJ', 'FL', 'MO')) ORDER BY ]times_purchased> but was:<...LECT * FROM (SELECT [.times_purchased, .state_code FROM customers t) PIVOT (count(state_code) FOR state_code IN ('NY', 'CT', 'NJ', 'FL', 'MO')) ORDER BY .]times_purchased>
  testOracleHierarchicalQuery2(net.sf.jsqlparser.test.select.SelectTest): expected:<SELECT [employee_id, last_name, ]manager_id FROM empl...> but was:<SELECT [.employee_id, .last_name, .]manager_id FROM empl...>
  testOracleHierarchicalQuery3(net.sf.jsqlparser.test.select.SelectTest): expected:<SELECT [last_name, employee_id, manager_id, LEVEL FROM employees START WITH employee_id = 100 CONNECT BY PRIOR employee_id = manager_id ORDER SIBLINGS BY ]last_name> but was:<SELECT [.last_name, .employee_id, .manager_id, .LEVEL FROM employees START WITH employee_id = 100 CONNECT BY PRIOR employee_id = manager_id ORDER SIBLINGS BY .]last_name>
  testOracleHierarchicalQuery4(net.sf.jsqlparser.test.select.SelectTest): expected:<SELECT [last_name, employee_id, manager_id, LEVEL FROM employees CONNECT BY PRIOR employee_id = manager_id START WITH employee_id = 100 ORDER SIBLINGS BY ]last_name> but was:<SELECT [.last_name, .employee_id, .manager_id, .LEVEL FROM employees CONNECT BY PRIOR employee_id = manager_id START WITH employee_id = 100 ORDER SIBLINGS BY .]last_name>
  testExtractFrom1(net.sf.jsqlparser.test.select.SelectTest): expected:<... EXTRACT(month FROM []datecolumn) FROM tes...> but was:<... EXTRACT(month FROM [.]datecolumn) FROM tes...>
  testProblemSqlAnalytic4EmptyOver(net.sf.jsqlparser.test.select.SelectTest): expected:<SELECT []a, row_number() OVER...> but was:<SELECT [.]a, row_number() OVER...>
  testSelectKeywordPercent(net.sf.jsqlparser.test.select.SelectTest): expected:<SELECT []percent FROM MY_TABL...> but was:<SELECT [.]percent FROM MY_TABL...>
  testValues6BothVariants(net.sf.jsqlparser.test.select.SelectTest): expected:<SELECT [I FROM (VALUES 1, 2, 3) AS MY_TEMP_TABLE(I) WHERE ]I IN (SELECT * FROM ...> but was:<SELECT [.I FROM (VALUES 1, 2, 3) AS MY_TEMP_TABLE(I) WHERE .]I IN (SELECT * FROM ...>
  testMultiPartTableNameWithServerNameAndSchemaName(net.sf.jsqlparser.test.select.SelectTest): expected:<SELECT []columnName FROM [ser...> but was:<SELECT [.]columnName FROM [ser...>
  testProblemSqlServer_Modulo(net.sf.jsqlparser.test.select.SelectTest): expected:<...char(255), DATEDIFF([month, year1, abc_datum) / 12) + ' year, ' + convert(varchar(255), DATEDIFF(month, year2, ]abc_datum) % 12) + '...> but was:<...char(255), DATEDIFF([.month, .year1, .abc_datum) / 12) + ' year, ' + convert(varchar(255), DATEDIFF(.month, .year2, .]abc_datum) % 12) + '...>
  testReservedKeyword(net.sf.jsqlparser.test.select.SelectTest): expected:<SELECT [cast, do, extract, first, following, last, materialized, nulls, partition, range, row, rows, siblings, value, ]xml FROM tableName> but was:<SELECT [.cast, .do, .extract, .first, .following, .last, .materialized, .nulls, .partition, .range, .row, .rows, .siblings, .value, .]xml FROM tableName>
  testSelectKeep(net.sf.jsqlparser.test.select.SelectTest): expected:<SELECT [col1, min(col2) KEEP (DENSE_RANK FIRST ORDER BY col3), col4 FROM table1 GROUP BY col5 ORDER BY ]col3> but was:<SELECT [.col1, min(.col2) KEEP (DENSE_RANK FIRST ORDER BY col3), .col4 FROM table1 GROUP BY .col5 ORDER BY .]col3>
  testNamedParameter2(net.sf.jsqlparser.test.select.SelectTest): expected:<... FROM mytable WHERE [a = :param OR a = :param2 AND ]b = :param3> but was:<... FROM mytable WHERE [.a = :param OR .a = :param2 AND .]b = :param3>
  testBooleanFunction1(net.sf.jsqlparser.test.select.SelectTest): expected:<...ble WHERE test_func([]col1)> but was:<...ble WHERE test_func([.]col1)>
  testNamedParameter(net.sf.jsqlparser.test.select.SelectTest): expected:<... FROM mytable WHERE []b = :param> but was:<... FROM mytable WHERE [.]b = :param>

Tests run: 353, Failures: 115, Errors: 0, Skipped: 0

[INFO] ------------------------------------------------------------------------
[INFO] BUILD FAILURE
[INFO] ------------------------------------------------------------------------
[INFO] Total time: 16.291s
[INFO] Finished at: Tue Oct 06 08:37:33 CEST 2015
[INFO] Final Memory: 23M/346M
[INFO] ------------------------------------------------------------------------
[ERROR] Failed to execute goal org.apache.maven.plugins:maven-surefire-plugin:2.10:test (default-test) on project jsqlparser: There are test failures.
[ERROR] 
[ERROR] Please refer to /home/perham/Study/Experiments/2015-10-23-ICST/LittleDarwin/Cases/JSqlParser-jsqlparser-0.9.4/target/surefire-reports for the individual test results.
[ERROR] -> [Help 1]
[ERROR] 
[ERROR] To see the full stack trace of the errors, re-run Maven with the -e switch.
[ERROR] Re-run Maven using the -X switch to enable full debug logging.
[ERROR] 
[ERROR] For more information about the errors and possible solutions, please read the following articles:
[ERROR] [Help 1] http://cwiki.apache.org/confluence/display/MAVEN/MojoFailureException
