[INFO] Scanning for projects...
[INFO]                                                                         
[INFO] ------------------------------------------------------------------------
[INFO] Building JSQLParser library 0.9.4
[INFO] ------------------------------------------------------------------------
[INFO] 
[INFO] --- javacc-maven-plugin:2.6:jjtree-javacc (javacc) @ jsqlparser ---
[INFO] Skipping - all parsers are up to date
[INFO] 
[INFO] --- license-maven-plugin:1.6:update-file-header (first) @ jsqlparser ---
[INFO] Will search files to update from root /home/perham/Study/Experiments/2015-10-23-ICST/LittleDarwin/Cases/JSqlParser-jsqlparser-0.9.4/src/main/java
[INFO]  - adding license header on file /home/perham/Study/Experiments/2015-10-23-ICST/LittleDarwin/Cases/JSqlParser-jsqlparser-0.9.4/src/main/java/net/sf/jsqlparser/statement/select/SelectExpressionItem.java
[INFO] Scan 164 files header done in 229.69ms.
[INFO] 
 * uptodate header on 163 files.
 * add header on 1 file.
[INFO] 
[INFO] --- maven-resources-plugin:2.6:resources (default-resources) @ jsqlparser ---
[INFO] Using 'UTF-8' encoding to copy filtered resources.
[INFO] skip non existing resourceDirectory /home/perham/Study/Experiments/2015-10-23-ICST/LittleDarwin/Cases/JSqlParser-jsqlparser-0.9.4/src/main/resources
[INFO] 
[INFO] --- maven-compiler-plugin:3.3:compile (default-compile) @ jsqlparser ---
[INFO] Changes detected - recompiling the module!
[INFO] Compiling 177 source files to /home/perham/Study/Experiments/2015-10-23-ICST/LittleDarwin/Cases/JSqlParser-jsqlparser-0.9.4/target/classes
[WARNING] bootstrap class path not set in conjunction with -source 1.6
[INFO] /home/perham/Study/Experiments/2015-10-23-ICST/LittleDarwin/Cases/JSqlParser-jsqlparser-0.9.4/target/generated-sources/javacc/net/sf/jsqlparser/parser/CCJSqlParser.java: /home/perham/Study/Experiments/2015-10-23-ICST/LittleDarwin/Cases/JSqlParser-jsqlparser-0.9.4/target/generated-sources/javacc/net/sf/jsqlparser/parser/CCJSqlParser.java uses unchecked or unsafe operations.
[INFO] /home/perham/Study/Experiments/2015-10-23-ICST/LittleDarwin/Cases/JSqlParser-jsqlparser-0.9.4/target/generated-sources/javacc/net/sf/jsqlparser/parser/CCJSqlParser.java: Recompile with -Xlint:unchecked for details.
[INFO] 
[INFO] --- maven-resources-plugin:2.6:testResources (default-testResources) @ jsqlparser ---
[INFO] Using 'UTF-8' encoding to copy filtered resources.
[INFO] Copying 280 resources
[INFO] 
[INFO] --- maven-compiler-plugin:3.3:testCompile (default-testCompile) @ jsqlparser ---
[INFO] Nothing to compile - all classes are up to date
[INFO] 
[INFO] --- maven-surefire-plugin:2.10:test (default-test) @ jsqlparser ---
[INFO] Surefire report directory: /home/perham/Study/Experiments/2015-10-23-ICST/LittleDarwin/Cases/JSqlParser-jsqlparser-0.9.4/target/surefire-reports

-------------------------------------------------------
 T E S T S
-------------------------------------------------------
Running net.sf.jsqlparser.test.alter.AlterTest
Tests run: 3, Failures: 0, Errors: 0, Skipped: 0, Time elapsed: 0.056 sec
Running net.sf.jsqlparser.test.create.CreateTableTest
Tests run: 27, Failures: 0, Errors: 2, Skipped: 0, Time elapsed: 0.14 sec <<< FAILURE!
Running net.sf.jsqlparser.test.create.CreateIndexTest
Tests run: 6, Failures: 0, Errors: 0, Skipped: 0, Time elapsed: 0.004 sec
Running net.sf.jsqlparser.test.create.CreateViewTest
Tests run: 8, Failures: 0, Errors: 4, Skipped: 0, Time elapsed: 0.009 sec <<< FAILURE!
Running net.sf.jsqlparser.test.delete.DeleteTest
Tests run: 2, Failures: 0, Errors: 0, Skipped: 0, Time elapsed: 0.004 sec
Running net.sf.jsqlparser.test.simpleparsing.CCJSqlParserManagerTest
Tests run: 1, Failures: 0, Errors: 0, Skipped: 0, Time elapsed: 0.192 sec
Running net.sf.jsqlparser.test.drop.DropTest
Tests run: 2, Failures: 0, Errors: 0, Skipped: 0, Time elapsed: 0 sec
Running net.sf.jsqlparser.test.insert.InsertTest
Tests run: 15, Failures: 1, Errors: 3, Skipped: 0, Time elapsed: 0.043 sec <<< FAILURE!
Running net.sf.jsqlparser.test.TestUtils
Tests run: 1, Failures: 0, Errors: 0, Skipped: 0, Time elapsed: 0 sec
Running net.sf.jsqlparser.test.update.UpdateTest
Tests run: 7, Failures: 0, Errors: 2, Skipped: 0, Time elapsed: 0.003 sec <<< FAILURE!
Running net.sf.jsqlparser.test.replace.ReplaceTest
Tests run: 4, Failures: 0, Errors: 1, Skipped: 0, Time elapsed: 0.003 sec <<< FAILURE!
Running net.sf.jsqlparser.test.select.SelectASTTest
*Statement
* Column
* Column
* Table
* Column
* Column
Tests run: 2, Failures: 0, Errors: 0, Skipped: 0, Time elapsed: 0.003 sec
Running net.sf.jsqlparser.test.select.SpecialOracleTest
Oct 06, 2015 7:56:05 AM net.sf.jsqlparser.test.select.SpecialOracleTest testAllSqlsParseDeparse
INFO: testing string01.sql
Oct 06, 2015 7:56:05 AM net.sf.jsqlparser.test.select.SpecialOracleTest testAllSqlsParseDeparse
INFO:    -> PROBLEM net.sf.jsqlparser.JSQLParserException
Oct 06, 2015 7:56:05 AM net.sf.jsqlparser.test.select.SpecialOracleTest testAllSqlsParseDeparse
INFO: testing returning01.sql
Oct 06, 2015 7:56:05 AM net.sf.jsqlparser.test.select.SpecialOracleTest testAllSqlsParseDeparse
INFO:    -> PROBLEM net.sf.jsqlparser.JSQLParserException
Oct 06, 2015 7:56:05 AM net.sf.jsqlparser.test.select.SpecialOracleTest testAllSqlsParseDeparse
INFO: testing keywordasidentifier05.sql
Oct 06, 2015 7:56:05 AM net.sf.jsqlparser.test.select.SpecialOracleTest testAllSqlsParseDeparse
INFO:    -> PROBLEM java.lang.NullPointerException
Oct 06, 2015 7:56:05 AM net.sf.jsqlparser.test.select.SpecialOracleTest testAllSqlsParseDeparse
INFO: testing function07.sql
Oct 06, 2015 7:56:05 AM net.sf.jsqlparser.test.select.SpecialOracleTest testAllSqlsParseDeparse
INFO:    -> PROBLEM net.sf.jsqlparser.JSQLParserException
Oct 06, 2015 7:56:05 AM net.sf.jsqlparser.test.select.SpecialOracleTest testAllSqlsParseDeparse
INFO: testing cast_multiset15.sql
Oct 06, 2015 7:56:05 AM net.sf.jsqlparser.test.select.SpecialOracleTest testAllSqlsParseDeparse
INFO:    -> PROBLEM net.sf.jsqlparser.JSQLParserException
Oct 06, 2015 7:56:05 AM net.sf.jsqlparser.test.select.SpecialOracleTest testAllSqlsParseDeparse
INFO: testing interval01.sql
Oct 06, 2015 7:56:05 AM net.sf.jsqlparser.test.select.SpecialOracleTest testAllSqlsParseDeparse
INFO:    -> PROBLEM net.sf.jsqlparser.JSQLParserException
Oct 06, 2015 7:56:05 AM net.sf.jsqlparser.test.select.SpecialOracleTest testAllSqlsParseDeparse
INFO: testing analytic_query04.sql
Oct 06, 2015 7:56:05 AM net.sf.jsqlparser.test.select.SpecialOracleTest testAllSqlsParseDeparse
INFO:    -> PROBLEM net.sf.jsqlparser.JSQLParserException
Oct 06, 2015 7:56:05 AM net.sf.jsqlparser.test.select.SpecialOracleTest testAllSqlsParseDeparse
INFO: testing join10.sql
Oct 06, 2015 7:56:05 AM net.sf.jsqlparser.test.select.SpecialOracleTest testAllSqlsParseDeparse
INFO:    -> SUCCESS
Oct 06, 2015 7:56:05 AM net.sf.jsqlparser.test.select.SpecialOracleTest testAllSqlsParseDeparse
INFO: testing pivot04.sql
Oct 06, 2015 7:56:05 AM net.sf.jsqlparser.test.select.SpecialOracleTest testAllSqlsParseDeparse
INFO:    -> PROBLEM net.sf.jsqlparser.JSQLParserException
Oct 06, 2015 7:56:05 AM net.sf.jsqlparser.test.select.SpecialOracleTest testAllSqlsParseDeparse
INFO: testing condition08.sql
Oct 06, 2015 7:56:05 AM net.sf.jsqlparser.test.select.SpecialOracleTest testAllSqlsParseDeparse
INFO:    -> PROBLEM net.sf.jsqlparser.JSQLParserException
Oct 06, 2015 7:56:05 AM net.sf.jsqlparser.test.select.SpecialOracleTest testAllSqlsParseDeparse
INFO: testing function03.sql
Oct 06, 2015 7:56:05 AM net.sf.jsqlparser.test.select.SpecialOracleTest testAllSqlsParseDeparse
INFO:    -> PROBLEM net.sf.jsqlparser.JSQLParserException
Oct 06, 2015 7:56:05 AM net.sf.jsqlparser.test.select.SpecialOracleTest testAllSqlsParseDeparse
INFO: testing merge03.sql
Oct 06, 2015 7:56:05 AM net.sf.jsqlparser.test.select.SpecialOracleTest testAllSqlsParseDeparse
INFO:    -> PROBLEM net.sf.jsqlparser.JSQLParserException
Oct 06, 2015 7:56:05 AM net.sf.jsqlparser.test.select.SpecialOracleTest testAllSqlsParseDeparse
INFO: testing insert02.sql
Oct 06, 2015 7:56:05 AM net.sf.jsqlparser.test.select.SpecialOracleTest testAllSqlsParseDeparse
INFO:    -> PROBLEM net.sf.jsqlparser.JSQLParserException
Oct 06, 2015 7:56:05 AM net.sf.jsqlparser.test.select.SpecialOracleTest testAllSqlsParseDeparse
INFO: testing insert11.sql
Oct 06, 2015 7:56:05 AM net.sf.jsqlparser.test.select.SpecialOracleTest testAllSqlsParseDeparse
INFO:    -> PROBLEM net.sf.jsqlparser.JSQLParserException
Oct 06, 2015 7:56:05 AM net.sf.jsqlparser.test.select.SpecialOracleTest testAllSqlsParseDeparse
INFO: testing interval02.sql
Oct 06, 2015 7:56:05 AM net.sf.jsqlparser.test.select.SpecialOracleTest testAllSqlsParseDeparse
INFO:    -> PROBLEM java.lang.NullPointerException
Oct 06, 2015 7:56:05 AM net.sf.jsqlparser.test.select.SpecialOracleTest testAllSqlsParseDeparse
INFO: testing cast_multiset18.sql
Oct 06, 2015 7:56:05 AM net.sf.jsqlparser.test.select.SpecialOracleTest testAllSqlsParseDeparse
INFO:    -> PROBLEM net.sf.jsqlparser.JSQLParserException
Oct 06, 2015 7:56:05 AM net.sf.jsqlparser.test.select.SpecialOracleTest testAllSqlsParseDeparse
INFO: testing query_factoring08.sql
Oct 06, 2015 7:56:05 AM net.sf.jsqlparser.test.select.SpecialOracleTest testAllSqlsParseDeparse
INFO:    -> SUCCESS
Oct 06, 2015 7:56:05 AM net.sf.jsqlparser.test.select.SpecialOracleTest testAllSqlsParseDeparse
INFO: testing condition04.sql
Oct 06, 2015 7:56:12 AM net.sf.jsqlparser.test.select.SpecialOracleTest testAllSqlsParseDeparse
INFO:    -> SUCCESS
Oct 06, 2015 7:56:12 AM net.sf.jsqlparser.test.select.SpecialOracleTest testAllSqlsParseDeparse
INFO: testing xmltable02.sql
Oct 06, 2015 7:56:12 AM net.sf.jsqlparser.test.select.SpecialOracleTest testAllSqlsParseDeparse
INFO:    -> PROBLEM net.sf.jsqlparser.JSQLParserException
Oct 06, 2015 7:56:12 AM net.sf.jsqlparser.test.select.SpecialOracleTest testAllSqlsParseDeparse
INFO: testing for_update08.sql
Oct 06, 2015 7:56:12 AM net.sf.jsqlparser.test.select.SpecialOracleTest testAllSqlsParseDeparse
INFO:    -> PROBLEM net.sf.jsqlparser.JSQLParserException
Oct 06, 2015 7:56:12 AM net.sf.jsqlparser.test.select.SpecialOracleTest testAllSqlsParseDeparse
INFO: testing for_update03.sql
Oct 06, 2015 7:56:12 AM net.sf.jsqlparser.test.select.SpecialOracleTest testAllSqlsParseDeparse
INFO:    -> PROBLEM java.lang.NullPointerException
Oct 06, 2015 7:56:12 AM net.sf.jsqlparser.test.select.SpecialOracleTest testAllSqlsParseDeparse
INFO: testing condition06.sql
Oct 06, 2015 7:56:12 AM net.sf.jsqlparser.test.select.SpecialOracleTest testAllSqlsParseDeparse
INFO:    -> PROBLEM net.sf.jsqlparser.JSQLParserException
Oct 06, 2015 7:56:12 AM net.sf.jsqlparser.test.select.SpecialOracleTest testAllSqlsParseDeparse
INFO: testing cast_multiset29.sql
Oct 06, 2015 7:56:12 AM net.sf.jsqlparser.test.select.SpecialOracleTest testAllSqlsOnlyParse
INFO: testing comment02.sql
Oct 06, 2015 7:56:12 AM net.sf.jsqlparser.test.select.SpecialOracleTest testAllSqlsOnlyParse
INFO:    -> SUCCESS
Oct 06, 2015 7:56:12 AM net.sf.jsqlparser.test.select.SpecialOracleTest testAllSqlsOnlyParse
INFO: testing numbers02.sql
Oct 06, 2015 7:56:12 AM net.sf.jsqlparser.test.select.SpecialOracleTest testAllSqlsOnlyParse
INFO:    -> SUCCESS
Oct 06, 2015 7:56:12 AM net.sf.jsqlparser.test.select.SpecialOracleTest testAllSqlsOnlyParse
INFO: testing comment01.sql
Oct 06, 2015 7:56:12 AM net.sf.jsqlparser.test.select.SpecialOracleTest testAllSqlsOnlyParse
INFO:    -> SUCCESS
Tests run: 2, Failures: 1, Errors: 0, Skipped: 0, Time elapsed: 6.92 sec <<< FAILURE!
Running net.sf.jsqlparser.test.select.SelectTest
Tests run: 228, Failures: 18, Errors: 145, Skipped: 0, Time elapsed: 0.26 sec <<< FAILURE!
Running net.sf.jsqlparser.test.select.SpeedTest
42500 statements parsed in 8009 milliseconds
 (5306 statements per second,  0.0001885 seconds per statement )
38500 select scans for table name executed in 135 milliseconds
 (285185 select scans for table name per second,  0.0000035 seconds per select scans for table name)
Tests run: 1, Failures: 0, Errors: 0, Skipped: 0, Time elapsed: 8.134 sec
Running net.sf.jsqlparser.test.truncate.TruncateTest
Tests run: 1, Failures: 0, Errors: 0, Skipped: 0, Time elapsed: 0.001 sec
Running net.sf.jsqlparser.util.TablesNamesFinderTest
Tests run: 19, Failures: 0, Errors: 0, Skipped: 0, Time elapsed: 0.019 sec
Running net.sf.jsqlparser.util.ConnectExpressionsVisitorTest
Tests run: 2, Failures: 2, Errors: 0, Skipped: 0, Time elapsed: 0.006 sec <<< FAILURE!
Running net.sf.jsqlparser.util.AddAliasesVisitorTest
Tests run: 4, Failures: 4, Errors: 0, Skipped: 0, Time elapsed: 0.003 sec <<< FAILURE!
Running net.sf.jsqlparser.util.SelectUtilsTest
Tests run: 6, Failures: 0, Errors: 4, Skipped: 0, Time elapsed: 0.003 sec <<< FAILURE!
Running net.sf.jsqlparser.expression.ExpressionVisitorAdapterTest
Tests run: 2, Failures: 0, Errors: 0, Skipped: 0, Time elapsed: 0.001 sec
Running net.sf.jsqlparser.expression.SignedExpressionTest
Tests run: 1, Failures: 0, Errors: 0, Skipped: 0, Time elapsed: 0.001 sec
Running net.sf.jsqlparser.schema.ServerTest
Tests run: 2, Failures: 0, Errors: 0, Skipped: 0, Time elapsed: 0.001 sec
Running net.sf.jsqlparser.parser.CCJSqlParserUtilTest
Tests run: 3, Failures: 0, Errors: 0, Skipped: 0, Time elapsed: 0.001 sec
Running net.sf.jsqlparser.statement.SetStatementTest
Tests run: 1, Failures: 0, Errors: 0, Skipped: 0, Time elapsed: 0.003 sec
Running net.sf.jsqlparser.statement.AdaptersTest
Tests run: 1, Failures: 0, Errors: 0, Skipped: 0, Time elapsed: 0.001 sec
Running net.sf.jsqlparser.statement.StatementsTest
Tests run: 1, Failures: 0, Errors: 0, Skipped: 0, Time elapsed: 0.003 sec
Running net.sf.jsqlparser.statement.execute.ExecuteTest
Tests run: 1, Failures: 0, Errors: 0, Skipped: 0, Time elapsed: 0.001 sec

Results :

Failed tests:   testInsertWithReturning3(net.sf.jsqlparser.test.insert.InsertTest): expected:<...S ('1') RETURNING id[ AS a1, id2 AS a]2> but was:<...S ('1') RETURNING id[, id]2>
  testAllSqlsParseDeparse(net.sf.jsqlparser.test.select.SpecialOracleTest): expected:<...,sal))as empsal_ntt)[as empsals ]from emp> but was:<...,sal))as empsal_ntt)[]from emp>
  testSelectAliasWithoutAs(net.sf.jsqlparser.test.select.SelectTest): expected:<SELECT mycolumn ["My Column Name" ]FROM mytable> but was:<SELECT mycolumn []FROM mytable>
  testSelectAliasInQuotes(net.sf.jsqlparser.test.select.SelectTest): expected:<SELECT mycolumn [AS "My Column Name" ]FROM mytable> but was:<SELECT mycolumn []FROM mytable>
  testJsonExpression(net.sf.jsqlparser.test.select.SelectTest): expected:<...>'thumbnail'->'url' [AS thumb ]FROM instagram> but was:<...>'thumbnail'->'url' []FROM instagram>
  testIssue162_doubleUserVar(net.sf.jsqlparser.test.select.SelectTest): expected:<SELECT @@SPID[ AS ID, SYSTEM_USER AS "Login Name", USER AS "User Name"]> but was:<SELECT @@SPID[, SYSTEM_USER, USER]>
  testConcatProblem2(net.sf.jsqlparser.test.select.SelectTest): expected:<...CHT)::VARCHAR (1))) [AS GESLACHT_TMP ]FROM testtable> but was:<...CHT)::VARCHAR (1))) []FROM testtable>
  testSelectKeepOver(net.sf.jsqlparser.test.select.SelectTest): expected:<... BY department_id ) ["Worst" ]FROM employees ORDER...> but was:<... BY department_id ) []FROM employees ORDER...>
  testConcatProblem2_2(net.sf.jsqlparser.test.select.SelectTest): expected:<...AAR))::VARCHAR (4)) [AS GESLACHT_TMP ]FROM testtable> but was:<...AAR))::VARCHAR (4)) []FROM testtable>
  testAnalyticFunctionProblem1(net.sf.jsqlparser.test.select.SelectTest): expected:<...ORDER BY s.date_id) [AS col ]FROM s> but was:<...ORDER BY s.date_id) []FROM s>
  testFunctions(net.sf.jsqlparser.test.select.SelectTest): expected:<SELECT MAX(id) [AS max ]FROM mytable WHERE m...> but was:<SELECT MAX(id) []FROM mytable WHERE m...>
  testAnalyticFunction17(net.sf.jsqlparser.test.select.SelectTest): expected:<...NG AND 0 PRECEDING) [AS avg_of_current_sal ]FROM emp> but was:<...NG AND 0 PRECEDING) []FROM emp>
  testAnalyticFunction18(net.sf.jsqlparser.test.select.SelectTest): expected:<... RANGE CURRENT ROW) [AS avg_of_current_sal ]FROM emp> but was:<... RANGE CURRENT ROW) []FROM emp>
  testBrackets(net.sf.jsqlparser.test.select.SelectTest): expected:<SELECT table_a.name [AS [Test] ]FROM table_a> but was:<SELECT table_a.name []FROM table_a>
  testCharacterSetClause(net.sf.jsqlparser.test.select.SelectTest): expected:<...CHARACTER SET utf8) [AS `v0` ]FROM people `view0` ...> but was:<...CHARACTER SET utf8) []FROM people `view0` ...>
  testProblemSqlAnalytic7Count(net.sf.jsqlparser.test.select.SelectTest): expected:<...CT count(*) OVER () [AS n ]FROM table1> but was:<...CT count(*) OVER () []FROM table1>
  testSelectFunction(net.sf.jsqlparser.test.select.SelectTest): expected:<SELECT 1 + 2[ AS sum]> but was:<SELECT 1 + 2[]>
  testInterval2(net.sf.jsqlparser.test.select.SelectTest): expected:<...YYYY-MM-DD-HH24:')) [AS START_TIME ]FROM tab1> but was:<...YYYY-MM-DD-HH24:')) []FROM tab1>
  testAnalyticFunctionProblem1b(net.sf.jsqlparser.test.select.SelectTest): expected:<...NBOUNDED FOLLOWING) [AS col ]FROM s> but was:<...NBOUNDED FOLLOWING) []FROM s>
  testCaseElseAddition(net.sf.jsqlparser.test.select.SelectTest): expected:<...0 ELSE 1000 + 1 END [AS d ]FROM dual> but was:<...0 ELSE 1000 + 1 END []FROM dual>
  testVisit_PlainSelect_concat(net.sf.jsqlparser.util.ConnectExpressionsVisitorTest): expected:<SELECT a || b || c [AS expr ]FROM test> but was:<SELECT a || b || c []FROM test>
  testVisit_PlainSelect_addition(net.sf.jsqlparser.util.ConnectExpressionsVisitorTest): expected:<SELECT a + b + c [AS testexpr ]FROM test> but was:<SELECT a + b + c []FROM test>
  testVisit_SetOperationList(net.sf.jsqlparser.util.AddAliasesVisitorTest): expected:<(SELECT 3 + 4 [AS A1 FROM test) UNION (SELECT 7 + 8 AS A1] FROM test2)> but was:<(SELECT 3 + 4 [FROM test) UNION (SELECT 7 + 8] FROM test2)>
  testVisit_PlainSelect(net.sf.jsqlparser.util.AddAliasesVisitorTest): expected:<SELECT a[ AS A1, b AS A2, c AS A3] FROM test> but was:<SELECT a[, b, c] FROM test>
  testVisit_PlainSelect_expression(net.sf.jsqlparser.util.AddAliasesVisitorTest): expected:<SELECT 3 + 4 [AS A1 ]FROM test> but was:<SELECT 3 + 4 []FROM test>
  testVisit_PlainSelect_duplicates(net.sf.jsqlparser.util.AddAliasesVisitorTest): expected:<SELECT a[ AS A2, b AS a1, c AS A3] FROM test> but was:<SELECT a[, b, c] FROM test>

Tests in error: 
  testCreateTableAsSelect(net.sf.jsqlparser.test.create.CreateTableTest)
  testCreateTableAsSelect2(net.sf.jsqlparser.test.create.CreateTableTest)
  testCreateView4(net.sf.jsqlparser.test.create.CreateViewTest)
  testCreateViewUnion(net.sf.jsqlparser.test.create.CreateViewTest)
  testCreateMaterializedView(net.sf.jsqlparser.test.create.CreateViewTest)
  testCreateViewWithColumnNames1(net.sf.jsqlparser.test.create.CreateViewTest)
  testInsertWithReturning(net.sf.jsqlparser.test.insert.InsertTest)
  testInsertWithSelect(net.sf.jsqlparser.test.insert.InsertTest)
  testInsertSelect(net.sf.jsqlparser.test.insert.InsertTest)
  testUpdateWithSelect2(net.sf.jsqlparser.test.update.UpdateTest)
  testUpdateWithSelect(net.sf.jsqlparser.test.update.UpdateTest)
  testProblemReplaceParseDeparse(net.sf.jsqlparser.test.replace.ReplaceTest)
  testAllConditionSubSelect(net.sf.jsqlparser.test.select.SelectTest)
  testSimpleSigns(net.sf.jsqlparser.test.select.SelectTest)
  testMultiValueIn2(net.sf.jsqlparser.test.select.SelectTest)
  testPostgreSQLRegExpCaseSensitiveMatch(net.sf.jsqlparser.test.select.SelectTest)
  testMultiPartTableNameWithSchemaName(net.sf.jsqlparser.test.select.SelectTest)
  testSelectBrackets2(net.sf.jsqlparser.test.select.SelectTest)
  testSelectBrackets3(net.sf.jsqlparser.test.select.SelectTest)
  testSelectBrackets4(net.sf.jsqlparser.test.select.SelectTest)
  testSimpleAdditionsAndSubtractionsWithSigns(net.sf.jsqlparser.test.select.SelectTest)
  testCastTypeProblem2(net.sf.jsqlparser.test.select.SelectTest)
  testCastTypeProblem3(net.sf.jsqlparser.test.select.SelectTest)
  testCastTypeProblem4(net.sf.jsqlparser.test.select.SelectTest)
  testCastTypeProblem5(net.sf.jsqlparser.test.select.SelectTest)
  testCastTypeProblem6(net.sf.jsqlparser.test.select.SelectTest)
  testCastTypeProblem7(net.sf.jsqlparser.test.select.SelectTest)
  testCastInCast(net.sf.jsqlparser.test.select.SelectTest)
  testSkipFirst(net.sf.jsqlparser.test.select.SelectTest)
  testMultiPartTableNameWithDatabaseNameAndSchemaName(net.sf.jsqlparser.test.select.SelectTest)
  testSelectJoinWithComma(net.sf.jsqlparser.test.select.SelectTest)
  testAdditionalLettersGerman(net.sf.jsqlparser.test.select.SelectTest)
  testWithUnionProblem(net.sf.jsqlparser.test.select.SelectTest)
  testMysqlQuote(net.sf.jsqlparser.test.select.SelectTest)
  testSelectInnerWith(net.sf.jsqlparser.test.select.SelectTest)
  testReservedKeyword2(net.sf.jsqlparser.test.select.SelectTest)
  testFirst(net.sf.jsqlparser.test.select.SelectTest)
  testIlike(net.sf.jsqlparser.test.select.SelectTest)
  testSigns(net.sf.jsqlparser.test.select.SelectTest)
  testRegexpLike2(net.sf.jsqlparser.test.select.SelectTest)
  testCase(net.sf.jsqlparser.test.select.SelectTest)
  testCast(net.sf.jsqlparser.test.select.SelectTest)
  testSkip(net.sf.jsqlparser.test.select.SelectTest)
  testWith(net.sf.jsqlparser.test.select.SelectTest)
  testConcatProblem2_5_1(net.sf.jsqlparser.test.select.SelectTest)
  testConcatProblem2_5_2(net.sf.jsqlparser.test.select.SelectTest)
  testProblemSqlAnalytic8Complex(net.sf.jsqlparser.test.select.SelectTest)
  testWithUnionAllProblem(net.sf.jsqlparser.test.select.SelectTest)
  testAnyConditionSubSelect(net.sf.jsqlparser.test.select.SelectTest)
  testPivotXml1(net.sf.jsqlparser.test.select.SelectTest)
  testPivotXml2(net.sf.jsqlparser.test.select.SelectTest)
  testSelectWithBrackets2(net.sf.jsqlparser.test.select.SelectTest)
  testOrderByNullsFirst(net.sf.jsqlparser.test.select.SelectTest)
  testProblemSqlServer_Modulo_mod(net.sf.jsqlparser.test.select.SelectTest)
  testProblemSqlAnalytic(net.sf.jsqlparser.test.select.SelectTest)
  testLateral1(net.sf.jsqlparser.test.select.SelectTest)
  testSelectNumericBind(net.sf.jsqlparser.test.select.SelectTest)
  testLateralComplex1(net.sf.jsqlparser.test.select.SelectTest)
  testMultiValueIn(net.sf.jsqlparser.test.select.SelectTest)
  testProblemFunction(net.sf.jsqlparser.test.select.SelectTest)
  testBitwise(net.sf.jsqlparser.test.select.SelectTest)
  testSelectItems(net.sf.jsqlparser.test.select.SelectTest)
  testBrackets2(net.sf.jsqlparser.test.select.SelectTest)
  testProblemSqlServer_Modulo_Proz(net.sf.jsqlparser.test.select.SelectTest)
  testFirstWithKeywordLimit(net.sf.jsqlparser.test.select.SelectTest)
  testGroupConcat(net.sf.jsqlparser.test.select.SelectTest)
  testWithRecursive(net.sf.jsqlparser.test.select.SelectTest)
  testFunctionRight(net.sf.jsqlparser.test.select.SelectTest)
  testSelectBrackets(net.sf.jsqlparser.test.select.SelectTest)
  testMultiPartColumnName(net.sf.jsqlparser.test.select.SelectTest)
  testWithUnionProblem3(net.sf.jsqlparser.test.select.SelectTest)
  testWithUnionProblem4(net.sf.jsqlparser.test.select.SelectTest)
  testWithUnionProblem5(net.sf.jsqlparser.test.select.SelectTest)
  testValues5(net.sf.jsqlparser.test.select.SelectTest)
  testMultiPartColumnNameWithTableName(net.sf.jsqlparser.test.select.SelectTest)
  testMultiPartTableNameWithDatabaseName(net.sf.jsqlparser.test.select.SelectTest)
  testPivotFunction(net.sf.jsqlparser.test.select.SelectTest)
  testMultiPartTableNameWithServerNameAndDatabaseName(net.sf.jsqlparser.test.select.SelectTest)
  testConcatProblem2_1(net.sf.jsqlparser.test.select.SelectTest)
  testConcatProblem2_3(net.sf.jsqlparser.test.select.SelectTest)
  testConcatProblem2_4(net.sf.jsqlparser.test.select.SelectTest)
  testConcatProblem2_5(net.sf.jsqlparser.test.select.SelectTest)
  testConcatProblem2_6(net.sf.jsqlparser.test.select.SelectTest)
  testMultiPartColumnNameWithDatabaseNameAndSchemaNameAndTableName(net.sf.jsqlparser.test.select.SelectTest)
  testMultiPartColumnNameWithDatabaseNameAndTableName(net.sf.jsqlparser.test.select.SelectTest)
  testReplaceAsFunction(net.sf.jsqlparser.test.select.SelectTest)
  testSelectJPQLPositionalParameter(net.sf.jsqlparser.test.select.SelectTest)
  testSelectWithinGroup(net.sf.jsqlparser.test.select.SelectTest)
  testProblemSqlAnalytic10Lag(net.sf.jsqlparser.test.select.SelectTest)
  testProblemSqlAnalytic11Lag(net.sf.jsqlparser.test.select.SelectTest)
  testProblemFunction2(net.sf.jsqlparser.test.select.SelectTest)
  testProblemFunction3(net.sf.jsqlparser.test.select.SelectTest)
  testSelectOrderHaving(net.sf.jsqlparser.test.select.SelectTest)
  testAnalyticFunction12(net.sf.jsqlparser.test.select.SelectTest)
  testAnalyticFunction13(net.sf.jsqlparser.test.select.SelectTest)
  testAnalyticFunction14(net.sf.jsqlparser.test.select.SelectTest)
  testAnalyticFunction15(net.sf.jsqlparser.test.select.SelectTest)
  testAnalyticFunction16(net.sf.jsqlparser.test.select.SelectTest)
  testMultiPartTableNameWithServerNameAndDatabaseNameAndSchemaName(net.sf.jsqlparser.test.select.SelectTest)
  testWithStatement(net.sf.jsqlparser.test.select.SelectTest)
  testIssue154_2(net.sf.jsqlparser.test.select.SelectTest)
  testProblemSqlAnalytic5AggregateColumnValue(net.sf.jsqlparser.test.select.SelectTest)
  testMultiPartTableNameWithColumnName(net.sf.jsqlparser.test.select.SelectTest)
  testFunctionLeft(net.sf.jsqlparser.test.select.SelectTest)
  testComplexUnion1(net.sf.jsqlparser.test.select.SelectTest)
  testProblemSqlAnalytic6AggregateColumnValue(net.sf.jsqlparser.test.select.SelectTest)
  testDistinct(net.sf.jsqlparser.test.select.SelectTest)
  testMultiPartColumnNameWithSchemaNameAndTableName(net.sf.jsqlparser.test.select.SelectTest)
  testMultiPartTableNameWithServerName(net.sf.jsqlparser.test.select.SelectTest)
  testIssue160_signedParameter(net.sf.jsqlparser.test.select.SelectTest)
  testInterval1(net.sf.jsqlparser.test.select.SelectTest)
  testInterval3(net.sf.jsqlparser.test.select.SelectTest)
  testInterval4(net.sf.jsqlparser.test.select.SelectTest)
  testConcat(net.sf.jsqlparser.test.select.SelectTest)
  testCount2(net.sf.jsqlparser.test.select.SelectTest)
  testSignedColumns(net.sf.jsqlparser.test.select.SelectTest)
  testDouble(net.sf.jsqlparser.test.select.SelectTest)
  testGroupByExpression(net.sf.jsqlparser.test.select.SelectTest)
  testHaving(net.sf.jsqlparser.test.select.SelectTest)
  testIssue154(net.sf.jsqlparser.test.select.SelectTest)
  testDistinctTop(net.sf.jsqlparser.test.select.SelectTest)
  testSelectUserVariable(net.sf.jsqlparser.test.select.SelectTest)
  testTopWithParenthesis(net.sf.jsqlparser.test.select.SelectTest)
  testPostgreSQLRegExpCaseSensitiveMatch2(net.sf.jsqlparser.test.select.SelectTest)
  testPostgreSQLRegExpCaseSensitiveMatch3(net.sf.jsqlparser.test.select.SelectTest)
  testPostgreSQLRegExpCaseSensitiveMatch4(net.sf.jsqlparser.test.select.SelectTest)
  testRowConstructor1(net.sf.jsqlparser.test.select.SelectTest)
  testRowConstructor2(net.sf.jsqlparser.test.select.SelectTest)
  testProblemSqlAnalytic2(net.sf.jsqlparser.test.select.SelectTest)
  testProblemSqlAnalytic3(net.sf.jsqlparser.test.select.SelectTest)
  testProblemSqlAnalytic9CommaListPartition(net.sf.jsqlparser.test.select.SelectTest)
  testSelectWithoutFrom(net.sf.jsqlparser.test.select.SelectTest)
  testOracleHierarchicalQuery(net.sf.jsqlparser.test.select.SelectTest)
  testPivot1(net.sf.jsqlparser.test.select.SelectTest)
  testPivot2(net.sf.jsqlparser.test.select.SelectTest)
  testPivot3(net.sf.jsqlparser.test.select.SelectTest)
  testPivot4(net.sf.jsqlparser.test.select.SelectTest)
  testSelectWithBrackets(net.sf.jsqlparser.test.select.SelectTest)
  testDeparser(net.sf.jsqlparser.test.select.SelectTest)
  testPivotXmlSubquery1(net.sf.jsqlparser.test.select.SelectTest)
  testOracleHierarchicalQuery2(net.sf.jsqlparser.test.select.SelectTest)
  testOracleHierarchicalQuery3(net.sf.jsqlparser.test.select.SelectTest)
  testOracleHierarchicalQuery4(net.sf.jsqlparser.test.select.SelectTest)
  testExtractFrom1(net.sf.jsqlparser.test.select.SelectTest)
  testExtractFrom2(net.sf.jsqlparser.test.select.SelectTest)
  testExtractFrom3(net.sf.jsqlparser.test.select.SelectTest)
  testExtractFrom4(net.sf.jsqlparser.test.select.SelectTest)
  testProblemSqlAnalytic4EmptyOver(net.sf.jsqlparser.test.select.SelectTest)
  testCastTypeProblem(net.sf.jsqlparser.test.select.SelectTest)
  testSelectKeywordPercent(net.sf.jsqlparser.test.select.SelectTest)
  testValues6BothVariants(net.sf.jsqlparser.test.select.SelectTest)
  testMultiPartTableNameWithServerNameAndSchemaName(net.sf.jsqlparser.test.select.SelectTest)
  testProblemSqlServer_Modulo(net.sf.jsqlparser.test.select.SelectTest)
  testReservedKeyword(net.sf.jsqlparser.test.select.SelectTest)
  testSelectJoin(net.sf.jsqlparser.test.select.SelectTest)
  testSelectKeep(net.sf.jsqlparser.test.select.SelectTest)
  testCastInCast2(net.sf.jsqlparser.test.select.SelectTest)
  testBuildSelectFromTableAndExpressions(net.sf.jsqlparser.util.SelectUtilsTest)
  testAddExpr(net.sf.jsqlparser.util.SelectUtilsTest)
  testAddJoin(net.sf.jsqlparser.util.SelectUtilsTest)
  testBuildSelectFromTableAndParsedExpression(net.sf.jsqlparser.util.SelectUtilsTest)

Tests run: 353, Failures: 26, Errors: 161, Skipped: 0

[INFO] ------------------------------------------------------------------------
[INFO] BUILD FAILURE
[INFO] ------------------------------------------------------------------------
[INFO] Total time: 22.728s
[INFO] Finished at: Tue Oct 06 07:56:20 CEST 2015
[INFO] Final Memory: 23M/346M
[INFO] ------------------------------------------------------------------------
[ERROR] Failed to execute goal org.apache.maven.plugins:maven-surefire-plugin:2.10:test (default-test) on project jsqlparser: There are test failures.
[ERROR] 
[ERROR] Please refer to /home/perham/Study/Experiments/2015-10-23-ICST/LittleDarwin/Cases/JSqlParser-jsqlparser-0.9.4/target/surefire-reports for the individual test results.
[ERROR] -> [Help 1]
[ERROR] 
[ERROR] To see the full stack trace of the errors, re-run Maven with the -e switch.
[ERROR] Re-run Maven using the -X switch to enable full debug logging.
[ERROR] 
[ERROR] For more information about the errors and possible solutions, please read the following articles:
[ERROR] [Help 1] http://cwiki.apache.org/confluence/display/MAVEN/MojoFailureException
