[INFO] Scanning for projects...
[INFO]                                                                         
[INFO] ------------------------------------------------------------------------
[INFO] Building JSQLParser library 0.9.4
[INFO] ------------------------------------------------------------------------
[INFO] 
[INFO] --- javacc-maven-plugin:2.6:jjtree-javacc (javacc) @ jsqlparser ---
[INFO] Skipping - all parsers are up to date
[INFO] 
[INFO] --- license-maven-plugin:1.6:update-file-header (first) @ jsqlparser ---
[INFO] Will search files to update from root /home/perham/Study/Experiments/2015-10-23-ICST/LittleDarwin/Cases/JSqlParser-jsqlparser-0.9.4/src/main/java
[INFO]  - adding license header on file /home/perham/Study/Experiments/2015-10-23-ICST/LittleDarwin/Cases/JSqlParser-jsqlparser-0.9.4/src/main/java/net/sf/jsqlparser/statement/select/PlainSelect.java
[INFO] Scan 164 files header done in 228.467ms.
[INFO] 
 * uptodate header on 163 files.
 * add header on 1 file.
[INFO] 
[INFO] --- maven-resources-plugin:2.6:resources (default-resources) @ jsqlparser ---
[INFO] Using 'UTF-8' encoding to copy filtered resources.
[INFO] skip non existing resourceDirectory /home/perham/Study/Experiments/2015-10-23-ICST/LittleDarwin/Cases/JSqlParser-jsqlparser-0.9.4/src/main/resources
[INFO] 
[INFO] --- maven-compiler-plugin:3.3:compile (default-compile) @ jsqlparser ---
[INFO] Changes detected - recompiling the module!
[INFO] Compiling 177 source files to /home/perham/Study/Experiments/2015-10-23-ICST/LittleDarwin/Cases/JSqlParser-jsqlparser-0.9.4/target/classes
[WARNING] bootstrap class path not set in conjunction with -source 1.6
[INFO] /home/perham/Study/Experiments/2015-10-23-ICST/LittleDarwin/Cases/JSqlParser-jsqlparser-0.9.4/target/generated-sources/javacc/net/sf/jsqlparser/parser/CCJSqlParser.java: /home/perham/Study/Experiments/2015-10-23-ICST/LittleDarwin/Cases/JSqlParser-jsqlparser-0.9.4/target/generated-sources/javacc/net/sf/jsqlparser/parser/CCJSqlParser.java uses unchecked or unsafe operations.
[INFO] /home/perham/Study/Experiments/2015-10-23-ICST/LittleDarwin/Cases/JSqlParser-jsqlparser-0.9.4/target/generated-sources/javacc/net/sf/jsqlparser/parser/CCJSqlParser.java: Recompile with -Xlint:unchecked for details.
[INFO] 
[INFO] --- maven-resources-plugin:2.6:testResources (default-testResources) @ jsqlparser ---
[INFO] Using 'UTF-8' encoding to copy filtered resources.
[INFO] Copying 280 resources
[INFO] 
[INFO] --- maven-compiler-plugin:3.3:testCompile (default-testCompile) @ jsqlparser ---
[INFO] Nothing to compile - all classes are up to date
[INFO] 
[INFO] --- maven-surefire-plugin:2.10:test (default-test) @ jsqlparser ---
[INFO] Surefire report directory: /home/perham/Study/Experiments/2015-10-23-ICST/LittleDarwin/Cases/JSqlParser-jsqlparser-0.9.4/target/surefire-reports

-------------------------------------------------------
 T E S T S
-------------------------------------------------------
Running net.sf.jsqlparser.test.alter.AlterTest
Tests run: 3, Failures: 0, Errors: 0, Skipped: 0, Time elapsed: 0.057 sec
Running net.sf.jsqlparser.test.create.CreateTableTest
Tests run: 27, Failures: 2, Errors: 0, Skipped: 0, Time elapsed: 0.132 sec <<< FAILURE!
Running net.sf.jsqlparser.test.create.CreateIndexTest
Tests run: 6, Failures: 0, Errors: 0, Skipped: 0, Time elapsed: 0.001 sec
Running net.sf.jsqlparser.test.create.CreateViewTest
Tests run: 8, Failures: 8, Errors: 0, Skipped: 0, Time elapsed: 0.013 sec <<< FAILURE!
Running net.sf.jsqlparser.test.delete.DeleteTest
Tests run: 2, Failures: 0, Errors: 0, Skipped: 0, Time elapsed: 0.003 sec
Running net.sf.jsqlparser.test.simpleparsing.CCJSqlParserManagerTest
Tests run: 1, Failures: 0, Errors: 0, Skipped: 0, Time elapsed: 0.185 sec
Running net.sf.jsqlparser.test.drop.DropTest
Tests run: 2, Failures: 0, Errors: 0, Skipped: 0, Time elapsed: 0 sec
Running net.sf.jsqlparser.test.insert.InsertTest
Tests run: 15, Failures: 3, Errors: 0, Skipped: 0, Time elapsed: 0.044 sec <<< FAILURE!
Running net.sf.jsqlparser.test.TestUtils
Tests run: 1, Failures: 0, Errors: 0, Skipped: 0, Time elapsed: 0.001 sec
Running net.sf.jsqlparser.test.update.UpdateTest
Tests run: 7, Failures: 3, Errors: 0, Skipped: 0, Time elapsed: 0.004 sec <<< FAILURE!
Running net.sf.jsqlparser.test.replace.ReplaceTest
Tests run: 4, Failures: 1, Errors: 0, Skipped: 0, Time elapsed: 0.001 sec <<< FAILURE!
Running net.sf.jsqlparser.test.select.SelectASTTest
*Statement
* Column
* Column
* Table
* Column
* Column
Tests run: 2, Failures: 0, Errors: 0, Skipped: 0, Time elapsed: 0.002 sec
Running net.sf.jsqlparser.test.select.SpecialOracleTest
Oct 06, 2015 7:48:11 AM net.sf.jsqlparser.test.select.SpecialOracleTest testAllSqlsParseDeparse
INFO: testing string01.sql
Oct 06, 2015 7:48:11 AM net.sf.jsqlparser.test.select.SpecialOracleTest testAllSqlsParseDeparse
INFO:    -> PROBLEM net.sf.jsqlparser.JSQLParserException
Oct 06, 2015 7:48:11 AM net.sf.jsqlparser.test.select.SpecialOracleTest testAllSqlsParseDeparse
INFO: testing returning01.sql
Oct 06, 2015 7:48:11 AM net.sf.jsqlparser.test.select.SpecialOracleTest testAllSqlsParseDeparse
INFO:    -> PROBLEM net.sf.jsqlparser.JSQLParserException
Oct 06, 2015 7:48:11 AM net.sf.jsqlparser.test.select.SpecialOracleTest testAllSqlsParseDeparse
INFO: testing keywordasidentifier05.sql
Oct 06, 2015 7:48:11 AM net.sf.jsqlparser.test.select.SpecialOracleTest testAllSqlsOnlyParse
INFO: testing comment02.sql
Oct 06, 2015 7:48:11 AM net.sf.jsqlparser.test.select.SpecialOracleTest testAllSqlsOnlyParse
INFO:    -> SUCCESS
Oct 06, 2015 7:48:11 AM net.sf.jsqlparser.test.select.SpecialOracleTest testAllSqlsOnlyParse
INFO: testing numbers02.sql
Oct 06, 2015 7:48:11 AM net.sf.jsqlparser.test.select.SpecialOracleTest testAllSqlsOnlyParse
INFO:    -> SUCCESS
Oct 06, 2015 7:48:11 AM net.sf.jsqlparser.test.select.SpecialOracleTest testAllSqlsOnlyParse
INFO: testing comment01.sql
Oct 06, 2015 7:48:11 AM net.sf.jsqlparser.test.select.SpecialOracleTest testAllSqlsOnlyParse
INFO:    -> SUCCESS
Tests run: 2, Failures: 1, Errors: 0, Skipped: 0, Time elapsed: 0.086 sec <<< FAILURE!
Running net.sf.jsqlparser.test.select.SelectTest
Tests run: 228, Failures: 207, Errors: 0, Skipped: 0, Time elapsed: 0.554 sec <<< FAILURE!
Running net.sf.jsqlparser.test.select.SpeedTest
42500 statements parsed in 7970 milliseconds
 (5332 statements per second,  0.0001875 seconds per statement )
38500 select scans for table name executed in 138 milliseconds
 (278985 select scans for table name per second,  0.0000036 seconds per select scans for table name)
Tests run: 1, Failures: 0, Errors: 0, Skipped: 0, Time elapsed: 8.094 sec
Running net.sf.jsqlparser.test.truncate.TruncateTest
Tests run: 1, Failures: 0, Errors: 0, Skipped: 0, Time elapsed: 0.001 sec
Running net.sf.jsqlparser.util.TablesNamesFinderTest
Tests run: 19, Failures: 0, Errors: 0, Skipped: 0, Time elapsed: 0.017 sec
Running net.sf.jsqlparser.util.ConnectExpressionsVisitorTest
Tests run: 2, Failures: 2, Errors: 0, Skipped: 0, Time elapsed: 0.007 sec <<< FAILURE!
Running net.sf.jsqlparser.util.AddAliasesVisitorTest
Tests run: 4, Failures: 4, Errors: 0, Skipped: 0, Time elapsed: 0.001 sec <<< FAILURE!
Running net.sf.jsqlparser.util.SelectUtilsTest
Tests run: 6, Failures: 6, Errors: 0, Skipped: 0, Time elapsed: 0.004 sec <<< FAILURE!
Running net.sf.jsqlparser.expression.ExpressionVisitorAdapterTest
Tests run: 2, Failures: 0, Errors: 0, Skipped: 0, Time elapsed: 0.002 sec
Running net.sf.jsqlparser.expression.SignedExpressionTest
Tests run: 1, Failures: 0, Errors: 0, Skipped: 0, Time elapsed: 0 sec
Running net.sf.jsqlparser.schema.ServerTest
Tests run: 2, Failures: 0, Errors: 0, Skipped: 0, Time elapsed: 0 sec
Running net.sf.jsqlparser.parser.CCJSqlParserUtilTest
Tests run: 3, Failures: 0, Errors: 0, Skipped: 0, Time elapsed: 0 sec
Running net.sf.jsqlparser.statement.SetStatementTest
Tests run: 1, Failures: 0, Errors: 0, Skipped: 0, Time elapsed: 0.003 sec
Running net.sf.jsqlparser.statement.AdaptersTest
Tests run: 1, Failures: 0, Errors: 0, Skipped: 0, Time elapsed: 0.002 sec
Running net.sf.jsqlparser.statement.StatementsTest
Tests run: 1, Failures: 1, Errors: 0, Skipped: 0, Time elapsed: 0.001 sec <<< FAILURE!
Running net.sf.jsqlparser.statement.execute.ExecuteTest
Tests run: 1, Failures: 0, Errors: 0, Skipped: 0, Time elapsed: 0 sec

Results :

Failed tests:   testCreateTableAsSelect(net.sf.jsqlparser.test.create.CreateTableTest): expected:<...CT col1, col2 FROM b[]> but was:<...CT col1, col2 FROM b[ GROUP BY  ORDER BY ]>
  testCreateTableAsSelect2(net.sf.jsqlparser.test.create.CreateTableTest): expected:<... col3 FROM testtable[) SELECT col1, col2, col3 FROM b INNER JOIN a ON b.col1 = a.col1]> but was:<... col3 FROM testtable[ GROUP BY  ORDER BY ) SELECT col1, col2, col3 FROM b INNER JOIN a ON b.col1 = a.col1 USING  GROUP BY  ORDER BY ]>
  testCreateView2(net.sf.jsqlparser.test.create.CreateViewTest): expected:<... SELECT * FROM mytab[]> but was:<... SELECT * FROM mytab[ GROUP BY  ORDER BY ]>
  testCreateView3(net.sf.jsqlparser.test.create.CreateViewTest): expected:<... SELECT * FROM mytab[]> but was:<... SELECT * FROM mytab[ GROUP BY  ORDER BY ]>
  testCreateView4(net.sf.jsqlparser.test.create.CreateViewTest): expected:<...col1 = testtab2.col2[]> but was:<...col1 = testtab2.col2[ USING  GROUP BY  ORDER BY ]>
  testCreateView5(net.sf.jsqlparser.test.create.CreateViewTest): expected:<...(SELECT * FROM mytab[])> but was:<...(SELECT * FROM mytab[ GROUP BY  ORDER BY ])>
  testCreateView(net.sf.jsqlparser.test.create.CreateViewTest): expected:<... SELECT * FROM mytab[]> but was:<... SELECT * FROM mytab[ GROUP BY  ORDER BY ]>
  testCreateViewUnion(net.sf.jsqlparser.test.create.CreateViewTest): expected:<...CT a, b FROM testtab[) UNION (SELECT b, c FROM testtab2])> but was:<...CT a, b FROM testtab[ GROUP BY  ORDER BY ) UNION (SELECT b, c FROM testtab2 GROUP BY  ORDER BY ])>
  testCreateMaterializedView(net.sf.jsqlparser.test.create.CreateViewTest): expected:<...CT a, b FROM testtab[]> but was:<...CT a, b FROM testtab[ GROUP BY  ORDER BY ]>
  testCreateViewWithColumnNames1(net.sf.jsqlparser.test.create.CreateViewTest): expected:<...CT a, b FROM testtab[]> but was:<...CT a, b FROM testtab[ GROUP BY  ORDER BY ]>
  testInsertFromSelect(net.sf.jsqlparser.test.insert.InsertTest): expected:<...LECT * FROM mytable2[]> but was:<...LECT * FROM mytable2[ GROUP BY  ORDER BY ]>
  testInsertWithSelect(net.sf.jsqlparser.test.insert.InsertTest): expected:<...ycolumn FROM mytable[) SELECT mycolumn FROM a]> but was:<...ycolumn FROM mytable[ GROUP BY  ORDER BY ) SELECT mycolumn FROM a GROUP BY  ORDER BY ]>
  testInsertSelect(net.sf.jsqlparser.test.insert.InsertTest): expected:<...ycolumn FROM mytable[]> but was:<...ycolumn FROM mytable[ GROUP BY  ORDER BY ]>
  testUpdateWithFrom(net.sf.jsqlparser.test.update.UpdateTest): expected:<...able2 ON col1 = col2[]> but was:<...able2 ON col1 = col2[ USING ]>
  testUpdateWithSelect2(net.sf.jsqlparser.test.update.UpdateTest): expected:<..., b, c FROM mytable2[])> but was:<..., b, c FROM mytable2[ GROUP BY  ORDER BY ])>
  testUpdateWithSelect(net.sf.jsqlparser.test.update.UpdateTest): expected:<...ROM SYSIBM.SYSDUMMY1[])> but was:<...ROM SYSIBM.SYSDUMMY1[ GROUP BY  ORDER BY ])>
  testProblemReplaceParseDeparse(net.sf.jsqlparser.test.replace.ReplaceTest): expected:<...D, A, B FROM b_table[]> but was:<...D, A, B FROM b_table[ GROUP BY  ORDER BY ]>
  testAllSqlsParseDeparse(net.sf.jsqlparser.test.select.SpecialOracleTest): expected:<...ption from exception[]> but was:<...ption from exception[ group by order by]>
  testSelectAliasWithoutAs(net.sf.jsqlparser.test.select.SelectTest): expected:<...n Name" FROM mytable[]> but was:<...n Name" FROM mytable[ GROUP BY  ORDER BY ]>
  testAllConditionSubSelect(net.sf.jsqlparser.test.select.SelectTest): expected:<...WHERE e2.deptno = 10[)]> but was:<...WHERE e2.deptno = 10[ GROUP BY  ORDER BY ) GROUP BY  ORDER BY ]>
  testSimpleSigns(net.sf.jsqlparser.test.select.SelectTest): expected:<...1, -1 FROM tableName[]> but was:<...1, -1 FROM tableName[ GROUP BY  ORDER BY ]>
  testMultiValueIn2(net.sf.jsqlparser.test.select.SelectTest): expected:<...T a, b FROM mytable2[)]> but was:<...T a, b FROM mytable2[ GROUP BY  ORDER BY ) GROUP BY  ORDER BY ]>
  testSelectForUpdateOfTable(net.sf.jsqlparser.test.select.SelectTest): expected:<...foo.id = bar.foo_id []FOR UPDATE OF foo> but was:<...foo.id = bar.foo_id [GROUP BY  ORDER BY  ]FOR UPDATE OF foo>
  testPostgreSQLRegExpCaseSensitiveMatch(net.sf.jsqlparser.test.select.SelectTest): expected:<...WHERE a ~ '[help].*'[]> but was:<...WHERE a ~ '[help].*'[ GROUP BY  ORDER BY ]>
  testOracleJoin2(net.sf.jsqlparser.test.select.SelectTest): expected:<...e1.a(+) = tabelle2.b[]> but was:<...e1.a(+) = tabelle2.b[ GROUP BY  ORDER BY ]>
  testOracleJoin3(net.sf.jsqlparser.test.select.SelectTest): expected:<...e1.a(+) > tabelle2.b[]> but was:<...e1.a(+) > tabelle2.b[ GROUP BY  ORDER BY ]>
  testOracleJoin4(net.sf.jsqlparser.test.select.SelectTest): expected:<...1.b(+) IN ('A', 'B')[]> but was:<...1.b(+) IN ('A', 'B')[ GROUP BY  ORDER BY ]>
  testMultiPartTableNameWithSchemaName(net.sf.jsqlparser.test.select.SelectTest): expected:<...schemaName.tableName[]> but was:<...schemaName.tableName[ GROUP BY  ORDER BY ]>
  testSimpleAdditionsAndSubtractionsWithSigns(net.sf.jsqlparser.test.select.SelectTest): expected:<...1 - 1 FROM tableName[]> but was:<...1 - 1 FROM tableName[ GROUP BY  ORDER BY ]>
  testSelectAliasInQuotes(net.sf.jsqlparser.test.select.SelectTest): expected:<...n Name" FROM mytable[]> but was:<...n Name" FROM mytable[ GROUP BY  ORDER BY ]>
  testOrderBy(net.sf.jsqlparser.test.select.SelectTest): expected:<...OM tab1 WHERE a > 34[ GROUP BY tab1.b ORDER BY ]tab1.a DESC, tab1.b ...> but was:<...OM tab1 WHERE a > 34[tab1.b]tab1.a DESC, tab1.b ...>
  testCastTypeProblem2(net.sf.jsqlparser.test.select.SelectTest): expected:<...archar FROM tabelle1[]> but was:<...archar FROM tabelle1[ GROUP BY  ORDER BY ]>
  testCastTypeProblem3(net.sf.jsqlparser.test.select.SelectTest): expected:<... (256) FROM tabelle1[]> but was:<... (256) FROM tabelle1[ GROUP BY  ORDER BY ]>
  testCastTypeProblem4(net.sf.jsqlparser.test.select.SelectTest): expected:<... (256) FROM tabelle1[]> but was:<... (256) FROM tabelle1[ GROUP BY  ORDER BY ]>
  testCastTypeProblem5(net.sf.jsqlparser.test.select.SelectTest): expected:<... (256) FROM tabelle1[]> but was:<... (256) FROM tabelle1[ GROUP BY  ORDER BY ]>
  testCastTypeProblem6(net.sf.jsqlparser.test.select.SelectTest): expected:<...arying FROM tabelle1[]> but was:<...arying FROM tabelle1[ GROUP BY  ORDER BY ]>
  testCastTypeProblem7(net.sf.jsqlparser.test.select.SelectTest): expected:<...rying) FROM tabelle1[]> but was:<...rying) FROM tabelle1[ GROUP BY  ORDER BY ]>
  testCastInCast(net.sf.jsqlparser.test.select.SelectTest): expected:<...rchar) FROM tabelle1[]> but was:<...rchar) FROM tabelle1[ GROUP BY  ORDER BY ]>
  testSkipFirst(net.sf.jsqlparser.test.select.SelectTest): expected:<...ST f1 c1, c2 FROM t1[]> but was:<...ST f1 c1, c2 FROM t1[ GROUP BY  ORDER BY ]>
  testMultiPartTableNameWithDatabaseNameAndSchemaName(net.sf.jsqlparser.test.select.SelectTest): expected:<...schemaName.tableName[]> but was:<...schemaName.tableName[ GROUP BY  ORDER BY ]>
  testSelectJoinWithComma(net.sf.jsqlparser.test.select.SelectTest): expected:<...b.the_geom = es.geom[]> but was:<...b.the_geom = es.geom[ GROUP BY  ORDER BY ]>
  testAdditionalLettersGerman(net.sf.jsqlparser.test.select.SelectTest): expected:<...lü FROM testtableäöü[]> but was:<...lü FROM testtableäöü[ GROUP BY  ORDER BY ]>
  testTop(net.sf.jsqlparser.test.select.SelectTest): expected:<...HERE mytable.col = 9[]> but was:<...HERE mytable.col = 9[ GROUP BY  ORDER BY ]>
  testWithUnionProblem(net.sf.jsqlparser.test.select.SelectTest): expected:<...T mslink FROM tablea[) UNION (SELECT mslink FROM tableb)) SELECT * FROM tablea WHERE mslink IN (SELECT mslink FROM test)]> but was:<...T mslink FROM tablea[ GROUP BY  ORDER BY ) UNION (SELECT mslink FROM tableb GROUP BY  ORDER BY )) SELECT * FROM tablea WHERE mslink IN (SELECT mslink FROM test GROUP BY  ORDER BY ) GROUP BY  ORDER BY ]>
  testMysqlQuote(net.sf.jsqlparser.test.select.SelectTest): expected:<...AND b.ITEM = 'Chair'[]> but was:<...AND b.ITEM = 'Chair'[ GROUP BY  ORDER BY ]>
  testSelectInnerWith(net.sf.jsqlparser.test.select.SelectTest): expected:<...CT 'a' aid FROM DUAL[) SELECT aid FROM actor)]> but was:<...CT 'a' aid FROM DUAL[ GROUP BY  ORDER BY ) SELECT aid FROM actor GROUP BY  ORDER BY ) GROUP BY  ORDER BY ]>
  testReservedKeyword2(net.sf.jsqlparser.test.select.SelectTest): expected:<... open FROM tableName[]> but was:<... open FROM tableName[ GROUP BY  ORDER BY ]>
  testFirst(net.sf.jsqlparser.test.select.SelectTest): expected:<...ame.tableName alias [ORDER] BY alias.columnName...> but was:<...ame.tableName alias [GROUP] BY alias.columnName...>
  testIlike(net.sf.jsqlparser.test.select.SelectTest): expected:<...col1 ILIKE '%hello%'[]> but was:<...col1 ILIKE '%hello%'[ GROUP BY  ORDER BY ]>
  testIsNot(net.sf.jsqlparser.test.select.SelectTest): expected:<... WHERE a IS NOT NULL[]> but was:<... WHERE a IS NOT NULL[ GROUP BY  ORDER BY ]>
  testLimit(net.sf.jsqlparser.test.select.SelectTest): expected:<...ERE mytable.col = 9 []LIMIT ? OFFSET 3> but was:<...ERE mytable.col = 9 [GROUP BY  ORDER BY  ]LIMIT ? OFFSET 3>
  testSigns(net.sf.jsqlparser.test.select.SelectTest): expected:<...nName FROM tableName[]> but was:<...nName FROM tableName[ GROUP BY  ORDER BY ]>
  testUnion(net.sf.jsqlparser.test.select.SelectTest): expected:<...HERE mytable.col = 9[) UNION (SELECT * FROM mytable3 WHERE mytable3.col = ?) UNION (SELECT * FROM mytable2] LIMIT 4 OFFSET 3)> but was:<...HERE mytable.col = 9[ GROUP BY  ORDER BY ) UNION (SELECT * FROM mytable3 WHERE mytable3.col = ? GROUP BY  ORDER BY ) UNION (SELECT * FROM mytable2 GROUP BY  ORDER BY ] LIMIT 4 OFFSET 3)>
  testWhere(net.sf.jsqlparser.test.select.SelectTest): expected:<...a / b * (a + b)) > ?[]> but was:<...a / b * (a + b)) > ?[ GROUP BY  ORDER BY ]>
  testRegexpLike1(net.sf.jsqlparser.test.select.SelectTest): expected:<...me, '^Ste(v|ph)en$')[]> but was:<...me, '^Ste(v|ph)en$')[ GROUP BY  ORDER BY ]>
  testRegexpLike2(net.sf.jsqlparser.test.select.SelectTest): expected:<...E 2 END FROM mytable[]> but was:<...E 2 END FROM mytable[ GROUP BY  ORDER BY ]>
  testRegexpMySQL(net.sf.jsqlparser.test.select.SelectTest): expected:<...GEXP '^Ste(v|ph)en$'[]> but was:<...GEXP '^Ste(v|ph)en$'[ GROUP BY  ORDER BY ]>
  testCase(net.sf.jsqlparser.test.select.SelectTest): expected:<...THEN 2 END FROM tab1[]> but was:<...THEN 2 END FROM tab1[ GROUP BY  ORDER BY ]>
  testCast(net.sf.jsqlparser.test.select.SelectTest): expected:<...rchar) FROM tabelle1[]> but was:<...rchar) FROM tabelle1[ GROUP BY  ORDER BY ]>
  testFrom(net.sf.jsqlparser.test.select.SelectTest): expected:<...LECT * FROM mytable3[) AS mytable4 WHERE mytable.col = 9]> but was:<...LECT * FROM mytable3[ GROUP BY  ORDER BY ) AS mytable4 WHERE mytable.col = 9 GROUP BY  ORDER BY ]>
  testJoin(net.sf.jsqlparser.test.select.SelectTest): expected:<...ON tab1.id = tab2.id[]> but was:<...ON tab1.id = tab2.id[ USING  GROUP BY  ORDER BY ]>
  testLike(net.sf.jsqlparser.test.select.SelectTest): expected:<... WHERE a LIKE 'test'[]> but was:<... WHERE a LIKE 'test'[ GROUP BY  ORDER BY ]>
  testSkip(net.sf.jsqlparser.test.select.SelectTest): expected:<...ame.tableName alias [ORDER] BY alias.columnName...> but was:<...ame.tableName alias [GROUP] BY alias.columnName...>
  testTime(net.sf.jsqlparser.test.select.SelectTest): expected:<...E a > {t '04:05:34'}[]> but was:<...E a > {t '04:05:34'}[ GROUP BY  ORDER BY ]>
  testWith(net.sf.jsqlparser.test.select.SelectTest): expected:<...M EMPLOYEE AS OTHERS[ GROUP BY OTHERS.WORKDEPT), DINFOMAX AS (SELECT MAX(AVGSALARY) AS AVGMAX FROM DINFO) SELECT THIS_EMP.EMPNO, THIS_EMP.SALARY, DINFO.AVGSALARY, DINFO.EMPCOUNT, DINFOMAX.AVGMAX FROM EMPLOYEE AS THIS_EMP INNER JOIN DINFO INNER JOIN DINFOMAX WHERE THIS_EMP.JOB = 'SALESREP' AND THIS_EMP.WORKDEPT = DINFO.DEPTNO]> but was:<...M EMPLOYEE AS OTHERS[OTHERS.WORKDEPT ORDER BY ), DINFOMAX AS (SELECT MAX(AVGSALARY) AS AVGMAX FROM DINFO GROUP BY  ORDER BY ) SELECT THIS_EMP.EMPNO, THIS_EMP.SALARY, DINFO.AVGSALARY, DINFO.EMPCOUNT, DINFOMAX.AVGMAX FROM EMPLOYEE AS THIS_EMP INNER JOIN DINFO USING  INNER JOIN DINFOMAX USING  WHERE THIS_EMP.JOB = 'SALESREP' AND THIS_EMP.WORKDEPT = DINFO.DEPTNO GROUP BY  ORDER BY ]>
  testJsonExpression(net.sf.jsqlparser.test.select.SelectTest): expected:<...thumb FROM instagram[]> but was:<...thumb FROM instagram[ GROUP BY  ORDER BY ]>
  testConcatProblem2_5_1(net.sf.jsqlparser.test.select.SelectTest): expected:<... || c FROM testtable[]> but was:<... || c FROM testtable[ GROUP BY  ORDER BY ]>
  testConcatProblem2_5_2(net.sf.jsqlparser.test.select.SelectTest): expected:<...) + c FROM testtable[]> but was:<...) + c FROM testtable[ GROUP BY  ORDER BY ]>
  testProblemSqlAnalytic8Complex(net.sf.jsqlparser.test.select.SelectTest): expected:<...STAFF WHERE ID < 60 [ORDER] BY ID> but was:<...STAFF WHERE ID < 60 [GROUP] BY ID>
  testWithUnionAllProblem(net.sf.jsqlparser.test.select.SelectTest): expected:<...T mslink FROM tablea[) UNION ALL (SELECT mslink FROM tableb)) SELECT * FROM tablea WHERE mslink IN (SELECT mslink FROM test)]> but was:<...T mslink FROM tablea[ GROUP BY  ORDER BY ) UNION ALL (SELECT mslink FROM tableb GROUP BY  ORDER BY )) SELECT * FROM tablea WHERE mslink IN (SELECT mslink FROM test GROUP BY  ORDER BY ) GROUP BY  ORDER BY ]>
  testOracleJoin2_1(net.sf.jsqlparser.test.select.SelectTest): expected:<...lle1.a(+)=tabelle2.b[]> but was:<...lle1.a(+)=tabelle2.b[ group by order by]>
  testOracleJoin2_2(net.sf.jsqlparser.test.select.SelectTest): expected:<...lle1.a=tabelle2.b(+)[]> but was:<...lle1.a=tabelle2.b(+)[group by order by]>
  testOracleJoin3_1(net.sf.jsqlparser.test.select.SelectTest): expected:<...e1.a > tabelle2.b(+)[]> but was:<...e1.a > tabelle2.b(+)[ GROUP BY  ORDER BY ]>
  testAnyConditionSubSelect(net.sf.jsqlparser.test.select.SelectTest): expected:<...WHERE e2.deptno = 10[)]> but was:<...WHERE e2.deptno = 10[ GROUP BY  ORDER BY ) GROUP BY  ORDER BY ]>
  testPivotXml1(net.sf.jsqlparser.test.select.SelectTest): expected:<...) FOR b IN ('val1'))[]> but was:<...) FOR b IN ('val1'))[ GROUP BY  ORDER BY ]>
  testPivotXml2(net.sf.jsqlparser.test.select.SelectTest): expected:<...ls FROM myothertable[))]> but was:<...ls FROM myothertable[ GROUP BY  ORDER BY )) GROUP BY  ORDER BY ]>
  testPivotXml3(net.sf.jsqlparser.test.select.SelectTest): expected:<...t(a) FOR b IN (ANY))[]> but was:<...t(a) FOR b IN (ANY))[ GROUP BY  ORDER BY ]>
  testOrderByNullsFirst(net.sf.jsqlparser.test.select.SelectTest): expected:<SELECT a FROM tab1 [ORDER] BY a NULLS FIRST> but was:<SELECT a FROM tab1 [GROUP] BY a NULLS FIRST>
  testMultiTableJoin(net.sf.jsqlparser.test.select.SelectTest): expected:<...b ON taba.a = tabb.a[, tabc LEFT JOIN tabd ON tabc.c = tabd.c]> but was:<...b ON taba.a = tabb.a[ USING , tabc LEFT JOIN tabd ON tabc.c = tabd.c USING  GROUP BY  ORDER BY ]>
  testProblemSqlServer_Modulo_mod(net.sf.jsqlparser.test.select.SelectTest): expected:<...ECT mod(5, 2) FROM A[]> but was:<...ECT mod(5, 2) FROM A[ GROUP BY  ORDER BY ]>
  testProblemSqlAnalytic(net.sf.jsqlparser.test.select.SelectTest): expected:<... a) AS n FROM table1[]> but was:<... a) AS n FROM table1[ GROUP BY  ORDER BY ]>
  testIssue160_signedParameter2(net.sf.jsqlparser.test.select.SelectTest): expected:<...mytable WHERE -? = 5[]> but was:<...mytable WHERE -? = 5[ GROUP BY  ORDER BY ]>
  testAdditionalLettersSpanish(net.sf.jsqlparser.test.select.SelectTest): expected:<SELECT * FROM años[]> but was:<SELECT * FROM años[ GROUP BY  ORDER BY ]>
  testLateral1(net.sf.jsqlparser.test.select.SelectTest): expected:<....ORDERID = O.ORDERID[) AS OL]> but was:<....ORDERID = O.ORDERID[ GROUP BY  ORDER BY ) AS OL GROUP BY  ORDER BY ]>
  testSelectNumericBind(net.sf.jsqlparser.test.select.SelectTest): expected:<... FROM b WHERE c = :1[]> but was:<... FROM b WHERE c = :1[ GROUP BY  ORDER BY ]>
  testRegexpBinaryMySQL(net.sf.jsqlparser.test.select.SelectTest): expected:<...NARY '^Ste(v|ph)en$'[]> but was:<...NARY '^Ste(v|ph)en$'[ GROUP BY  ORDER BY ]>
  testLateralComplex1(net.sf.jsqlparser.test.select.SelectTest): expected:<....ORDERID = O.ORDERID[) AS OL, LATERAL(SELECT SUM(CHGAMT) AS ORDCHGTOTAL FROM ORDERCHARGES CHARGES WHERE LINES.ORDERID = O.ORDERID) AS OC, LATERAL(SELECT SUM(TAXAMT) AS TAXTOTAL FROM ORDERTAXES TAXES WHERE TAXES.ORDERID = O.ORDERID) AS OT]> but was:<....ORDERID = O.ORDERID[ GROUP BY  ORDER BY ) AS OL, LATERAL(SELECT SUM(CHGAMT) AS ORDCHGTOTAL FROM ORDERCHARGES CHARGES WHERE LINES.ORDERID = O.ORDERID GROUP BY  ORDER BY ) AS OC, LATERAL(SELECT SUM(TAXAMT) AS TAXTOTAL FROM ORDERTAXES TAXES WHERE TAXES.ORDERID = O.ORDERID GROUP BY  ORDER BY ) AS OT GROUP BY  ORDER BY ]>
  testMultiValueIn(net.sf.jsqlparser.test.select.SelectTest): expected:<..., b, c FROM mytable2[)]> but was:<..., b, c FROM mytable2[ GROUP BY  ORDER BY ) GROUP BY  ORDER BY ]>
  testProblemSqlIntersect(net.sf.jsqlparser.test.select.SelectTest): expected:<(SELECT * FROM a[) INTERSECT (SELECT * FROM b])> but was:<(SELECT * FROM a[ GROUP BY  ORDER BY ) INTERSECT (SELECT * FROM b GROUP BY  ORDER BY ])>
  testProblemFunction(net.sf.jsqlparser.test.select.SelectTest): expected:<...est() FROM testtable[]> but was:<...est() FROM testtable[ GROUP BY  ORDER BY ]>
  testConcatProblem2(net.sf.jsqlparser.test.select.SelectTest): expected:<...T_TMP FROM testtable[]> but was:<...T_TMP FROM testtable[ GROUP BY  ORDER BY ]>
  testBitwise(net.sf.jsqlparser.test.select.SelectTest): expected:<...1 | col2 FROM table1[]> but was:<...1 | col2 FROM table1[ GROUP BY  ORDER BY ]>
  testSelectInto1(net.sf.jsqlparser.test.select.SelectTest): expected:<... user_copy FROM user[]> but was:<... user_copy FROM user[ GROUP BY  ORDER BY ]>
  testSelectItems(net.sf.jsqlparser.test.select.SelectTest): expected:<...HERE mytable.col = 9[]> but was:<...HERE mytable.col = 9[ GROUP BY  ORDER BY ]>
  testSelectJoin2(net.sf.jsqlparser.test.select.SelectTest): expected:<...g_constraint.conkey)[]> but was:<...g_constraint.conkey)[ GROUP BY  ORDER BY ]>
  testBrackets2(net.sf.jsqlparser.test.select.SelectTest): expected:<SELECT [a] FROM t[]> but was:<SELECT [a] FROM t[ GROUP BY  ORDER BY ]>
  testProblemSqlServer_Modulo_Proz(net.sf.jsqlparser.test.select.SelectTest): expected:<SELECT 5 % 2 FROM A[]> but was:<SELECT 5 % 2 FROM A[ GROUP BY  ORDER BY ]>
  testFirstWithKeywordLimit(net.sf.jsqlparser.test.select.SelectTest): expected:<...ame.tableName alias [ORDER] BY alias.columnName...> but was:<...ame.tableName alias [GROUP] BY alias.columnName...>
  testGroupConcat(net.sf.jsqlparser.test.select.SelectTest): expected:<...OR ' ') FROM student[ GROUP BY student_name]> but was:<...OR ' ') FROM student[student_name ORDER BY ]>
  testWithRecursive(net.sf.jsqlparser.test.select.SelectTest): expected:<...FROM t WHERE n < 100[)) SELECT sum(n) FROM t]> but was:<...FROM t WHERE n < 100[ GROUP BY  ORDER BY )) SELECT sum(n) FROM t GROUP BY  ORDER BY ]>
  testSelectKeepOver(net.sf.jsqlparser.test.select.SelectTest): expected:<...rst" FROM employees [ORDER] BY department_id, s...> but was:<...rst" FROM employees [GROUP] BY department_id, s...>
  testFunctionRight(net.sf.jsqlparser.test.select.SelectTest): expected:<...col1, 4) FROM table1[]> but was:<...col1, 4) FROM table1[ GROUP BY  ORDER BY ]>
  testMultiPartColumnName(net.sf.jsqlparser.test.select.SelectTest): expected:<...nName FROM tableName[]> but was:<...nName FROM tableName[ GROUP BY  ORDER BY ]>
  testWithUnionProblem3(net.sf.jsqlparser.test.select.SelectTest): expected:<... tableb.deleted = 0 [WHERE tablea.fname IS NULL AND 1 = 0) UNION ALL (SELECT mslink FROM tableb)) SELECT * FROM tablea WHERE mslink IN (SELECT mslink FROM test)]> but was:<... tableb.deleted = 0 [USING  WHERE tablea.fname IS NULL AND 1 = 0 GROUP BY  ORDER BY ) UNION ALL (SELECT mslink FROM tableb GROUP BY  ORDER BY )) SELECT * FROM tablea WHERE mslink IN (SELECT mslink FROM test GROUP BY  ORDER BY ) GROUP BY  ORDER BY ]>
  testWithUnionProblem4(net.sf.jsqlparser.test.select.SelectTest): expected:<...link = ba.gl_mslink [INNER JOIN tablec AS ae ON gl.mslink = ae.mslink AND ae.deleted = 0 WHERE gl.parent IS NULL AND gl.mslink <> 0) UNION ALL (SELECT gl.mslink, ba.gl_name AS txt, ba.gl_nummer AS nr, hist.level + 1 AS level, CAST(hist.path + '.' + CAST(gl.mslink AS VARCHAR) AS VARCHAR) AS path, ae.feature FROM tablea AS gl INNER JOIN tableb AS ba ON gl.mslink = ba.gl_mslink INNER JOIN tablec AS ae ON gl.mslink = ae.mslink AND ae.deleted = 0 INNER JOIN hist ON gl.parent = hist.mslink WHERE gl.mslink <> 0)) SELECT mslink, space(level * 4) + txt AS txt, nr, feature, path FROM hist WHERE EXISTS (SELECT feature FROM tablec WHERE mslink = 0 AND ((feature IN (1, 2) AND hist.feature = 3) OR (feature IN (4) AND hist.feature = 2)))]> but was:<...link = ba.gl_mslink [USING  INNER JOIN tablec AS ae ON gl.mslink = ae.mslink AND ae.deleted = 0 USING  WHERE gl.parent IS NULL AND gl.mslink <> 0 GROUP BY  ORDER BY ) UNION ALL (SELECT gl.mslink, ba.gl_name AS txt, ba.gl_nummer AS nr, hist.level + 1 AS level, CAST(hist.path + '.' + CAST(gl.mslink AS VARCHAR) AS VARCHAR) AS path, ae.feature FROM tablea AS gl INNER JOIN tableb AS ba ON gl.mslink = ba.gl_mslink USING  INNER JOIN tablec AS ae ON gl.mslink = ae.mslink AND ae.deleted = 0 USING  INNER JOIN hist ON gl.parent = hist.mslink USING  WHERE gl.mslink <> 0 GROUP BY  ORDER BY )) SELECT mslink, space(level * 4) + txt AS txt, nr, feature, path FROM hist WHERE EXISTS (SELECT feature FROM tablec WHERE mslink = 0 AND ((feature IN (1, 2) AND hist.feature = 3) OR (feature IN (4) AND hist.feature = 2)) GROUP BY  ORDER BY ) GROUP BY  ORDER BY ]>
  testWithUnionProblem5(net.sf.jsqlparser.test.select.SelectTest): expected:<...link = ba.gl_mslink [INNER JOIN tablec AS ae ON gl.mslink = ae.mslink AND ae.deleted = 0 WHERE gl.parent IS NULL AND gl.mslink <> 0) UNION ALL (SELECT gl.mslink, ba.gl_name AS txt, ba.gl_nummer AS nr, hist.level + 1 AS level, CAST(hist.path + '.' + CAST(gl.mslink AS VARCHAR) AS VARCHAR) AS path, 5 AS feature FROM tablea AS gl INNER JOIN tableb AS ba ON gl.mslink = ba.gl_mslink INNER JOIN tablec AS ae ON gl.mslink = ae.mslink AND ae.deleted = 0 INNER JOIN hist ON gl.parent = hist.mslink WHERE gl.mslink <> 0)) SELECT * FROM hist]> but was:<...link = ba.gl_mslink [USING  INNER JOIN tablec AS ae ON gl.mslink = ae.mslink AND ae.deleted = 0 USING  WHERE gl.parent IS NULL AND gl.mslink <> 0 GROUP BY  ORDER BY ) UNION ALL (SELECT gl.mslink, ba.gl_name AS txt, ba.gl_nummer AS nr, hist.level + 1 AS level, CAST(hist.path + '.' + CAST(gl.mslink AS VARCHAR) AS VARCHAR) AS path, 5 AS feature FROM tablea AS gl INNER JOIN tableb AS ba ON gl.mslink = ba.gl_mslink USING  INNER JOIN tablec AS ae ON gl.mslink = ae.mslink AND ae.deleted = 0 USING  INNER JOIN hist ON gl.parent = hist.mslink USING  WHERE gl.mslink <> 0 GROUP BY  ORDER BY )) SELECT * FROM hist GROUP BY  ORDER BY ]>
  testValues2(net.sf.jsqlparser.test.select.SelectTest): expected:<... 1, 2, 3, 4) AS test[]> but was:<... 1, 2, 3, 4) AS test[ GROUP BY  ORDER BY ]>
  testValues3(net.sf.jsqlparser.test.select.SelectTest): expected:<... 2, 3, 4) AS test(a)[]> but was:<... 2, 3, 4) AS test(a)[ GROUP BY  ORDER BY ]>
  testValues4(net.sf.jsqlparser.test.select.SelectTest): expected:<...3, 4)) AS test(a, b)[]> but was:<...3, 4)) AS test(a, b)[ GROUP BY  ORDER BY ]>
  testValues5(net.sf.jsqlparser.test.select.SelectTest): expected:<... MY_TEMP_TABLE(X, Y)[]> but was:<... MY_TEMP_TABLE(X, Y)[ GROUP BY  ORDER BY ]>
  testGroupBy(net.sf.jsqlparser.test.select.SelectTest): expected:<...OM tab1 WHERE a > 34[ GROUP BY tab1.b]> but was:<...OM tab1 WHERE a > 34[tab1.b ORDER BY ]>
  testMultiPartColumnNameWithTableName(net.sf.jsqlparser.test.select.SelectTest): expected:<...nName FROM tableName[]> but was:<...nName FROM tableName[ GROUP BY  ORDER BY ]>
  testMultiPartTableNameWithDatabaseName(net.sf.jsqlparser.test.select.SelectTest): expected:<...abaseName..tableName[]> but was:<...abaseName..tableName[ GROUP BY  ORDER BY ]>
  testLimitSqlServer1(net.sf.jsqlparser.test.select.SelectTest): expected:<...ERE mytable.col = 9 [ORDER] BY mytable.id OFFSE...> but was:<...ERE mytable.col = 9 [GROUP] BY mytable.id OFFSE...>
  testLimitSqlServer2(net.sf.jsqlparser.test.select.SelectTest): expected:<...ERE mytable.col = 9 [ORDER] BY mytable.id OFFSE...> but was:<...ERE mytable.col = 9 [GROUP] BY mytable.id OFFSE...>
  testLimitSqlServer3(net.sf.jsqlparser.test.select.SelectTest): expected:<...ERE mytable.col = 9 [ORDER] BY mytable.id OFFSE...> but was:<...ERE mytable.col = 9 [GROUP] BY mytable.id OFFSE...>
  testLimitSqlServer4(net.sf.jsqlparser.test.select.SelectTest): expected:<...ERE mytable.col = 9 [ORDER] BY mytable.id FETCH...> but was:<...ERE mytable.col = 9 [GROUP] BY mytable.id FETCH...>
  testPivotFunction(net.sf.jsqlparser.test.select.SelectTest): expected:<...ode FROM customers t[) PIVOT (count(state_code) FOR state_code IN ('NY', 'CT', 'NJ', 'FL', 'MO')) ORDER BY times_purchased)) FROM DUAL]> but was:<...ode FROM customers t[ GROUP BY  ORDER BY ) PIVOT (count(state_code) FOR state_code IN ('NY', 'CT', 'NJ', 'FL', 'MO')) GROUP BY times_purchased)) FROM DUAL GROUP BY  ORDER BY ]>
  testMultiPartTableNameWithServerNameAndDatabaseName(net.sf.jsqlparser.test.select.SelectTest): expected:<...abaseName..tableName[]> but was:<...abaseName..tableName[ GROUP BY  ORDER BY ]>
  testConcatProblem2_1(net.sf.jsqlparser.test.select.SelectTest): expected:<...CHAR) FROM testtable[]> but was:<...CHAR) FROM testtable[ GROUP BY  ORDER BY ]>
  testConcatProblem2_2(net.sf.jsqlparser.test.select.SelectTest): expected:<...T_TMP FROM testtable[]> but was:<...T_TMP FROM testtable[ GROUP BY  ORDER BY ]>
  testConcatProblem2_3(net.sf.jsqlparser.test.select.SelectTest): expected:<...CHAR) FROM testtable[]> but was:<...CHAR) FROM testtable[ GROUP BY  ORDER BY ]>
  testConcatProblem2_4(net.sf.jsqlparser.test.select.SelectTest): expected:<...R (1) FROM testtable[]> but was:<...R (1) FROM testtable[ GROUP BY  ORDER BY ]>
  testConcatProblem2_5(net.sf.jsqlparser.test.select.SelectTest): expected:<...|| c) FROM testtable[]> but was:<...|| c) FROM testtable[ GROUP BY  ORDER BY ]>
  testConcatProblem2_6(net.sf.jsqlparser.test.select.SelectTest): expected:<...|| c) FROM testtable[]> but was:<...|| c) FROM testtable[ GROUP BY  ORDER BY ]>
  testMultiPartColumnNameWithDatabaseNameAndSchemaNameAndTableName(net.sf.jsqlparser.test.select.SelectTest): expected:<...nName FROM tableName[]> but was:<...nName FROM tableName[ GROUP BY  ORDER BY ]>
  testMultiPartColumnNameWithDatabaseNameAndTableName(net.sf.jsqlparser.test.select.SelectTest): expected:<...nName FROM tableName[]> but was:<...nName FROM tableName[ GROUP BY  ORDER BY ]>
  testReplaceAsFunction(net.sf.jsqlparser.test.select.SelectTest): expected:<...a, 'b', c) FROM tab1[]> but was:<...a, 'b', c) FROM tab1[ GROUP BY  ORDER BY ]>
  testSelectJPQLPositionalParameter(net.sf.jsqlparser.test.select.SelectTest): expected:<...D (username LIKE ?1)[]> but was:<...D (username LIKE ?1)[ GROUP BY  ORDER BY ]>
  testSelectWithinGroup(net.sf.jsqlparser.test.select.SelectTest): expected:<...BY col1) FROM table1[]> but was:<...BY col1) FROM table1[ GROUP BY  ORDER BY ]>
  testNotEqualsTo(net.sf.jsqlparser.test.select.SelectTest): expected:<...ROM foo WHERE a != b[]> but was:<...ROM foo WHERE a != b[ GROUP BY  ORDER BY ]>
  testSelectForUpdate(net.sf.jsqlparser.test.select.SelectTest): expected:<...T * FROM user_table []FOR UPDATE> but was:<...T * FROM user_table [GROUP BY  ORDER BY  ]FOR UPDATE>
  testProblemSqlAnalytic10Lag(net.sf.jsqlparser.test.select.SelectTest): expected:<... b) AS n FROM table1[]> but was:<... b) AS n FROM table1[ GROUP BY  ORDER BY ]>
  testProblemSqlAnalytic11Lag(net.sf.jsqlparser.test.select.SelectTest): expected:<... b) AS n FROM table1[]> but was:<... b) AS n FROM table1[ GROUP BY  ORDER BY ]>
  testMatches(net.sf.jsqlparser.test.select.SelectTest): expected:<...w & york & yankees')[]> but was:<...w & york & yankees')[ GROUP BY  ORDER BY ]>
  testAnalyticFunctionProblem1(net.sf.jsqlparser.test.select.SelectTest): expected:<...te_id) AS col FROM s[]> but was:<...te_id) AS col FROM s[ GROUP BY  ORDER BY ]>
  testFunctions(net.sf.jsqlparser.test.select.SelectTest): expected:<...HERE mytable.col = 9[]> but was:<...HERE mytable.col = 9[ GROUP BY  ORDER BY ]>
  testProblemFunction2(net.sf.jsqlparser.test.select.SelectTest): expected:<...sdate FROM testtable[]> but was:<...sdate FROM testtable[ GROUP BY  ORDER BY ]>
  testProblemFunction3(net.sf.jsqlparser.test.select.SelectTest): expected:<...(col) FROM testtable[]> but was:<...(col) FROM testtable[ GROUP BY  ORDER BY ]>
  testSelectOrderHaving(net.sf.jsqlparser.test.select.SelectTest): expected:<...AS num FROM currency[ GROUP BY units HAVING count(units) > 1 ORDER BY ]num> but was:<...AS num FROM currency[units HAVING count(units) > 1]num>
  testAnalyticFunction12(net.sf.jsqlparser.test.select.SelectTest): expected:<...RDER BY c) FROM tab1[]> but was:<...RDER BY c) FROM tab1[ GROUP BY  ORDER BY ]>
  testAnalyticFunction13(net.sf.jsqlparser.test.select.SelectTest): expected:<...a) OVER () FROM tab1[]> but was:<...a) OVER () FROM tab1[ GROUP BY  ORDER BY ]>
  testAnalyticFunction14(net.sf.jsqlparser.test.select.SelectTest): expected:<...ION BY b ) FROM tab1[]> but was:<...ION BY b ) FROM tab1[ GROUP BY  ORDER BY ]>
  testAnalyticFunction15(net.sf.jsqlparser.test.select.SelectTest): expected:<...RDER BY c) FROM tab1[]> but was:<...RDER BY c) FROM tab1[ GROUP BY  ORDER BY ]>
  testAnalyticFunction16(net.sf.jsqlparser.test.select.SelectTest): expected:<...LLS FIRST) FROM tab1[]> but was:<...LLS FIRST) FROM tab1[ GROUP BY  ORDER BY ]>
  testAnalyticFunction17(net.sf.jsqlparser.test.select.SelectTest): expected:<...current_sal FROM emp[]> but was:<...current_sal FROM emp[ GROUP BY  ORDER BY ]>
  testAnalyticFunction18(net.sf.jsqlparser.test.select.SelectTest): expected:<...current_sal FROM emp[]> but was:<...current_sal FROM emp[ GROUP BY  ORDER BY ]>
  testMultiPartTableNameWithServerNameAndDatabaseNameAndSchemaName(net.sf.jsqlparser.test.select.SelectTest): expected:<...schemaName.tableName[]> but was:<...schemaName.tableName[ GROUP BY  ORDER BY ]>
  testBrackets(net.sf.jsqlparser.test.select.SelectTest): expected:<... [Test] FROM table_a[]> but was:<... [Test] FROM table_a[ GROUP BY  ORDER BY ]>
  testWithStatement(net.sf.jsqlparser.test.select.SelectTest): expected:<... mslink FROM feature[) SELECT * FROM feature WHERE mslink IN (SELECT mslink FROM test)]> but was:<... mslink FROM feature[ GROUP BY  ORDER BY ) SELECT * FROM feature WHERE mslink IN (SELECT mslink FROM test GROUP BY  ORDER BY ) GROUP BY  ORDER BY ]>
  testIssue154_2(net.sf.jsqlparser.test.select.SelectTest): expected:<...eleted_time IS NULL [ORDER] BY r.id DESC> but was:<...eleted_time IS NULL [GROUP] BY r.id DESC>
  testTimestamp(net.sf.jsqlparser.test.select.SelectTest): expected:<...-04-30 04:05:34.56'}[]> but was:<...-04-30 04:05:34.56'}[ GROUP BY  ORDER BY ]>
  testProblemSqlAnalytic5AggregateColumnValue(net.sf.jsqlparser.test.select.SelectTest): expected:<... () AS n FROM table1[]> but was:<... () AS n FROM table1[ GROUP BY  ORDER BY ]>
  testMultiPartTableNameWithColumnName(net.sf.jsqlparser.test.select.SelectTest): expected:<...nName FROM tableName[]> but was:<...nName FROM tableName[ GROUP BY  ORDER BY ]>
  testFunctionLeft(net.sf.jsqlparser.test.select.SelectTest): expected:<...col1, 4) FROM table1[]> but was:<...col1, 4) FROM table1[ GROUP BY  ORDER BY ]>
  testCharacterSetClause(net.sf.jsqlparser.test.select.SelectTest): expected:<....`nick2` IS NOT NULL[]> but was:<....`nick2` IS NOT NULL[ GROUP BY  ORDER BY ]>
  testComplexUnion1(net.sf.jsqlparser.test.select.SelectTest): expected:<... WHERE mytab.del = 0[) UNION (SELECT 'cde-' || coalesce(mytab2.a::varchar, '') AS a, mytab2.b, mytab2.bezeichnung AS c, 0 AS d, 0 AS e FROM mytab2 WHERE mytab2.del = 0])> but was:<... WHERE mytab.del = 0[ GROUP BY  ORDER BY ) UNION (SELECT 'cde-' || coalesce(mytab2.a::varchar, '') AS a, mytab2.b, mytab2.bezeichnung AS c, 0 AS d, 0 AS e FROM mytab2 WHERE mytab2.del = 0 GROUP BY  ORDER BY ])>
  testProblemSqlAnalytic6AggregateColumnValue(net.sf.jsqlparser.test.select.SelectTest): expected:<... a) AS n FROM table1[]> but was:<... a) AS n FROM table1[ GROUP BY  ORDER BY ]>
  testDistinct(net.sf.jsqlparser.test.select.SelectTest): expected:<...HERE mytable.col = 9[]> but was:<...HERE mytable.col = 9[ GROUP BY  ORDER BY ]>
  testMultiPartColumnNameWithSchemaNameAndTableName(net.sf.jsqlparser.test.select.SelectTest): expected:<...nName FROM tableName[]> but was:<...nName FROM tableName[ GROUP BY  ORDER BY ]>
  testMultiPartTableNameWithServerName(net.sf.jsqlparser.test.select.SelectTest): expected:<...nstance]...tableName[]> but was:<...nstance]...tableName[ GROUP BY  ORDER BY ]>
  testProblemSqlAnalytic7Count(net.sf.jsqlparser.test.select.SelectTest): expected:<... () AS n FROM table1[]> but was:<... () AS n FROM table1[ GROUP BY  ORDER BY ]>
  testAllColumnsFromTable(net.sf.jsqlparser.test.select.SelectTest): expected:<...ame.* FROM tableName[]> but was:<...ame.* FROM tableName[ GROUP BY  ORDER BY ]>
  testProblemSqlCombinedSets(net.sf.jsqlparser.test.select.SelectTest): expected:<(SELECT * FROM a[) INTERSECT (SELECT * FROM b) UNION (SELECT * FROM c])> but was:<(SELECT * FROM a[ GROUP BY  ORDER BY ) INTERSECT (SELECT * FROM b GROUP BY  ORDER BY ) UNION (SELECT * FROM c GROUP BY  ORDER BY ])>
  testInterval2(net.sf.jsqlparser.test.select.SelectTest): expected:<...START_TIME FROM tab1[]> but was:<...START_TIME FROM tab1[ GROUP BY  ORDER BY ]>
  testConcat(net.sf.jsqlparser.test.select.SelectTest): expected:<...|| b || c + 4 FROM t[]> but was:<...|| b || c + 4 FROM t[ GROUP BY  ORDER BY ]>
  testCount2(net.sf.jsqlparser.test.select.SelectTest): expected:<...+ col2) FROM mytable[]> but was:<...+ col2) FROM mytable[ GROUP BY  ORDER BY ]>
  testSignedColumns(net.sf.jsqlparser.test.select.SelectTest): expected:<...Name) FROM tableName[]> but was:<...Name) FROM tableName[ GROUP BY  ORDER BY ]>
  testDouble(net.sf.jsqlparser.test.select.SelectTest): expected:<...HERE mytable.col = 9[]> but was:<...HERE mytable.col = 9[ GROUP BY  ORDER BY ]>
  testProblemSqlMinus(net.sf.jsqlparser.test.select.SelectTest): expected:<(SELECT * FROM a[) MINUS (SELECT * FROM b])> but was:<(SELECT * FROM a[ GROUP BY  ORDER BY ) MINUS (SELECT * FROM b GROUP BY  ORDER BY ])>
  testExists(net.sf.jsqlparser.test.select.SelectTest): expected:<... (SELECT * FROM tab2[)]> but was:<... (SELECT * FROM tab2[ GROUP BY  ORDER BY ) GROUP BY  ORDER BY ]>
  testMultiPartTableNameWithServerProblem(net.sf.jsqlparser.test.select.SelectTest): expected:<...dbo.t_transfer_num a[]> but was:<...dbo.t_transfer_num a[ GROUP BY  ORDER BY ]>
  testGroupByExpression(net.sf.jsqlparser.test.select.SelectTest): expected:<...um(col8) FROM table1[ GROUP BY col1, col2, col1 + col2]> but was:<...um(col8) FROM table1[col1, col2, col1 + col2 ORDER BY ]>
  testHaving(net.sf.jsqlparser.test.select.SelectTest): expected:<...OM tab1 WHERE a > 34[ GROUP BY tab1.b HAVING MAX(tab1.b) > 56]> but was:<...OM tab1 WHERE a > 34[tab1.b HAVING MAX(tab1.b) > 56 ORDER BY ]>
  testIssue154(net.sf.jsqlparser.test.select.SelectTest): expected:<...id = dc.discount_id [WHERE merchant_id = ? AND deleted = ? AND dc.discount_id IS NULL AND modified_time < ? AND modified_time >= ? ORDER] BY modified_time> but was:<...id = dc.discount_id [USING  WHERE merchant_id = ? AND deleted = ? AND dc.discount_id IS NULL AND modified_time < ? AND modified_time >= ? GROUP] BY modified_time>
  testDistinctTop(net.sf.jsqlparser.test.select.SelectTest): expected:<...HERE mytable.col = 9[]> but was:<...HERE mytable.col = 9[ GROUP BY  ORDER BY ]>
  testSelectUserVariable(net.sf.jsqlparser.test.select.SelectTest): expected:<SELECT @col FROM t1[]> but was:<SELECT @col FROM t1[ GROUP BY  ORDER BY ]>
  testIsNot2(net.sf.jsqlparser.test.select.SelectTest): expected:<... WHERE a IS NOT NULL[]> but was:<... WHERE a IS NOT NULL[ GROUP BY  ORDER BY ]>
  testTopWithParenthesis(net.sf.jsqlparser.test.select.SelectTest): expected:<...ame.tableName alias [ORDER] BY alias.columnName...> but was:<...ame.tableName alias [GROUP] BY alias.columnName...>
  testSelectOracleColl(net.sf.jsqlparser.test.select.SelectTest): expected:<...L1 = lines(idx).COL1[]> but was:<...L1 = lines(idx).COL1[ GROUP BY  ORDER BY ]>
  testOracleJoin(net.sf.jsqlparser.test.select.SelectTest): expected:<...e1.a = tabelle2.b(+)[]> but was:<...e1.a = tabelle2.b(+)[ GROUP BY  ORDER BY ]>
  testPostgreSQLRegExpCaseSensitiveMatch2(net.sf.jsqlparser.test.select.SelectTest): expected:<...HERE a ~* '[help].*'[]> but was:<...HERE a ~* '[help].*'[ GROUP BY  ORDER BY ]>
  testPostgreSQLRegExpCaseSensitiveMatch3(net.sf.jsqlparser.test.select.SelectTest): expected:<...HERE a !~ '[help].*'[]> but was:<...HERE a !~ '[help].*'[ GROUP BY  ORDER BY ]>
  testPostgreSQLRegExpCaseSensitiveMatch4(net.sf.jsqlparser.test.select.SelectTest): expected:<...ERE a !~* '[help].*'[]> but was:<...ERE a !~* '[help].*'[ GROUP BY  ORDER BY ]>
  testRowConstructor1(net.sf.jsqlparser.test.select.SelectTest): expected:<...ROM t2 WHERE id = 10[)]> but was:<...ROM t2 WHERE id = 10[ GROUP BY  ORDER BY ) GROUP BY  ORDER BY ]>
  testRowConstructor2(net.sf.jsqlparser.test.select.SelectTest): expected:<...ROM t2 WHERE id = 10[)]> but was:<...ROM t2 WHERE id = 10[ GROUP BY  ORDER BY ) GROUP BY  ORDER BY ]>
  testLimit2(net.sf.jsqlparser.test.select.SelectTest): expected:<...ERE mytable.col = 9 []LIMIT ? OFFSET 3> but was:<...ERE mytable.col = 9 [GROUP BY  ORDER BY  ]LIMIT ? OFFSET 3>
  testTableCrossJoin(net.sf.jsqlparser.test.select.SelectTest): expected:<...taba CROSS JOIN tabb[]> but was:<...taba CROSS JOIN tabb[ USING  GROUP BY  ORDER BY ]>
  testProblemSqlAnalytic2(net.sf.jsqlparser.test.select.SelectTest): expected:<... b) AS n FROM table1[]> but was:<... b) AS n FROM table1[ GROUP BY  ORDER BY ]>
  testProblemSqlAnalytic3(net.sf.jsqlparser.test.select.SelectTest): expected:<... b) AS n FROM table1[]> but was:<... b) AS n FROM table1[ GROUP BY  ORDER BY ]>
  testProblemSqlAnalytic9CommaListPartition(net.sf.jsqlparser.test.select.SelectTest): expected:<... b) AS n FROM table1[]> but was:<... b) AS n FROM table1[ GROUP BY  ORDER BY ]>
  testOracleHierarchicalQuery(net.sf.jsqlparser.test.select.SelectTest): expected:<...yee_id = manager_id [ORDER] BY last_name> but was:<...yee_id = manager_id [GROUP] BY last_name>
  testPivot1(net.sf.jsqlparser.test.select.SelectTest): expected:<...) FOR b IN ('val1'))[]> but was:<...) FOR b IN ('val1'))[ GROUP BY  ORDER BY ]>
  testPivot2(net.sf.jsqlparser.test.select.SelectTest): expected:<...R b IN (10, 20, 30))[]> but was:<...R b IN (10, 20, 30))[ GROUP BY  ORDER BY ]>
  testPivot3(net.sf.jsqlparser.test.select.SelectTest): expected:<...S d1, 20, 30 AS d3))[]> but was:<...S d1, 20, 30 AS d3))[ GROUP BY  ORDER BY ]>
  testPivot4(net.sf.jsqlparser.test.select.SelectTest): expected:<...R b IN (10, 20, 30))[]> but was:<...R b IN (10, 20, 30))[ GROUP BY  ORDER BY ]>
  testPivot5(net.sf.jsqlparser.test.select.SelectTest): expected:<...0, 'b'), (30, 'c')))[]> but was:<...0, 'b'), (30, 'c')))[ GROUP BY  ORDER BY ]>
  testSelectWithBrackets(net.sf.jsqlparser.test.select.SelectTest): expected:<...ELECT 1 FROM mytable[])> but was:<...ELECT 1 FROM mytable[ GROUP BY  ORDER BY ])>
  testAnalyticFunctionProblem1b(net.sf.jsqlparser.test.select.SelectTest): expected:<...OWING) AS col FROM s[]> but was:<...OWING) AS col FROM s[ GROUP BY  ORDER BY ]>
  testDeparser(net.sf.jsqlparser.test.select.SelectTest): expected:<...AND b.ITEM = 'Chair'[]> but was:<...AND b.ITEM = 'Chair'[ GROUP BY  ORDER BY ]>
  testPivotXmlSubquery1(net.sf.jsqlparser.test.select.SelectTest): expected:<...ode FROM customers t[) PIVOT (count(state_code) FOR state_code IN ('NY', 'CT', 'NJ', 'FL', 'MO')) ORDER] BY times_purchased> but was:<...ode FROM customers t[ GROUP BY  ORDER BY ) PIVOT (count(state_code) FOR state_code IN ('NY', 'CT', 'NJ', 'FL', 'MO')) GROUP] BY times_purchased>
  testOracleHierarchicalQuery2(net.sf.jsqlparser.test.select.SelectTest): expected:<...oyee_id = manager_id[]> but was:<...oyee_id = manager_id[ GROUP BY  ORDER BY ]>
  testOracleHierarchicalQuery3(net.sf.jsqlparser.test.select.SelectTest): expected:<...yee_id = manager_id [ORDER SIBLINGS] BY last_name> but was:<...yee_id = manager_id [GROUP] BY last_name>
  testOracleHierarchicalQuery4(net.sf.jsqlparser.test.select.SelectTest): expected:<...H employee_id = 100 [ORDER SIBLINGS] BY last_name> but was:<...H employee_id = 100 [GROUP] BY last_name>
  testExtractFrom1(net.sf.jsqlparser.test.select.SelectTest): expected:<...lumn) FROM testtable[]> but was:<...lumn) FROM testtable[ GROUP BY  ORDER BY ]>
  testExtractFrom2(net.sf.jsqlparser.test.select.SelectTest): expected:<...ow()) FROM testtable[]> but was:<...ow()) FROM testtable[ GROUP BY  ORDER BY ]>
  testExtractFrom3(net.sf.jsqlparser.test.select.SelectTest): expected:<...- 2)) FROM testtable[]> but was:<...- 2)) FROM testtable[ GROUP BY  ORDER BY ]>
  testExtractFrom4(net.sf.jsqlparser.test.select.SelectTest): expected:<...:00') FROM testtable[]> but was:<...:00') FROM testtable[ GROUP BY  ORDER BY ]>
  testProblemSqlAnalytic4EmptyOver(net.sf.jsqlparser.test.select.SelectTest): expected:<... () AS n FROM table1[]> but was:<... () AS n FROM table1[ GROUP BY  ORDER BY ]>
  testCastTypeProblem(net.sf.jsqlparser.test.select.SelectTest): expected:<...(256)) FROM tabelle1[]> but was:<...(256)) FROM tabelle1[ GROUP BY  ORDER BY ]>
  testSelectKeywordPercent(net.sf.jsqlparser.test.select.SelectTest): expected:<...ercent FROM MY_TABLE[]> but was:<...ercent FROM MY_TABLE[ GROUP BY  ORDER BY ]>
  testValues(net.sf.jsqlparser.test.select.SelectTest): expected:<... 2), (3, 4)) AS test[]> but was:<... 2), (3, 4)) AS test[ GROUP BY  ORDER BY ]>
  testValues6BothVariants(net.sf.jsqlparser.test.select.SelectTest): expected:<...VALUES 1, 2) AS TEST[)]> but was:<...VALUES 1, 2) AS TEST[ GROUP BY  ORDER BY ) GROUP BY  ORDER BY ]>
  testProblemSqlExcept(net.sf.jsqlparser.test.select.SelectTest): expected:<(SELECT * FROM a[) EXCEPT (SELECT * FROM b])> but was:<(SELECT * FROM a[ GROUP BY  ORDER BY ) EXCEPT (SELECT * FROM b GROUP BY  ORDER BY ])>
  testMultiPartTableNameWithServerNameAndSchemaName(net.sf.jsqlparser.test.select.SelectTest): expected:<...schemaName.tableName[]> but was:<...schemaName.tableName[ GROUP BY  ORDER BY ]>
  testProblemSqlServer_Modulo(net.sf.jsqlparser.test.select.SelectTest): expected:<...nth' FROM test_table[]> but was:<...nth' FROM test_table[ GROUP BY  ORDER BY ]>
  testReservedKeyword(net.sf.jsqlparser.test.select.SelectTest): expected:<..., xml FROM tableName[]> but was:<..., xml FROM tableName[ GROUP BY  ORDER BY ]>
  testLimitSqlServerJdbcParameters(net.sf.jsqlparser.test.select.SelectTest): expected:<...ERE mytable.col = 9 [ORDER] BY mytable.id OFFSE...> but was:<...ERE mytable.col = 9 [GROUP] BY mytable.id OFFSE...>
  testSelectJoin(net.sf.jsqlparser.test.select.SelectTest): expected:<...constraint.conrelid [JOIN pg_attribute ON pg_attribute.attrelid = pg_constraint.conrelid WHERE pg_constraint.contype = 'u' AND (pg_attribute.attnum = ANY(pg_constraint.conkey)) ORDER] BY pg_constraint.co...> but was:<...constraint.conrelid [USING  JOIN pg_attribute ON pg_attribute.attrelid = pg_constraint.conrelid USING  WHERE pg_constraint.contype = 'u' AND (pg_attribute.attnum = ANY(pg_constraint.conkey)) GROUP] BY pg_constraint.co...>
  testSelectKeep(net.sf.jsqlparser.test.select.SelectTest): expected:<...3), col4 FROM table1[ GROUP BY col5 ORDER BY ]col3> but was:<...3), col4 FROM table1[col5]col3>
  testCaseElseAddition(net.sf.jsqlparser.test.select.SelectTest): expected:<...1 END AS d FROM dual[]> but was:<...1 END AS d FROM dual[ GROUP BY  ORDER BY ]>
  testNamedParameter2(net.sf.jsqlparser.test.select.SelectTest): expected:<...ram2 AND b = :param3[]> but was:<...ram2 AND b = :param3[ GROUP BY  ORDER BY ]>
  testBooleanFunction1(net.sf.jsqlparser.test.select.SelectTest): expected:<...HERE test_func(col1)[]> but was:<...HERE test_func(col1)[ GROUP BY  ORDER BY ]>
  testCastInCast2(net.sf.jsqlparser.test.select.SelectTest): expected:<...rchar) FROM tabelle1[]> but was:<...rchar) FROM tabelle1[ GROUP BY  ORDER BY ]>
  testNamedParameter(net.sf.jsqlparser.test.select.SelectTest): expected:<...ble WHERE b = :param[]> but was:<...ble WHERE b = :param[ GROUP BY  ORDER BY ]>
  testVisit_PlainSelect_concat(net.sf.jsqlparser.util.ConnectExpressionsVisitorTest): expected:<... c AS expr FROM test[]> but was:<... c AS expr FROM test[ GROUP BY  ORDER BY ]>
  testVisit_PlainSelect_addition(net.sf.jsqlparser.util.ConnectExpressionsVisitorTest): expected:<...S testexpr FROM test[]> but was:<...S testexpr FROM test[ GROUP BY  ORDER BY ]>
  testVisit_SetOperationList(net.sf.jsqlparser.util.AddAliasesVisitorTest): expected:<... + 4 AS A1 FROM test[) UNION (SELECT 7 + 8 AS A1 FROM test2])> but was:<... + 4 AS A1 FROM test[ GROUP BY  ORDER BY ) UNION (SELECT 7 + 8 AS A1 FROM test2 GROUP BY  ORDER BY ])>
  testVisit_PlainSelect(net.sf.jsqlparser.util.AddAliasesVisitorTest): expected:<...2, c AS A3 FROM test[]> but was:<...2, c AS A3 FROM test[ GROUP BY  ORDER BY ]>
  testVisit_PlainSelect_expression(net.sf.jsqlparser.util.AddAliasesVisitorTest): expected:<... + 4 AS A1 FROM test[]> but was:<... + 4 AS A1 FROM test[ GROUP BY  ORDER BY ]>
  testVisit_PlainSelect_duplicates(net.sf.jsqlparser.util.AddAliasesVisitorTest): expected:<...1, c AS A3 FROM test[]> but was:<...1, c AS A3 FROM test[ GROUP BY  ORDER BY ]>
  testBuildSelectFromTableAndExpressions(net.sf.jsqlparser.util.SelectUtilsTest): expected:<...CT a, b FROM mytable[]> but was:<...CT a, b FROM mytable[ GROUP BY  ORDER BY ]>
  testAddExpr(net.sf.jsqlparser.util.SelectUtilsTest): expected:<...CT a, b FROM mytable[]> but was:<...CT a, b FROM mytable[ GROUP BY  ORDER BY ]>
  testAddJoin(net.sf.jsqlparser.util.SelectUtilsTest): expected:<...IN mytable2 ON a = b[]> but was:<...IN mytable2 ON a = b[ USING  GROUP BY  ORDER BY ]>
  testBuildSelectFromTable(net.sf.jsqlparser.util.SelectUtilsTest): expected:<...ELECT * FROM mytable[]> but was:<...ELECT * FROM mytable[ GROUP BY  ORDER BY ]>
  testBuildSelectFromTableWithGroupBy(net.sf.jsqlparser.util.SelectUtilsTest): expected:<...ELECT * FROM mytable[ GROUP BY b]> but was:<...ELECT * FROM mytable[b ORDER BY ]>
  testBuildSelectFromTableAndParsedExpression(net.sf.jsqlparser.util.SelectUtilsTest): expected:<...b, test FROM mytable[]> but was:<...b, test FROM mytable[ GROUP BY  ORDER BY ]>
  testStatements(net.sf.jsqlparser.statement.StatementsTest): expected:<...ELECT * FROM mytable[;

Tests run: 353, Failures: 238, Errors: 0, Skipped: 0

[INFO] ------------------------------------------------------------------------
[INFO] BUILD FAILURE
[INFO] ------------------------------------------------------------------------
[INFO] Total time: 16.073s
[INFO] Finished at: Tue Oct 06 07:48:20 CEST 2015
[INFO] Final Memory: 23M/346M
[INFO] ------------------------------------------------------------------------
[ERROR] Failed to execute goal org.apache.maven.plugins:maven-surefire-plugin:2.10:test (default-test) on project jsqlparser: There are test failures.
[ERROR] 
[ERROR] Please refer to /home/perham/Study/Experiments/2015-10-23-ICST/LittleDarwin/Cases/JSqlParser-jsqlparser-0.9.4/target/surefire-reports for the individual test results.
[ERROR] -> [Help 1]
[ERROR] 
[ERROR] To see the full stack trace of the errors, re-run Maven with the -e switch.
[ERROR] Re-run Maven using the -X switch to enable full debug logging.
[ERROR] 
[ERROR] For more information about the errors and possible solutions, please read the following articles:
[ERROR] [Help 1] http://cwiki.apache.org/confluence/display/MAVEN/MojoFailureException
