[INFO] Scanning for projects...
[INFO]                                                                         
[INFO] ------------------------------------------------------------------------
[INFO] Building JSQLParser library 0.9.4
[INFO] ------------------------------------------------------------------------
[INFO] 
[INFO] --- javacc-maven-plugin:2.6:jjtree-javacc (javacc) @ jsqlparser ---
[INFO] Skipping - all parsers are up to date
[INFO] 
[INFO] --- license-maven-plugin:1.6:update-file-header (first) @ jsqlparser ---
[INFO] Will search files to update from root /home/perham/Study/Experiments/2015-10-23-ICST/LittleDarwin/Cases/JSqlParser-jsqlparser-0.9.4/src/main/java
[INFO]  - adding license header on file /home/perham/Study/Experiments/2015-10-23-ICST/LittleDarwin/Cases/JSqlParser-jsqlparser-0.9.4/src/main/java/net/sf/jsqlparser/statement/select/PlainSelect.java
[INFO] Scan 164 files header done in 221.863ms.
[INFO] 
 * uptodate header on 163 files.
 * add header on 1 file.
[INFO] 
[INFO] --- maven-resources-plugin:2.6:resources (default-resources) @ jsqlparser ---
[INFO] Using 'UTF-8' encoding to copy filtered resources.
[INFO] skip non existing resourceDirectory /home/perham/Study/Experiments/2015-10-23-ICST/LittleDarwin/Cases/JSqlParser-jsqlparser-0.9.4/src/main/resources
[INFO] 
[INFO] --- maven-compiler-plugin:3.3:compile (default-compile) @ jsqlparser ---
[INFO] Changes detected - recompiling the module!
[INFO] Compiling 177 source files to /home/perham/Study/Experiments/2015-10-23-ICST/LittleDarwin/Cases/JSqlParser-jsqlparser-0.9.4/target/classes
[WARNING] bootstrap class path not set in conjunction with -source 1.6
[INFO] /home/perham/Study/Experiments/2015-10-23-ICST/LittleDarwin/Cases/JSqlParser-jsqlparser-0.9.4/target/generated-sources/javacc/net/sf/jsqlparser/parser/CCJSqlParser.java: /home/perham/Study/Experiments/2015-10-23-ICST/LittleDarwin/Cases/JSqlParser-jsqlparser-0.9.4/target/generated-sources/javacc/net/sf/jsqlparser/parser/CCJSqlParser.java uses unchecked or unsafe operations.
[INFO] /home/perham/Study/Experiments/2015-10-23-ICST/LittleDarwin/Cases/JSqlParser-jsqlparser-0.9.4/target/generated-sources/javacc/net/sf/jsqlparser/parser/CCJSqlParser.java: Recompile with -Xlint:unchecked for details.
[INFO] 
[INFO] --- maven-resources-plugin:2.6:testResources (default-testResources) @ jsqlparser ---
[INFO] Using 'UTF-8' encoding to copy filtered resources.
[INFO] Copying 280 resources
[INFO] 
[INFO] --- maven-compiler-plugin:3.3:testCompile (default-testCompile) @ jsqlparser ---
[INFO] Nothing to compile - all classes are up to date
[INFO] 
[INFO] --- maven-surefire-plugin:2.10:test (default-test) @ jsqlparser ---
[INFO] Surefire report directory: /home/perham/Study/Experiments/2015-10-23-ICST/LittleDarwin/Cases/JSqlParser-jsqlparser-0.9.4/target/surefire-reports

-------------------------------------------------------
 T E S T S
-------------------------------------------------------
Running net.sf.jsqlparser.test.alter.AlterTest
Tests run: 3, Failures: 0, Errors: 0, Skipped: 0, Time elapsed: 0.056 sec
Running net.sf.jsqlparser.test.create.CreateTableTest
Tests run: 27, Failures: 0, Errors: 0, Skipped: 0, Time elapsed: 0.124 sec
Running net.sf.jsqlparser.test.create.CreateIndexTest
Tests run: 6, Failures: 0, Errors: 0, Skipped: 0, Time elapsed: 0.001 sec
Running net.sf.jsqlparser.test.create.CreateViewTest
Tests run: 8, Failures: 0, Errors: 0, Skipped: 0, Time elapsed: 0.009 sec
Running net.sf.jsqlparser.test.delete.DeleteTest
Tests run: 2, Failures: 0, Errors: 0, Skipped: 0, Time elapsed: 0.005 sec
Running net.sf.jsqlparser.test.simpleparsing.CCJSqlParserManagerTest
Tests run: 1, Failures: 0, Errors: 0, Skipped: 0, Time elapsed: 0.174 sec
Running net.sf.jsqlparser.test.drop.DropTest
Tests run: 2, Failures: 0, Errors: 0, Skipped: 0, Time elapsed: 0.002 sec
Running net.sf.jsqlparser.test.insert.InsertTest
Tests run: 15, Failures: 0, Errors: 0, Skipped: 0, Time elapsed: 0.042 sec
Running net.sf.jsqlparser.test.TestUtils
Tests run: 1, Failures: 0, Errors: 0, Skipped: 0, Time elapsed: 0 sec
Running net.sf.jsqlparser.test.update.UpdateTest
Tests run: 7, Failures: 0, Errors: 0, Skipped: 0, Time elapsed: 0.007 sec
Running net.sf.jsqlparser.test.replace.ReplaceTest
Tests run: 4, Failures: 0, Errors: 0, Skipped: 0, Time elapsed: 0.002 sec
Running net.sf.jsqlparser.test.select.SelectASTTest
*Statement
* Column
* Column
* Table
* Column
* Column
Tests run: 2, Failures: 0, Errors: 0, Skipped: 0, Time elapsed: 0.003 sec
Running net.sf.jsqlparser.test.select.SpecialOracleTest
Oct 06, 2015 7:47:53 AM net.sf.jsqlparser.test.select.SpecialOracleTest testAllSqlsParseDeparse
INFO: testing string01.sql
Oct 06, 2015 7:47:53 AM net.sf.jsqlparser.test.select.SpecialOracleTest testAllSqlsParseDeparse
INFO:    -> PROBLEM net.sf.jsqlparser.JSQLParserException
Oct 06, 2015 7:47:53 AM net.sf.jsqlparser.test.select.SpecialOracleTest testAllSqlsParseDeparse
INFO: testing returning01.sql
Oct 06, 2015 7:47:53 AM net.sf.jsqlparser.test.select.SpecialOracleTest testAllSqlsParseDeparse
INFO:    -> PROBLEM net.sf.jsqlparser.JSQLParserException
Oct 06, 2015 7:47:53 AM net.sf.jsqlparser.test.select.SpecialOracleTest testAllSqlsParseDeparse
INFO: testing keywordasidentifier05.sql
Oct 06, 2015 7:47:53 AM net.sf.jsqlparser.test.select.SpecialOracleTest testAllSqlsParseDeparse
INFO:    -> SUCCESS
Oct 06, 2015 7:47:53 AM net.sf.jsqlparser.test.select.SpecialOracleTest testAllSqlsParseDeparse
INFO: testing function07.sql
Oct 06, 2015 7:47:53 AM net.sf.jsqlparser.test.select.SpecialOracleTest testAllSqlsParseDeparse
INFO:    -> PROBLEM net.sf.jsqlparser.JSQLParserException
Oct 06, 2015 7:47:53 AM net.sf.jsqlparser.test.select.SpecialOracleTest testAllSqlsParseDeparse
INFO: testing cast_multiset15.sql
Oct 06, 2015 7:47:53 AM net.sf.jsqlparser.test.select.SpecialOracleTest testAllSqlsParseDeparse
INFO:    -> PROBLEM net.sf.jsqlparser.JSQLParserException
Oct 06, 2015 7:47:53 AM net.sf.jsqlparser.test.select.SpecialOracleTest testAllSqlsParseDeparse
INFO: testing interval01.sql
Oct 06, 2015 7:47:53 AM net.sf.jsqlparser.test.select.SpecialOracleTest testAllSqlsParseDeparse
INFO:    -> PROBLEM net.sf.jsqlparser.JSQLParserException
Oct 06, 2015 7:47:53 AM net.sf.jsqlparser.test.select.SpecialOracleTest testAllSqlsParseDeparse
INFO: testing analytic_query04.sql
Oct 06, 2015 7:47:53 AM net.sf.jsqlparser.test.select.SpecialOracleTest testAllSqlsParseDeparse
INFO:    -> PROBLEM net.sf.jsqlparser.JSQLParserException
Oct 06, 2015 7:47:53 AM net.sf.jsqlparser.test.select.SpecialOracleTest testAllSqlsParseDeparse
INFO: testing join10.sql
Oct 06, 2015 7:47:53 AM net.sf.jsqlparser.test.select.SpecialOracleTest testAllSqlsOnlyParse
INFO: testing comment02.sql
Oct 06, 2015 7:47:53 AM net.sf.jsqlparser.test.select.SpecialOracleTest testAllSqlsOnlyParse
INFO:    -> SUCCESS
Oct 06, 2015 7:47:53 AM net.sf.jsqlparser.test.select.SpecialOracleTest testAllSqlsOnlyParse
INFO: testing numbers02.sql
Oct 06, 2015 7:47:53 AM net.sf.jsqlparser.test.select.SpecialOracleTest testAllSqlsOnlyParse
INFO:    -> SUCCESS
Oct 06, 2015 7:47:53 AM net.sf.jsqlparser.test.select.SpecialOracleTest testAllSqlsOnlyParse
INFO: testing comment01.sql
Oct 06, 2015 7:47:53 AM net.sf.jsqlparser.test.select.SpecialOracleTest testAllSqlsOnlyParse
INFO:    -> SUCCESS
Tests run: 2, Failures: 1, Errors: 0, Skipped: 0, Time elapsed: 0.153 sec <<< FAILURE!
Running net.sf.jsqlparser.test.select.SelectTest
Tests run: 228, Failures: 30, Errors: 0, Skipped: 0, Time elapsed: 0.494 sec <<< FAILURE!
Running net.sf.jsqlparser.test.select.SpeedTest
42500 statements parsed in 8084 milliseconds
 (5257 statements per second,  0.0001902 seconds per statement )
38500 select scans for table name executed in 136 milliseconds
 (283088 select scans for table name per second,  0.0000035 seconds per select scans for table name)
Tests run: 1, Failures: 0, Errors: 0, Skipped: 0, Time elapsed: 8.223 sec
Running net.sf.jsqlparser.test.truncate.TruncateTest
Tests run: 1, Failures: 0, Errors: 0, Skipped: 0, Time elapsed: 0.001 sec
Running net.sf.jsqlparser.util.TablesNamesFinderTest
Tests run: 19, Failures: 0, Errors: 0, Skipped: 0, Time elapsed: 0.014 sec
Running net.sf.jsqlparser.util.ConnectExpressionsVisitorTest
Tests run: 2, Failures: 0, Errors: 0, Skipped: 0, Time elapsed: 0.002 sec
Running net.sf.jsqlparser.util.AddAliasesVisitorTest
Tests run: 4, Failures: 0, Errors: 0, Skipped: 0, Time elapsed: 0.001 sec
Running net.sf.jsqlparser.util.SelectUtilsTest
Tests run: 6, Failures: 1, Errors: 0, Skipped: 0, Time elapsed: 0.004 sec <<< FAILURE!
Running net.sf.jsqlparser.expression.ExpressionVisitorAdapterTest
Tests run: 2, Failures: 0, Errors: 0, Skipped: 0, Time elapsed: 0.002 sec
Running net.sf.jsqlparser.expression.SignedExpressionTest
Tests run: 1, Failures: 0, Errors: 0, Skipped: 0, Time elapsed: 0.001 sec
Running net.sf.jsqlparser.schema.ServerTest
Tests run: 2, Failures: 0, Errors: 0, Skipped: 0, Time elapsed: 0 sec
Running net.sf.jsqlparser.parser.CCJSqlParserUtilTest
Tests run: 3, Failures: 0, Errors: 0, Skipped: 0, Time elapsed: 0.001 sec
Running net.sf.jsqlparser.statement.SetStatementTest
Tests run: 1, Failures: 0, Errors: 0, Skipped: 0, Time elapsed: 0.004 sec
Running net.sf.jsqlparser.statement.AdaptersTest
Tests run: 1, Failures: 0, Errors: 0, Skipped: 0, Time elapsed: 0.003 sec
Running net.sf.jsqlparser.statement.StatementsTest
Tests run: 1, Failures: 0, Errors: 0, Skipped: 0, Time elapsed: 0.001 sec
Running net.sf.jsqlparser.statement.execute.ExecuteTest
Tests run: 1, Failures: 0, Errors: 0, Skipped: 0, Time elapsed: 0.001 sec

Results :

Failed tests:   testAllSqlsParseDeparse(net.sf.jsqlparser.test.select.SpecialOracleTest): expected:<...select*from dual)tt2[ using](dummy))> but was:<...select*from dual)tt2[](dummy))>
  testOrderBy(net.sf.jsqlparser.test.select.SelectTest): expected:<...M tab1 WHERE a > 34 [GROUP BY tab1.b ORDER BY] tab1.a DESC, tab1.b...> but was:<...M tab1 WHERE a > 34 [tab1.b] tab1.a DESC, tab1.b...>
  testFirst(net.sf.jsqlparser.test.select.SelectTest): expected:<...ame.tableName alias [ORDER BY ]alias.columnName2 DE...> but was:<...ame.tableName alias []alias.columnName2 DE...>
  testJoin(net.sf.jsqlparser.test.select.SelectTest): expected:<...2 LEFT OUTER JOIN O [USING ](col1, col2) WHERE D...> but was:<...2 LEFT OUTER JOIN O [](col1, col2) WHERE D...>
  testSkip(net.sf.jsqlparser.test.select.SelectTest): expected:<...ame.tableName alias [ORDER BY ]alias.columnName2 DE...> but was:<...ame.tableName alias []alias.columnName2 DE...>
  testWith(net.sf.jsqlparser.test.select.SelectTest): expected:<... EMPLOYEE AS OTHERS [GROUP BY ]OTHERS.WORKDEPT), DI...> but was:<... EMPLOYEE AS OTHERS []OTHERS.WORKDEPT), DI...>
  testProblemSqlAnalytic8Complex(net.sf.jsqlparser.test.select.SelectTest): expected:<...STAFF WHERE ID < 60 [ORDER BY ]ID> but was:<...STAFF WHERE ID < 60 []ID>
  testOrderByNullsFirst(net.sf.jsqlparser.test.select.SelectTest): expected:<SELECT a FROM tab1 [ORDER BY ]a NULLS FIRST> but was:<SELECT a FROM tab1 []a NULLS FIRST>
  testFirstWithKeywordLimit(net.sf.jsqlparser.test.select.SelectTest): expected:<...ame.tableName alias [ORDER BY ]alias.columnName2 DE...> but was:<...ame.tableName alias []alias.columnName2 DE...>
  testGroupConcat(net.sf.jsqlparser.test.select.SelectTest): expected:<...R ' ') FROM student [GROUP BY ]student_name> but was:<...R ' ') FROM student []student_name>
  testSelectKeepOver(net.sf.jsqlparser.test.select.SelectTest): expected:<...rst" FROM employees [ORDER BY ]department_id, salar...> but was:<...rst" FROM employees []department_id, salar...>
  testGroupBy(net.sf.jsqlparser.test.select.SelectTest): expected:<...M tab1 WHERE a > 34 [GROUP BY ]tab1.b> but was:<...M tab1 WHERE a > 34 []tab1.b>
  testLimitSqlServer1(net.sf.jsqlparser.test.select.SelectTest): expected:<...ERE mytable.col = 9 [ORDER BY ]mytable.id OFFSET 3 ...> but was:<...ERE mytable.col = 9 []mytable.id OFFSET 3 ...>
  testLimitSqlServer2(net.sf.jsqlparser.test.select.SelectTest): expected:<...ERE mytable.col = 9 [ORDER BY ]mytable.id OFFSET 3 ...> but was:<...ERE mytable.col = 9 []mytable.id OFFSET 3 ...>
  testLimitSqlServer3(net.sf.jsqlparser.test.select.SelectTest): expected:<...ERE mytable.col = 9 [ORDER BY ]mytable.id OFFSET 3 ...> but was:<...ERE mytable.col = 9 []mytable.id OFFSET 3 ...>
  testLimitSqlServer4(net.sf.jsqlparser.test.select.SelectTest): expected:<...ERE mytable.col = 9 [ORDER BY ]mytable.id FETCH NEX...> but was:<...ERE mytable.col = 9 []mytable.id FETCH NEX...>
  testPivotFunction(net.sf.jsqlparser.test.select.SelectTest): expected:<... 'NJ', 'FL', 'MO')) [ORDER BY ]times_purchased)) FR...> but was:<... 'NJ', 'FL', 'MO')) []times_purchased)) FR...>
  testFunctions(net.sf.jsqlparser.test.select.SelectTest): expected:<...ERE mytable.col = 9 [GROUP BY ]pro> but was:<...ERE mytable.col = 9 []pro>
  testSelectOrderHaving(net.sf.jsqlparser.test.select.SelectTest): expected:<...S num FROM currency [GROUP BY units HAVING count(units) > 1 ORDER BY] num> but was:<...S num FROM currency [units HAVING count(units) > 1] num>
  testIssue154_2(net.sf.jsqlparser.test.select.SelectTest): expected:<...eleted_time IS NULL [ORDER BY ]r.id DESC> but was:<...eleted_time IS NULL []r.id DESC>
  testGroupByExpression(net.sf.jsqlparser.test.select.SelectTest): expected:<...m(col8) FROM table1 [GROUP BY ]col1, col2, col1 + c...> but was:<...m(col8) FROM table1 []col1, col2, col1 + c...>
  testHaving(net.sf.jsqlparser.test.select.SelectTest): expected:<...M tab1 WHERE a > 34 [GROUP BY ]tab1.b HAVING MAX(ta...> but was:<...M tab1 WHERE a > 34 []tab1.b HAVING MAX(ta...>
  testIssue154(net.sf.jsqlparser.test.select.SelectTest): expected:<... modified_time >= ? [ORDER BY ]modified_time> but was:<... modified_time >= ? []modified_time>
  testTopWithParenthesis(net.sf.jsqlparser.test.select.SelectTest): expected:<...ame.tableName alias [ORDER BY ]alias.columnName2 DE...> but was:<...ame.tableName alias []alias.columnName2 DE...>
  testOracleHierarchicalQuery(net.sf.jsqlparser.test.select.SelectTest): expected:<...yee_id = manager_id [ORDER BY ]last_name> but was:<...yee_id = manager_id []last_name>
  testPivotXmlSubquery1(net.sf.jsqlparser.test.select.SelectTest): expected:<... 'NJ', 'FL', 'MO')) [ORDER BY ]times_purchased> but was:<... 'NJ', 'FL', 'MO')) []times_purchased>
  testOracleHierarchicalQuery3(net.sf.jsqlparser.test.select.SelectTest): expected:<...yee_id = manager_id [ORDER SIBLINGS BY ]last_name> but was:<...yee_id = manager_id []last_name>
  testOracleHierarchicalQuery4(net.sf.jsqlparser.test.select.SelectTest): expected:<...H employee_id = 100 [ORDER SIBLINGS BY ]last_name> but was:<...H employee_id = 100 []last_name>
  testLimitSqlServerJdbcParameters(net.sf.jsqlparser.test.select.SelectTest): expected:<...ERE mytable.col = 9 [ORDER BY ]mytable.id OFFSET ? ...> but was:<...ERE mytable.col = 9 []mytable.id OFFSET ? ...>
  testSelectJoin(net.sf.jsqlparser.test.select.SelectTest): expected:<...constraint.conkey)) [ORDER BY ]pg_constraint.connam...> but was:<...constraint.conkey)) []pg_constraint.connam...>
  testSelectKeep(net.sf.jsqlparser.test.select.SelectTest): expected:<...), col4 FROM table1 [GROUP BY col5 ORDER BY] col3> but was:<...), col4 FROM table1 [col5] col3>
  testBuildSelectFromTableWithGroupBy(net.sf.jsqlparser.util.SelectUtilsTest): expected:<...LECT * FROM mytable [GROUP BY ]b> but was:<...LECT * FROM mytable []b>

Tests run: 353, Failures: 32, Errors: 0, Skipped: 0

[INFO] ------------------------------------------------------------------------
[INFO] BUILD FAILURE
[INFO] ------------------------------------------------------------------------
[INFO] Total time: 16.038s
[INFO] Finished at: Tue Oct 06 07:48:02 CEST 2015
[INFO] Final Memory: 23M/346M
[INFO] ------------------------------------------------------------------------
[ERROR] Failed to execute goal org.apache.maven.plugins:maven-surefire-plugin:2.10:test (default-test) on project jsqlparser: There are test failures.
[ERROR] 
[ERROR] Please refer to /home/perham/Study/Experiments/2015-10-23-ICST/LittleDarwin/Cases/JSqlParser-jsqlparser-0.9.4/target/surefire-reports for the individual test results.
[ERROR] -> [Help 1]
[ERROR] 
[ERROR] To see the full stack trace of the errors, re-run Maven with the -e switch.
[ERROR] Re-run Maven using the -X switch to enable full debug logging.
[ERROR] 
[ERROR] For more information about the errors and possible solutions, please read the following articles:
[ERROR] [Help 1] http://cwiki.apache.org/confluence/display/MAVEN/MojoFailureException
