[INFO] Scanning for projects...
[INFO]                                                                         
[INFO] ------------------------------------------------------------------------
[INFO] Building JSQLParser library 0.9.4
[INFO] ------------------------------------------------------------------------
[INFO] 
[INFO] --- javacc-maven-plugin:2.6:jjtree-javacc (javacc) @ jsqlparser ---
[INFO] Skipping - all parsers are up to date
[INFO] 
[INFO] --- license-maven-plugin:1.6:update-file-header (first) @ jsqlparser ---
[INFO] Will search files to update from root /home/perham/Study/Experiments/2015-10-23-ICST/LittleDarwin/Cases/JSqlParser-jsqlparser-0.9.4/src/main/java
[INFO]  - adding license header on file /home/perham/Study/Experiments/2015-10-23-ICST/LittleDarwin/Cases/JSqlParser-jsqlparser-0.9.4/src/main/java/net/sf/jsqlparser/statement/select/PlainSelect.java
[INFO] Scan 164 files header done in 223.056ms.
[INFO] 
 * uptodate header on 163 files.
 * add header on 1 file.
[INFO] 
[INFO] --- maven-resources-plugin:2.6:resources (default-resources) @ jsqlparser ---
[INFO] Using 'UTF-8' encoding to copy filtered resources.
[INFO] skip non existing resourceDirectory /home/perham/Study/Experiments/2015-10-23-ICST/LittleDarwin/Cases/JSqlParser-jsqlparser-0.9.4/src/main/resources
[INFO] 
[INFO] --- maven-compiler-plugin:3.3:compile (default-compile) @ jsqlparser ---
[INFO] Changes detected - recompiling the module!
[INFO] Compiling 177 source files to /home/perham/Study/Experiments/2015-10-23-ICST/LittleDarwin/Cases/JSqlParser-jsqlparser-0.9.4/target/classes
[WARNING] bootstrap class path not set in conjunction with -source 1.6
[INFO] /home/perham/Study/Experiments/2015-10-23-ICST/LittleDarwin/Cases/JSqlParser-jsqlparser-0.9.4/target/generated-sources/javacc/net/sf/jsqlparser/parser/CCJSqlParser.java: /home/perham/Study/Experiments/2015-10-23-ICST/LittleDarwin/Cases/JSqlParser-jsqlparser-0.9.4/target/generated-sources/javacc/net/sf/jsqlparser/parser/CCJSqlParser.java uses unchecked or unsafe operations.
[INFO] /home/perham/Study/Experiments/2015-10-23-ICST/LittleDarwin/Cases/JSqlParser-jsqlparser-0.9.4/target/generated-sources/javacc/net/sf/jsqlparser/parser/CCJSqlParser.java: Recompile with -Xlint:unchecked for details.
[INFO] 
[INFO] --- maven-resources-plugin:2.6:testResources (default-testResources) @ jsqlparser ---
[INFO] Using 'UTF-8' encoding to copy filtered resources.
[INFO] Copying 280 resources
[INFO] 
[INFO] --- maven-compiler-plugin:3.3:testCompile (default-testCompile) @ jsqlparser ---
[INFO] Nothing to compile - all classes are up to date
[INFO] 
[INFO] --- maven-surefire-plugin:2.10:test (default-test) @ jsqlparser ---
[INFO] Surefire report directory: /home/perham/Study/Experiments/2015-10-23-ICST/LittleDarwin/Cases/JSqlParser-jsqlparser-0.9.4/target/surefire-reports

-------------------------------------------------------
 T E S T S
-------------------------------------------------------
Running net.sf.jsqlparser.test.alter.AlterTest
Tests run: 3, Failures: 3, Errors: 0, Skipped: 0, Time elapsed: 0.067 sec <<< FAILURE!
Running net.sf.jsqlparser.test.create.CreateTableTest
Tests run: 27, Failures: 1, Errors: 25, Skipped: 0, Time elapsed: 0.074 sec <<< FAILURE!
Running net.sf.jsqlparser.test.create.CreateIndexTest
Tests run: 6, Failures: 0, Errors: 0, Skipped: 0, Time elapsed: 0 sec
Running net.sf.jsqlparser.test.create.CreateViewTest
Tests run: 8, Failures: 0, Errors: 8, Skipped: 0, Time elapsed: 0.007 sec <<< FAILURE!
Running net.sf.jsqlparser.test.delete.DeleteTest
Tests run: 2, Failures: 0, Errors: 0, Skipped: 0, Time elapsed: 0.004 sec
Running net.sf.jsqlparser.test.simpleparsing.CCJSqlParserManagerTest
Tests run: 1, Failures: 0, Errors: 0, Skipped: 0, Time elapsed: 0.176 sec
Running net.sf.jsqlparser.test.drop.DropTest
Tests run: 2, Failures: 1, Errors: 0, Skipped: 0, Time elapsed: 0.002 sec <<< FAILURE!
Running net.sf.jsqlparser.test.insert.InsertTest
Tests run: 15, Failures: 11, Errors: 3, Skipped: 0, Time elapsed: 0.05 sec <<< FAILURE!
Running net.sf.jsqlparser.test.TestUtils
Tests run: 1, Failures: 0, Errors: 0, Skipped: 0, Time elapsed: 0.001 sec
Running net.sf.jsqlparser.test.update.UpdateTest
Tests run: 7, Failures: 2, Errors: 3, Skipped: 0, Time elapsed: 0.007 sec <<< FAILURE!
Running net.sf.jsqlparser.test.replace.ReplaceTest
Tests run: 4, Failures: 1, Errors: 1, Skipped: 0, Time elapsed: 0.006 sec <<< FAILURE!
Running net.sf.jsqlparser.test.select.SelectASTTest
*Statement
* Column
* Column
* Table
* Column
* Column
Tests run: 2, Failures: 0, Errors: 0, Skipped: 0, Time elapsed: 0.003 sec
Running net.sf.jsqlparser.test.select.SpecialOracleTest
Oct 06, 2015 7:47:29 AM net.sf.jsqlparser.test.select.SpecialOracleTest testAllSqlsParseDeparse
INFO: testing string01.sql
Oct 06, 2015 7:47:29 AM net.sf.jsqlparser.test.select.SpecialOracleTest testAllSqlsParseDeparse
INFO:    -> PROBLEM net.sf.jsqlparser.JSQLParserException
Oct 06, 2015 7:47:29 AM net.sf.jsqlparser.test.select.SpecialOracleTest testAllSqlsParseDeparse
INFO: testing returning01.sql
Oct 06, 2015 7:47:29 AM net.sf.jsqlparser.test.select.SpecialOracleTest testAllSqlsParseDeparse
INFO:    -> PROBLEM net.sf.jsqlparser.JSQLParserException
Oct 06, 2015 7:47:29 AM net.sf.jsqlparser.test.select.SpecialOracleTest testAllSqlsParseDeparse
INFO: testing keywordasidentifier05.sql
Oct 06, 2015 7:47:29 AM net.sf.jsqlparser.test.select.SpecialOracleTest testAllSqlsParseDeparse
INFO:    -> PROBLEM java.lang.NullPointerException
Oct 06, 2015 7:47:29 AM net.sf.jsqlparser.test.select.SpecialOracleTest testAllSqlsParseDeparse
INFO: testing function07.sql
Oct 06, 2015 7:47:29 AM net.sf.jsqlparser.test.select.SpecialOracleTest testAllSqlsParseDeparse
INFO:    -> PROBLEM net.sf.jsqlparser.JSQLParserException
Oct 06, 2015 7:47:29 AM net.sf.jsqlparser.test.select.SpecialOracleTest testAllSqlsParseDeparse
INFO: testing cast_multiset15.sql
Oct 06, 2015 7:47:29 AM net.sf.jsqlparser.test.select.SpecialOracleTest testAllSqlsParseDeparse
INFO:    -> PROBLEM net.sf.jsqlparser.JSQLParserException
Oct 06, 2015 7:47:29 AM net.sf.jsqlparser.test.select.SpecialOracleTest testAllSqlsParseDeparse
INFO: testing interval01.sql
Oct 06, 2015 7:47:29 AM net.sf.jsqlparser.test.select.SpecialOracleTest testAllSqlsParseDeparse
INFO:    -> PROBLEM net.sf.jsqlparser.JSQLParserException
Oct 06, 2015 7:47:29 AM net.sf.jsqlparser.test.select.SpecialOracleTest testAllSqlsParseDeparse
INFO: testing analytic_query04.sql
Oct 06, 2015 7:47:29 AM net.sf.jsqlparser.test.select.SpecialOracleTest testAllSqlsParseDeparse
INFO:    -> PROBLEM net.sf.jsqlparser.JSQLParserException
Oct 06, 2015 7:47:29 AM net.sf.jsqlparser.test.select.SpecialOracleTest testAllSqlsParseDeparse
INFO: testing join10.sql
Oct 06, 2015 7:47:29 AM net.sf.jsqlparser.test.select.SpecialOracleTest testAllSqlsParseDeparse
INFO:    -> PROBLEM java.lang.NullPointerException
Oct 06, 2015 7:47:29 AM net.sf.jsqlparser.test.select.SpecialOracleTest testAllSqlsParseDeparse
INFO: testing pivot04.sql
Oct 06, 2015 7:47:29 AM net.sf.jsqlparser.test.select.SpecialOracleTest testAllSqlsParseDeparse
INFO:    -> PROBLEM net.sf.jsqlparser.JSQLParserException
Oct 06, 2015 7:47:29 AM net.sf.jsqlparser.test.select.SpecialOracleTest testAllSqlsParseDeparse
INFO: testing condition08.sql
Oct 06, 2015 7:47:29 AM net.sf.jsqlparser.test.select.SpecialOracleTest testAllSqlsParseDeparse
INFO:    -> PROBLEM net.sf.jsqlparser.JSQLParserException
Oct 06, 2015 7:47:29 AM net.sf.jsqlparser.test.select.SpecialOracleTest testAllSqlsParseDeparse
INFO: testing function03.sql
Oct 06, 2015 7:47:29 AM net.sf.jsqlparser.test.select.SpecialOracleTest testAllSqlsParseDeparse
INFO:    -> PROBLEM net.sf.jsqlparser.JSQLParserException
Oct 06, 2015 7:47:29 AM net.sf.jsqlparser.test.select.SpecialOracleTest testAllSqlsParseDeparse
INFO: testing merge03.sql
Oct 06, 2015 7:47:29 AM net.sf.jsqlparser.test.select.SpecialOracleTest testAllSqlsParseDeparse
INFO:    -> PROBLEM net.sf.jsqlparser.JSQLParserException
Oct 06, 2015 7:47:29 AM net.sf.jsqlparser.test.select.SpecialOracleTest testAllSqlsParseDeparse
INFO: testing insert02.sql
Oct 06, 2015 7:47:29 AM net.sf.jsqlparser.test.select.SpecialOracleTest testAllSqlsParseDeparse
INFO:    -> PROBLEM net.sf.jsqlparser.JSQLParserException
Oct 06, 2015 7:47:29 AM net.sf.jsqlparser.test.select.SpecialOracleTest testAllSqlsParseDeparse
INFO: testing insert11.sql
Oct 06, 2015 7:47:29 AM net.sf.jsqlparser.test.select.SpecialOracleTest testAllSqlsParseDeparse
INFO:    -> PROBLEM net.sf.jsqlparser.JSQLParserException
Oct 06, 2015 7:47:29 AM net.sf.jsqlparser.test.select.SpecialOracleTest testAllSqlsParseDeparse
INFO: testing interval02.sql
Oct 06, 2015 7:47:29 AM net.sf.jsqlparser.test.select.SpecialOracleTest testAllSqlsParseDeparse
INFO:    -> PROBLEM java.lang.NullPointerException
Oct 06, 2015 7:47:29 AM net.sf.jsqlparser.test.select.SpecialOracleTest testAllSqlsParseDeparse
INFO: testing cast_multiset18.sql
Oct 06, 2015 7:47:29 AM net.sf.jsqlparser.test.select.SpecialOracleTest testAllSqlsParseDeparse
INFO:    -> PROBLEM net.sf.jsqlparser.JSQLParserException
Oct 06, 2015 7:47:29 AM net.sf.jsqlparser.test.select.SpecialOracleTest testAllSqlsParseDeparse
INFO: testing query_factoring08.sql
Oct 06, 2015 7:47:29 AM net.sf.jsqlparser.test.select.SpecialOracleTest testAllSqlsParseDeparse
INFO:    -> PROBLEM java.lang.NullPointerException
Oct 06, 2015 7:47:29 AM net.sf.jsqlparser.test.select.SpecialOracleTest testAllSqlsParseDeparse
INFO: testing condition04.sql
Oct 06, 2015 7:47:36 AM net.sf.jsqlparser.test.select.SpecialOracleTest testAllSqlsParseDeparse
INFO:    -> PROBLEM java.lang.NullPointerException
Oct 06, 2015 7:47:36 AM net.sf.jsqlparser.test.select.SpecialOracleTest testAllSqlsParseDeparse
INFO: testing xmltable02.sql
Oct 06, 2015 7:47:36 AM net.sf.jsqlparser.test.select.SpecialOracleTest testAllSqlsParseDeparse
INFO:    -> PROBLEM net.sf.jsqlparser.JSQLParserException
Oct 06, 2015 7:47:36 AM net.sf.jsqlparser.test.select.SpecialOracleTest testAllSqlsParseDeparse
INFO: testing for_update08.sql
Oct 06, 2015 7:47:36 AM net.sf.jsqlparser.test.select.SpecialOracleTest testAllSqlsParseDeparse
INFO:    -> PROBLEM net.sf.jsqlparser.JSQLParserException
Oct 06, 2015 7:47:36 AM net.sf.jsqlparser.test.select.SpecialOracleTest testAllSqlsParseDeparse
INFO: testing for_update03.sql
Oct 06, 2015 7:47:36 AM net.sf.jsqlparser.test.select.SpecialOracleTest testAllSqlsParseDeparse
INFO:    -> PROBLEM java.lang.NullPointerException
Oct 06, 2015 7:47:36 AM net.sf.jsqlparser.test.select.SpecialOracleTest testAllSqlsParseDeparse
INFO: testing condition06.sql
Oct 06, 2015 7:47:36 AM net.sf.jsqlparser.test.select.SpecialOracleTest testAllSqlsParseDeparse
INFO:    -> PROBLEM net.sf.jsqlparser.JSQLParserException
Oct 06, 2015 7:47:36 AM net.sf.jsqlparser.test.select.SpecialOracleTest testAllSqlsParseDeparse
INFO: testing cast_multiset29.sql
Oct 06, 2015 7:47:36 AM net.sf.jsqlparser.test.select.SpecialOracleTest testAllSqlsParseDeparse
INFO:    -> PROBLEM java.lang.NullPointerException
Oct 06, 2015 7:47:36 AM net.sf.jsqlparser.test.select.SpecialOracleTest testAllSqlsParseDeparse
INFO: testing cast_multiset38.sql
Oct 06, 2015 7:47:36 AM net.sf.jsqlparser.test.select.SpecialOracleTest testAllSqlsParseDeparse
INFO:    -> PROBLEM net.sf.jsqlparser.JSQLParserException
Oct 06, 2015 7:47:36 AM net.sf.jsqlparser.test.select.SpecialOracleTest testAllSqlsParseDeparse
INFO: testing query_factoring09.sql
Oct 06, 2015 7:47:36 AM net.sf.jsqlparser.test.select.SpecialOracleTest testAllSqlsParseDeparse
INFO:    -> PROBLEM java.lang.NullPointerException
Oct 06, 2015 7:47:36 AM net.sf.jsqlparser.test.select.SpecialOracleTest testAllSqlsParseDeparse
INFO: testing condition19.sql
Oct 06, 2015 7:47:36 AM net.sf.jsqlparser.test.select.SpecialOracleTest testAllSqlsParseDeparse
INFO:    -> PROBLEM net.sf.jsqlparser.JSQLParserException
Oct 06, 2015 7:47:36 AM net.sf.jsqlparser.test.select.SpecialOracleTest testAllSqlsParseDeparse
INFO: testing union02.sql
Oct 06, 2015 7:47:36 AM net.sf.jsqlparser.test.select.SpecialOracleTest testAllSqlsParseDeparse
INFO:    -> PROBLEM java.lang.NullPointerException
Oct 06, 2015 7:47:36 AM net.sf.jsqlparser.test.select.SpecialOracleTest testAllSqlsParseDeparse
INFO: testing groupby22.sql
Oct 06, 2015 7:47:36 AM net.sf.jsqlparser.test.select.SpecialOracleTest testAllSqlsParseDeparse
INFO:    -> PROBLEM java.lang.NullPointerException
Oct 06, 2015 7:47:36 AM net.sf.jsqlparser.test.select.SpecialOracleTest testAllSqlsParseDeparse
INFO: testing set02.sql
Oct 06, 2015 7:47:36 AM net.sf.jsqlparser.test.select.SpecialOracleTest testAllSqlsParseDeparse
INFO:    -> PROBLEM net.sf.jsqlparser.JSQLParserException
Oct 06, 2015 7:47:36 AM net.sf.jsqlparser.test.select.SpecialOracleTest testAllSqlsParseDeparse
INFO: testing cast_multiset10.sql
Oct 06, 2015 7:47:36 AM net.sf.jsqlparser.test.select.SpecialOracleTest testAllSqlsParseDeparse
INFO:    -> PROBLEM java.lang.NullPointerException
Oct 06, 2015 7:47:36 AM net.sf.jsqlparser.test.select.SpecialOracleTest testAllSqlsParseDeparse
INFO: testing simple06.sql
Oct 06, 2015 7:47:36 AM net.sf.jsqlparser.test.select.SpecialOracleTest testAllSqlsParseDeparse
INFO:    -> PROBLEM java.lang.NullPointerException
Oct 06, 2015 7:47:36 AM net.sf.jsqlparser.test.select.SpecialOracleTest testAllSqlsParseDeparse
INFO: testing groupby12.sql
Oct 06, 2015 7:47:36 AM net.sf.jsqlparser.test.select.SpecialOracleTest testAllSqlsOnlyParse
INFO: testing comment02.sql
Oct 06, 2015 7:47:36 AM net.sf.jsqlparser.test.select.SpecialOracleTest testAllSqlsOnlyParse
INFO:    -> SUCCESS
Oct 06, 2015 7:47:36 AM net.sf.jsqlparser.test.select.SpecialOracleTest testAllSqlsOnlyParse
INFO: testing numbers02.sql
Oct 06, 2015 7:47:36 AM net.sf.jsqlparser.test.select.SpecialOracleTest testAllSqlsOnlyParse
INFO:    -> SUCCESS
Oct 06, 2015 7:47:36 AM net.sf.jsqlparser.test.select.SpecialOracleTest testAllSqlsOnlyParse
INFO: testing comment01.sql
Oct 06, 2015 7:47:36 AM net.sf.jsqlparser.test.select.SpecialOracleTest testAllSqlsOnlyParse
INFO:    -> SUCCESS
Tests run: 2, Failures: 1, Errors: 0, Skipped: 0, Time elapsed: 6.775 sec <<< FAILURE!
Running net.sf.jsqlparser.test.select.SelectTest
Tests run: 228, Failures: 15, Errors: 204, Skipped: 0, Time elapsed: 0.25 sec <<< FAILURE!
Running net.sf.jsqlparser.test.select.SpeedTest
42500 statements parsed in 8046 milliseconds
 (5282 statements per second,  0.0001893 seconds per statement )
38500 select scans for table name executed in 144 milliseconds
 (267361 select scans for table name per second,  0.0000037 seconds per select scans for table name)
Tests run: 1, Failures: 0, Errors: 0, Skipped: 0, Time elapsed: 8.174 sec
Running net.sf.jsqlparser.test.truncate.TruncateTest
Tests run: 1, Failures: 0, Errors: 0, Skipped: 0, Time elapsed: 0 sec
Running net.sf.jsqlparser.util.TablesNamesFinderTest
Tests run: 19, Failures: 0, Errors: 0, Skipped: 0, Time elapsed: 0.017 sec
Running net.sf.jsqlparser.util.ConnectExpressionsVisitorTest
Tests run: 2, Failures: 0, Errors: 2, Skipped: 0, Time elapsed: 0.004 sec <<< FAILURE!
Running net.sf.jsqlparser.util.AddAliasesVisitorTest
Tests run: 4, Failures: 0, Errors: 4, Skipped: 0, Time elapsed: 0.002 sec <<< FAILURE!
Running net.sf.jsqlparser.util.SelectUtilsTest
Tests run: 6, Failures: 0, Errors: 6, Skipped: 0, Time elapsed: 0.004 sec <<< FAILURE!
Running net.sf.jsqlparser.expression.ExpressionVisitorAdapterTest
Tests run: 2, Failures: 0, Errors: 0, Skipped: 0, Time elapsed: 0.001 sec
Running net.sf.jsqlparser.expression.SignedExpressionTest
Tests run: 1, Failures: 0, Errors: 0, Skipped: 0, Time elapsed: 0 sec
Running net.sf.jsqlparser.schema.ServerTest
Tests run: 2, Failures: 0, Errors: 0, Skipped: 0, Time elapsed: 0 sec
Running net.sf.jsqlparser.parser.CCJSqlParserUtilTest
Tests run: 3, Failures: 0, Errors: 0, Skipped: 0, Time elapsed: 0.002 sec
Running net.sf.jsqlparser.statement.SetStatementTest
Tests run: 1, Failures: 0, Errors: 0, Skipped: 0, Time elapsed: 0.002 sec
Running net.sf.jsqlparser.statement.AdaptersTest
Tests run: 1, Failures: 0, Errors: 0, Skipped: 0, Time elapsed: 0.002 sec
Running net.sf.jsqlparser.statement.StatementsTest
Tests run: 1, Failures: 0, Errors: 1, Skipped: 0, Time elapsed: 0.002 sec <<< FAILURE!
Running net.sf.jsqlparser.statement.execute.ExecuteTest
Tests run: 1, Failures: 1, Errors: 0, Skipped: 0, Time elapsed: 0 sec <<< FAILURE!

Results :

Failed tests:   testAlterTableUniqueKey(net.sf.jsqlparser.test.alter.AlterTest): expected:<...schema_migrations` ([`version`])> but was:<...schema_migrations` ([])>
  testAlterTableAddColumn(net.sf.jsqlparser.test.alter.AlterTest): expected:<varchar [(255)]> but was:<varchar []>
  testAlterTablePrimaryKey(net.sf.jsqlparser.test.alter.AlterTest): expected:<...ls ADD PRIMARY KEY ([id])> but was:<...ls ADD PRIMARY KEY ([])>
  testCreateTableParams(net.sf.jsqlparser.test.create.CreateTableTest): expected:<CREATE T[EMPORARY TABLE T1 (PROCESSID VARCHAR (32)) ON COMMIT PRESERVE ROWS]> but was:<CREATE T[ABLE T1 ()]>
  testDrop(net.sf.jsqlparser.test.drop.DropTest): expected:<DROP INDEX myindex [CASCADE]> but was:<DROP INDEX myindex []>
  testInsertMultiRowValue(net.sf.jsqlparser.test.insert.InsertTest): expected:<INSERT INTO mytable [(col1, col2) VALUES (a, b), (d, e)]> but was:<INSERT INTO mytable [ VALUES , ]>
  testInsertWithReturning2(net.sf.jsqlparser.test.insert.InsertTest): expected:<INSERT INTO mytable [(mycolumn) VALUES ('1')] RETURNING *> but was:<INSERT INTO mytable [ VALUES ] RETURNING *>
  testInsertWithReturning3(net.sf.jsqlparser.test.insert.InsertTest): expected:<INSERT INTO mytable [(mycolumn) VALUES ('1') RETURNING id AS a1, id2 AS a2]> but was:<INSERT INTO mytable [ VALUES  RETURNING ]>
  testHexValues2(net.sf.jsqlparser.test.insert.InsertTest): expected:<... INTO TABLE2 VALUES [('1', "DSDD", 0xEFBFBDC7AB)]> but was:<... INTO TABLE2 VALUES []>
  testHexValues3(net.sf.jsqlparser.test.insert.InsertTest): expected:<... INTO TABLE2 VALUES [('1', "DSDD", 0xabcde)]> but was:<... INTO TABLE2 VALUES []>
  testHexValues(net.sf.jsqlparser.test.insert.InsertTest): expected:<... INTO TABLE2 VALUES [('1', "DSDD", x'EFBFBDC7AB')]> but was:<... INTO TABLE2 VALUES []>
  testSimpleInsert(net.sf.jsqlparser.test.insert.InsertTest): expected:<INSERT INTO example [(num, name, address, tel) VALUES (1, 'name', 'test ', '1234-1234')]> but was:<INSERT INTO example [ VALUES ]>
  testInsertWithKeywords(net.sf.jsqlparser.test.insert.InsertTest): expected:<INSERT INTO kvPair [(value, key) VALUES (?, ?)]> but was:<INSERT INTO kvPair [ VALUES ]>
  testInsertWithReturning(net.sf.jsqlparser.test.insert.InsertTest): expected:<INSERT INTO mytable [(mycolumn) VALUES ('1') RETURNING id]> but was:<INSERT INTO mytable [ VALUES  RETURNING ]>
  testRegularInsert(net.sf.jsqlparser.test.insert.InsertTest): expected:<INSERT INTO mytable [(col1, col2, col3) VALUES (?, 'sadfsd', 234)]> but was:<INSERT INTO mytable [ VALUES ]>
  testInsertWithKeywordValue(net.sf.jsqlparser.test.insert.InsertTest): expected:<INSERT INTO mytable [(col1) VALUES ('val1')]> but was:<INSERT INTO mytable [ VALUES ]>
  testUpdateMultiTable(net.sf.jsqlparser.test.update.UpdateTest): expected:<UPDATE [T1, T2] SET T1.C2 = T2.C2, ...> but was:<UPDATE [] SET T1.C2 = T2.C2, ...>
  testUpdateWithDeparser(net.sf.jsqlparser.test.update.UpdateTest): expected:<UPDATE [table1 AS A] SET A.columna = 'XX...> but was:<UPDATE [] SET A.columna = 'XX...>
  testReplaceSyntax2(net.sf.jsqlparser.test.replace.ReplaceTest): expected:<REPLACE mytable [(col1, col2, col3) VALUES ('as', ?, 565)]> but was:<REPLACE mytable [ VALUES ]>
  testAllSqlsParseDeparse(net.sf.jsqlparser.test.select.SpecialOracleTest): expected:<select f[act_1_id,fact_2_id,fact_3_id,sum(sales_value)as sales_value,grouping_id(fact_1_id,fact_2_id,fact_3_id)as grouping_id from dimension_tab group by cube(fact_1_id,fact_2_id,fact_3_id)order by fact_1_id,fact_2_id,fact_3_id]> but was:<select f[rom dimension_tab]>
  testSelectBrackets2(net.sf.jsqlparser.test.select.SelectTest): expected:<SELECT [(EXTRACT(epoch FROM age(d1, d2)) / 2)::numeric]> but was:<SELECT []>
  testSelectBrackets3(net.sf.jsqlparser.test.select.SelectTest): expected:<SELECT [avg((EXTRACT(epoch FROM age(d1, d2)) / 2)::numeric)]> but was:<SELECT []>
  testSelectBrackets4(net.sf.jsqlparser.test.select.SelectTest): expected:<SELECT [(1 / 2)::numeric]> but was:<SELECT []>
  testOrderBy(net.sf.jsqlparser.test.select.SelectTest): expected:<SELECT [* FROM tab1 WHERE a > 34 GROUP BY tab1.b ORDER BY tab1.a DESC, tab1.b ASC]> but was:<SELECT [ FROM tab1 WHERE a > 34]>
  testIssue162_doubleUserVar(net.sf.jsqlparser.test.select.SelectTest): expected:<SELECT [@@SPID AS ID, SYSTEM_USER AS "Login Name", USER AS "User Name"]> but was:<SELECT []>
  testSelectWithBrackets2(net.sf.jsqlparser.test.select.SelectTest): expected:<(SELECT [1])> but was:<(SELECT [])>
  testSelectBrackets(net.sf.jsqlparser.test.select.SelectTest): expected:<SELECT [avg((123.250)::numeric)]> but was:<SELECT []>
  testSelectOrderHaving(net.sf.jsqlparser.test.select.SelectTest): expected:<SELECT [units, count(units) AS num FROM currency GROUP BY units HAVING count(units) > 1 ORDER BY num]> but was:<SELECT [ FROM currency HAVING count > 1]>
  testSelectFunction(net.sf.jsqlparser.test.select.SelectTest): expected:<SELECT [1 + 2 AS sum]> but was:<SELECT []>
  testIssue160_signedParameter(net.sf.jsqlparser.test.select.SelectTest): expected:<SELECT [start_date WHERE start_date > DATEADD(HH, -?, GETDATE())]> but was:<SELECT [ WHERE start_date > DATEADD]>
  testInterval1(net.sf.jsqlparser.test.select.SelectTest): expected:<SELECT [5 + INTERVAL '3 days']> but was:<SELECT []>
  testInterval3(net.sf.jsqlparser.test.select.SelectTest): expected:<SELECT [5 + INTERVAL '3' day]> but was:<SELECT []>
  testInterval4(net.sf.jsqlparser.test.select.SelectTest): expected:<SELECT ['2008-12-31 23:59:59' + INTERVAL 1 SECOND]> but was:<SELECT []>
  testSelectWithoutFrom(net.sf.jsqlparser.test.select.SelectTest): expected:<SELECT [footable.foocolumn]> but was:<SELECT []>
  testSelectKeep(net.sf.jsqlparser.test.select.SelectTest): expected:<SELECT [col1, min(col2) KEEP (DENSE_RANK FIRST ORDER BY col3), col4 FROM table1 GROUP BY col5 ORDER BY col3]> but was:<SELECT [ FROM table1]>
  testAccept(net.sf.jsqlparser.statement.execute.ExecuteTest): expected:<EXECUTE myproc ['a', 2, 'b']> but was:<EXECUTE myproc []>

Tests in error: 
  testCreateTableForeignKey(net.sf.jsqlparser.test.create.CreateTableTest)
  testCreateTableArrays(net.sf.jsqlparser.test.create.CreateTableTest)
  testCreateTable2(net.sf.jsqlparser.test.create.CreateTableTest)
  testCreateTable3(net.sf.jsqlparser.test.create.CreateTableTest)
  testCreateTableDefault2(net.sf.jsqlparser.test.create.CreateTableTest)
  testCreateTableWithKey(net.sf.jsqlparser.test.create.CreateTableTest)
  testCreateTable(net.sf.jsqlparser.test.create.CreateTableTest)
  testCreateTablePrimaryKey(net.sf.jsqlparser.test.create.CreateTableTest)
  testCreateTableColumnValues(net.sf.jsqlparser.test.create.CreateTableTest)
  testCreateTableDefault(net.sf.jsqlparser.test.create.CreateTableTest)
  testCreateTableWithRange(net.sf.jsqlparser.test.create.CreateTableTest)
  testCreateTableUniqueConstraint(net.sf.jsqlparser.test.create.CreateTableTest)
  testCreateTableForeignKey2(net.sf.jsqlparser.test.create.CreateTableTest)
  testCreateTableForeignKey3(net.sf.jsqlparser.test.create.CreateTableTest)
  testCreateTableForeignKey4(net.sf.jsqlparser.test.create.CreateTableTest)
  testCreateTableWithUniqueKey(net.sf.jsqlparser.test.create.CreateTableTest)
  testCreateTableVeryComplex(net.sf.jsqlparser.test.create.CreateTableTest)
  testCreateTableUnlogged2(net.sf.jsqlparser.test.create.CreateTableTest)
  testCreateTableColumnValue(net.sf.jsqlparser.test.create.CreateTableTest)
  testCreateTableInlinePrimaryKey(net.sf.jsqlparser.test.create.CreateTableTest)
  testCreateTableArrays2(net.sf.jsqlparser.test.create.CreateTableTest)
  testCreateTableAsSelect(net.sf.jsqlparser.test.create.CreateTableTest)
  testCreateTableAsSelect2(net.sf.jsqlparser.test.create.CreateTableTest)
  testCreateTableUnlogged(net.sf.jsqlparser.test.create.CreateTableTest)
  testCreateTableIfNotExists(net.sf.jsqlparser.test.create.CreateTableTest)
  testCreateView2(net.sf.jsqlparser.test.create.CreateViewTest)
  testCreateView3(net.sf.jsqlparser.test.create.CreateViewTest)
  testCreateView4(net.sf.jsqlparser.test.create.CreateViewTest)
  testCreateView5(net.sf.jsqlparser.test.create.CreateViewTest)
  testCreateView(net.sf.jsqlparser.test.create.CreateViewTest)
  testCreateViewUnion(net.sf.jsqlparser.test.create.CreateViewTest)
  testCreateMaterializedView(net.sf.jsqlparser.test.create.CreateViewTest)
  testCreateViewWithColumnNames1(net.sf.jsqlparser.test.create.CreateViewTest)
  testInsertFromSelect(net.sf.jsqlparser.test.insert.InsertTest)
  testInsertWithSelect(net.sf.jsqlparser.test.insert.InsertTest)
  testInsertSelect(net.sf.jsqlparser.test.insert.InsertTest)
  testUpdateWithFrom(net.sf.jsqlparser.test.update.UpdateTest)
  testUpdateWithSelect2(net.sf.jsqlparser.test.update.UpdateTest)
  testUpdateWithSelect(net.sf.jsqlparser.test.update.UpdateTest)
  testProblemReplaceParseDeparse(net.sf.jsqlparser.test.replace.ReplaceTest)
  testSelectAliasWithoutAs(net.sf.jsqlparser.test.select.SelectTest)
  testAllConditionSubSelect(net.sf.jsqlparser.test.select.SelectTest)
  testSimpleSigns(net.sf.jsqlparser.test.select.SelectTest)
  testMultiValueIn2(net.sf.jsqlparser.test.select.SelectTest)
  testSelectForUpdateOfTable(net.sf.jsqlparser.test.select.SelectTest)
  testPostgreSQLRegExpCaseSensitiveMatch(net.sf.jsqlparser.test.select.SelectTest)
  testOracleJoin2(net.sf.jsqlparser.test.select.SelectTest)
  testOracleJoin3(net.sf.jsqlparser.test.select.SelectTest)
  testOracleJoin4(net.sf.jsqlparser.test.select.SelectTest)
  testMultiPartTableNameWithSchemaName(net.sf.jsqlparser.test.select.SelectTest)
  testSimpleAdditionsAndSubtractionsWithSigns(net.sf.jsqlparser.test.select.SelectTest)
  testSelectAliasInQuotes(net.sf.jsqlparser.test.select.SelectTest)
  testCastTypeProblem2(net.sf.jsqlparser.test.select.SelectTest)
  testCastTypeProblem3(net.sf.jsqlparser.test.select.SelectTest)
  testCastTypeProblem4(net.sf.jsqlparser.test.select.SelectTest)
  testCastTypeProblem5(net.sf.jsqlparser.test.select.SelectTest)
  testCastTypeProblem6(net.sf.jsqlparser.test.select.SelectTest)
  testCastTypeProblem7(net.sf.jsqlparser.test.select.SelectTest)
  testCastInCast(net.sf.jsqlparser.test.select.SelectTest)
  testSkipFirst(net.sf.jsqlparser.test.select.SelectTest)
  testMultiPartTableNameWithDatabaseNameAndSchemaName(net.sf.jsqlparser.test.select.SelectTest)
  testSelectJoinWithComma(net.sf.jsqlparser.test.select.SelectTest)
  testAdditionalLettersGerman(net.sf.jsqlparser.test.select.SelectTest)
  testTop(net.sf.jsqlparser.test.select.SelectTest)
  testWithUnionProblem(net.sf.jsqlparser.test.select.SelectTest)
  testMysqlQuote(net.sf.jsqlparser.test.select.SelectTest)
  testSelectInnerWith(net.sf.jsqlparser.test.select.SelectTest)
  testReservedKeyword2(net.sf.jsqlparser.test.select.SelectTest)
  testFirst(net.sf.jsqlparser.test.select.SelectTest)
  testIlike(net.sf.jsqlparser.test.select.SelectTest)
  testIsNot(net.sf.jsqlparser.test.select.SelectTest)
  testLimit(net.sf.jsqlparser.test.select.SelectTest)
  testSigns(net.sf.jsqlparser.test.select.SelectTest)
  testUnion(net.sf.jsqlparser.test.select.SelectTest)
  testWhere(net.sf.jsqlparser.test.select.SelectTest)
  testRegexpLike1(net.sf.jsqlparser.test.select.SelectTest)
  testRegexpLike2(net.sf.jsqlparser.test.select.SelectTest)
  testRegexpMySQL(net.sf.jsqlparser.test.select.SelectTest)
  testCase(net.sf.jsqlparser.test.select.SelectTest)
  testCast(net.sf.jsqlparser.test.select.SelectTest)
  testFrom(net.sf.jsqlparser.test.select.SelectTest)
  testJoin(net.sf.jsqlparser.test.select.SelectTest)
  testLike(net.sf.jsqlparser.test.select.SelectTest)
  testSkip(net.sf.jsqlparser.test.select.SelectTest)
  testTime(net.sf.jsqlparser.test.select.SelectTest)
  testWith(net.sf.jsqlparser.test.select.SelectTest)
  testJsonExpression(net.sf.jsqlparser.test.select.SelectTest)
  testConcatProblem2_5_1(net.sf.jsqlparser.test.select.SelectTest)
  testConcatProblem2_5_2(net.sf.jsqlparser.test.select.SelectTest)
  testProblemSqlAnalytic8Complex(net.sf.jsqlparser.test.select.SelectTest)
  testWithUnionAllProblem(net.sf.jsqlparser.test.select.SelectTest)
  testOracleJoin2_1(net.sf.jsqlparser.test.select.SelectTest)
  testOracleJoin2_2(net.sf.jsqlparser.test.select.SelectTest)
  testOracleJoin3_1(net.sf.jsqlparser.test.select.SelectTest)
  testAnyConditionSubSelect(net.sf.jsqlparser.test.select.SelectTest)
  testPivotXml1(net.sf.jsqlparser.test.select.SelectTest)
  testPivotXml2(net.sf.jsqlparser.test.select.SelectTest)
  testPivotXml3(net.sf.jsqlparser.test.select.SelectTest)
  testOrderByNullsFirst(net.sf.jsqlparser.test.select.SelectTest)
  testMultiTableJoin(net.sf.jsqlparser.test.select.SelectTest)
  testProblemSqlServer_Modulo_mod(net.sf.jsqlparser.test.select.SelectTest)
  testProblemSqlAnalytic(net.sf.jsqlparser.test.select.SelectTest)
  testIssue160_signedParameter2(net.sf.jsqlparser.test.select.SelectTest)
  testAdditionalLettersSpanish(net.sf.jsqlparser.test.select.SelectTest)
  testLateral1(net.sf.jsqlparser.test.select.SelectTest)
  testSelectNumericBind(net.sf.jsqlparser.test.select.SelectTest)
  testRegexpBinaryMySQL(net.sf.jsqlparser.test.select.SelectTest)
  testLateralComplex1(net.sf.jsqlparser.test.select.SelectTest)
  testMultiValueIn(net.sf.jsqlparser.test.select.SelectTest)
  testProblemSqlIntersect(net.sf.jsqlparser.test.select.SelectTest)
  testProblemFunction(net.sf.jsqlparser.test.select.SelectTest)
  testConcatProblem2(net.sf.jsqlparser.test.select.SelectTest)
  testBitwise(net.sf.jsqlparser.test.select.SelectTest)
  testSelectInto1(net.sf.jsqlparser.test.select.SelectTest)
  testSelectItems(net.sf.jsqlparser.test.select.SelectTest)
  testSelectJoin2(net.sf.jsqlparser.test.select.SelectTest)
  testBrackets2(net.sf.jsqlparser.test.select.SelectTest)
  testProblemSqlServer_Modulo_Proz(net.sf.jsqlparser.test.select.SelectTest)
  testFirstWithKeywordLimit(net.sf.jsqlparser.test.select.SelectTest)
  testGroupConcat(net.sf.jsqlparser.test.select.SelectTest)
  testWithRecursive(net.sf.jsqlparser.test.select.SelectTest)
  testSelectKeepOver(net.sf.jsqlparser.test.select.SelectTest)
  testFunctionRight(net.sf.jsqlparser.test.select.SelectTest)
  testMultiPartColumnName(net.sf.jsqlparser.test.select.SelectTest)
  testWithUnionProblem3(net.sf.jsqlparser.test.select.SelectTest)
  testWithUnionProblem4(net.sf.jsqlparser.test.select.SelectTest)
  testWithUnionProblem5(net.sf.jsqlparser.test.select.SelectTest)
  testValues2(net.sf.jsqlparser.test.select.SelectTest)
  testValues3(net.sf.jsqlparser.test.select.SelectTest)
  testValues4(net.sf.jsqlparser.test.select.SelectTest)
  testValues5(net.sf.jsqlparser.test.select.SelectTest)
  testGroupBy(net.sf.jsqlparser.test.select.SelectTest)
  testMultiPartColumnNameWithTableName(net.sf.jsqlparser.test.select.SelectTest)
  testMultiPartTableNameWithDatabaseName(net.sf.jsqlparser.test.select.SelectTest)
  testLimitSqlServer1(net.sf.jsqlparser.test.select.SelectTest)
  testLimitSqlServer2(net.sf.jsqlparser.test.select.SelectTest)
  testLimitSqlServer3(net.sf.jsqlparser.test.select.SelectTest)
  testLimitSqlServer4(net.sf.jsqlparser.test.select.SelectTest)
  testPivotFunction(net.sf.jsqlparser.test.select.SelectTest)
  testMultiPartTableNameWithServerNameAndDatabaseName(net.sf.jsqlparser.test.select.SelectTest)
  testConcatProblem2_1(net.sf.jsqlparser.test.select.SelectTest)
  testConcatProblem2_2(net.sf.jsqlparser.test.select.SelectTest)
  testConcatProblem2_3(net.sf.jsqlparser.test.select.SelectTest)
  testConcatProblem2_4(net.sf.jsqlparser.test.select.SelectTest)
  testConcatProblem2_5(net.sf.jsqlparser.test.select.SelectTest)
  testConcatProblem2_6(net.sf.jsqlparser.test.select.SelectTest)
  testMultiPartColumnNameWithDatabaseNameAndSchemaNameAndTableName(net.sf.jsqlparser.test.select.SelectTest)
  testMultiPartColumnNameWithDatabaseNameAndTableName(net.sf.jsqlparser.test.select.SelectTest)
  testReplaceAsFunction(net.sf.jsqlparser.test.select.SelectTest)
  testSelectJPQLPositionalParameter(net.sf.jsqlparser.test.select.SelectTest)
  testSelectWithinGroup(net.sf.jsqlparser.test.select.SelectTest)
  testNotEqualsTo(net.sf.jsqlparser.test.select.SelectTest)
  testSelectForUpdate(net.sf.jsqlparser.test.select.SelectTest)
  testProblemSqlAnalytic10Lag(net.sf.jsqlparser.test.select.SelectTest)
  testProblemSqlAnalytic11Lag(net.sf.jsqlparser.test.select.SelectTest)
  testMatches(net.sf.jsqlparser.test.select.SelectTest)
  testAnalyticFunctionProblem1(net.sf.jsqlparser.test.select.SelectTest)
  testFunctions(net.sf.jsqlparser.test.select.SelectTest)
  testProblemFunction2(net.sf.jsqlparser.test.select.SelectTest)
  testProblemFunction3(net.sf.jsqlparser.test.select.SelectTest)
  testAnalyticFunction12(net.sf.jsqlparser.test.select.SelectTest)
  testAnalyticFunction13(net.sf.jsqlparser.test.select.SelectTest)
  testAnalyticFunction14(net.sf.jsqlparser.test.select.SelectTest)
  testAnalyticFunction15(net.sf.jsqlparser.test.select.SelectTest)
  testAnalyticFunction16(net.sf.jsqlparser.test.select.SelectTest)
  testAnalyticFunction17(net.sf.jsqlparser.test.select.SelectTest)
  testAnalyticFunction18(net.sf.jsqlparser.test.select.SelectTest)
  testMultiPartTableNameWithServerNameAndDatabaseNameAndSchemaName(net.sf.jsqlparser.test.select.SelectTest)
  testBrackets(net.sf.jsqlparser.test.select.SelectTest)
  testWithStatement(net.sf.jsqlparser.test.select.SelectTest)
  testIssue154_2(net.sf.jsqlparser.test.select.SelectTest)
  testTimestamp(net.sf.jsqlparser.test.select.SelectTest)
  testProblemSqlAnalytic5AggregateColumnValue(net.sf.jsqlparser.test.select.SelectTest)
  testMultiPartTableNameWithColumnName(net.sf.jsqlparser.test.select.SelectTest)
  testFunctionLeft(net.sf.jsqlparser.test.select.SelectTest)
  testCharacterSetClause(net.sf.jsqlparser.test.select.SelectTest)
  testComplexUnion1(net.sf.jsqlparser.test.select.SelectTest)
  testProblemSqlAnalytic6AggregateColumnValue(net.sf.jsqlparser.test.select.SelectTest)
  testDistinct(net.sf.jsqlparser.test.select.SelectTest)
  testMultiPartColumnNameWithSchemaNameAndTableName(net.sf.jsqlparser.test.select.SelectTest)
  testMultiPartTableNameWithServerName(net.sf.jsqlparser.test.select.SelectTest)
  testProblemSqlAnalytic7Count(net.sf.jsqlparser.test.select.SelectTest)
  testAllColumnsFromTable(net.sf.jsqlparser.test.select.SelectTest)
  testProblemSqlCombinedSets(net.sf.jsqlparser.test.select.SelectTest)
  testInterval2(net.sf.jsqlparser.test.select.SelectTest)
  testConcat(net.sf.jsqlparser.test.select.SelectTest)
  testCount2(net.sf.jsqlparser.test.select.SelectTest)
  testSignedColumns(net.sf.jsqlparser.test.select.SelectTest)
  testDouble(net.sf.jsqlparser.test.select.SelectTest)
  testProblemSqlMinus(net.sf.jsqlparser.test.select.SelectTest)
  testExists(net.sf.jsqlparser.test.select.SelectTest)
  testMultiPartTableNameWithServerProblem(net.sf.jsqlparser.test.select.SelectTest)
  testGroupByExpression(net.sf.jsqlparser.test.select.SelectTest)
  testHaving(net.sf.jsqlparser.test.select.SelectTest)
  testIssue154(net.sf.jsqlparser.test.select.SelectTest)
  testDistinctTop(net.sf.jsqlparser.test.select.SelectTest)
  testSelectUserVariable(net.sf.jsqlparser.test.select.SelectTest)
  testIsNot2(net.sf.jsqlparser.test.select.SelectTest)
  testTopWithParenthesis(net.sf.jsqlparser.test.select.SelectTest)
  testSelectOracleColl(net.sf.jsqlparser.test.select.SelectTest)
  testOracleJoin(net.sf.jsqlparser.test.select.SelectTest)
  testPostgreSQLRegExpCaseSensitiveMatch2(net.sf.jsqlparser.test.select.SelectTest)
  testPostgreSQLRegExpCaseSensitiveMatch3(net.sf.jsqlparser.test.select.SelectTest)
  testPostgreSQLRegExpCaseSensitiveMatch4(net.sf.jsqlparser.test.select.SelectTest)
  testRowConstructor1(net.sf.jsqlparser.test.select.SelectTest)
  testRowConstructor2(net.sf.jsqlparser.test.select.SelectTest)
  testLimit2(net.sf.jsqlparser.test.select.SelectTest)
  testTableCrossJoin(net.sf.jsqlparser.test.select.SelectTest)
  testProblemSqlAnalytic2(net.sf.jsqlparser.test.select.SelectTest)
  testProblemSqlAnalytic3(net.sf.jsqlparser.test.select.SelectTest)
  testProblemSqlAnalytic9CommaListPartition(net.sf.jsqlparser.test.select.SelectTest)
  testOracleHierarchicalQuery(net.sf.jsqlparser.test.select.SelectTest)
  testPivot1(net.sf.jsqlparser.test.select.SelectTest)
  testPivot2(net.sf.jsqlparser.test.select.SelectTest)
  testPivot3(net.sf.jsqlparser.test.select.SelectTest)
  testPivot4(net.sf.jsqlparser.test.select.SelectTest)
  testPivot5(net.sf.jsqlparser.test.select.SelectTest)
  testSelectWithBrackets(net.sf.jsqlparser.test.select.SelectTest)
  testAnalyticFunctionProblem1b(net.sf.jsqlparser.test.select.SelectTest)
  testDeparser(net.sf.jsqlparser.test.select.SelectTest)
  testPivotXmlSubquery1(net.sf.jsqlparser.test.select.SelectTest)
  testOracleHierarchicalQuery2(net.sf.jsqlparser.test.select.SelectTest)
  testOracleHierarchicalQuery3(net.sf.jsqlparser.test.select.SelectTest)
  testOracleHierarchicalQuery4(net.sf.jsqlparser.test.select.SelectTest)
  testExtractFrom1(net.sf.jsqlparser.test.select.SelectTest)
  testExtractFrom2(net.sf.jsqlparser.test.select.SelectTest)
  testExtractFrom3(net.sf.jsqlparser.test.select.SelectTest)
  testExtractFrom4(net.sf.jsqlparser.test.select.SelectTest)
  testProblemSqlAnalytic4EmptyOver(net.sf.jsqlparser.test.select.SelectTest)
  testCastTypeProblem(net.sf.jsqlparser.test.select.SelectTest)
  testSelectKeywordPercent(net.sf.jsqlparser.test.select.SelectTest)
  testValues(net.sf.jsqlparser.test.select.SelectTest)
  testValues6BothVariants(net.sf.jsqlparser.test.select.SelectTest)
  testProblemSqlExcept(net.sf.jsqlparser.test.select.SelectTest)
  testMultiPartTableNameWithServerNameAndSchemaName(net.sf.jsqlparser.test.select.SelectTest)
  testProblemSqlServer_Modulo(net.sf.jsqlparser.test.select.SelectTest)
  testReservedKeyword(net.sf.jsqlparser.test.select.SelectTest)
  testLimitSqlServerJdbcParameters(net.sf.jsqlparser.test.select.SelectTest)
  testSelectJoin(net.sf.jsqlparser.test.select.SelectTest)
  testCaseElseAddition(net.sf.jsqlparser.test.select.SelectTest)
  testNamedParameter2(net.sf.jsqlparser.test.select.SelectTest)
  testBooleanFunction1(net.sf.jsqlparser.test.select.SelectTest)
  testCastInCast2(net.sf.jsqlparser.test.select.SelectTest)
  testNamedParameter(net.sf.jsqlparser.test.select.SelectTest)
  testVisit_PlainSelect_concat(net.sf.jsqlparser.util.ConnectExpressionsVisitorTest)
  testVisit_PlainSelect_addition(net.sf.jsqlparser.util.ConnectExpressionsVisitorTest)
  testVisit_SetOperationList(net.sf.jsqlparser.util.AddAliasesVisitorTest)
  testVisit_PlainSelect(net.sf.jsqlparser.util.AddAliasesVisitorTest)
  testVisit_PlainSelect_expression(net.sf.jsqlparser.util.AddAliasesVisitorTest)
  testVisit_PlainSelect_duplicates(net.sf.jsqlparser.util.AddAliasesVisitorTest)
  testBuildSelectFromTableAndExpressions(net.sf.jsqlparser.util.SelectUtilsTest)
  testAddExpr(net.sf.jsqlparser.util.SelectUtilsTest)
  testAddJoin(net.sf.jsqlparser.util.SelectUtilsTest)
  testBuildSelectFromTable(net.sf.jsqlparser.util.SelectUtilsTest)
  testBuildSelectFromTableWithGroupBy(net.sf.jsqlparser.util.SelectUtilsTest)
  testBuildSelectFromTableAndParsedExpression(net.sf.jsqlparser.util.SelectUtilsTest)
  testStatements(net.sf.jsqlparser.statement.StatementsTest)

Tests run: 353, Failures: 36, Errors: 257, Skipped: 0

[INFO] ------------------------------------------------------------------------
[INFO] BUILD FAILURE
[INFO] ------------------------------------------------------------------------
[INFO] Total time: 22.492s
[INFO] Finished at: Tue Oct 06 07:47:44 CEST 2015
[INFO] Final Memory: 22M/346M
[INFO] ------------------------------------------------------------------------
[ERROR] Failed to execute goal org.apache.maven.plugins:maven-surefire-plugin:2.10:test (default-test) on project jsqlparser: There are test failures.
[ERROR] 
[ERROR] Please refer to /home/perham/Study/Experiments/2015-10-23-ICST/LittleDarwin/Cases/JSqlParser-jsqlparser-0.9.4/target/surefire-reports for the individual test results.
[ERROR] -> [Help 1]
[ERROR] 
[ERROR] To see the full stack trace of the errors, re-run Maven with the -e switch.
[ERROR] Re-run Maven using the -X switch to enable full debug logging.
[ERROR] 
[ERROR] For more information about the errors and possible solutions, please read the following articles:
[ERROR] [Help 1] http://cwiki.apache.org/confluence/display/MAVEN/MojoFailureException
