[INFO] Scanning for projects...
[INFO]                                                                         
[INFO] ------------------------------------------------------------------------
[INFO] Building JSQLParser library 0.9.4
[INFO] ------------------------------------------------------------------------
[INFO] 
[INFO] --- javacc-maven-plugin:2.6:jjtree-javacc (javacc) @ jsqlparser ---
[INFO] Skipping - all parsers are up to date
[INFO] 
[INFO] --- license-maven-plugin:1.6:update-file-header (first) @ jsqlparser ---
[INFO] Will search files to update from root /home/perham/Study/Experiments/2015-10-23-ICST/LittleDarwin/Cases/JSqlParser-jsqlparser-0.9.4/src/main/java
[INFO]  - adding license header on file /home/perham/Study/Experiments/2015-10-23-ICST/LittleDarwin/Cases/JSqlParser-jsqlparser-0.9.4/src/main/java/net/sf/jsqlparser/statement/select/PlainSelect.java
[INFO] Scan 164 files header done in 223.295ms.
[INFO] 
 * uptodate header on 163 files.
 * add header on 1 file.
[INFO] 
[INFO] --- maven-resources-plugin:2.6:resources (default-resources) @ jsqlparser ---
[INFO] Using 'UTF-8' encoding to copy filtered resources.
[INFO] skip non existing resourceDirectory /home/perham/Study/Experiments/2015-10-23-ICST/LittleDarwin/Cases/JSqlParser-jsqlparser-0.9.4/src/main/resources
[INFO] 
[INFO] --- maven-compiler-plugin:3.3:compile (default-compile) @ jsqlparser ---
[INFO] Changes detected - recompiling the module!
[INFO] Compiling 177 source files to /home/perham/Study/Experiments/2015-10-23-ICST/LittleDarwin/Cases/JSqlParser-jsqlparser-0.9.4/target/classes
[WARNING] bootstrap class path not set in conjunction with -source 1.6
[INFO] /home/perham/Study/Experiments/2015-10-23-ICST/LittleDarwin/Cases/JSqlParser-jsqlparser-0.9.4/target/generated-sources/javacc/net/sf/jsqlparser/parser/CCJSqlParser.java: /home/perham/Study/Experiments/2015-10-23-ICST/LittleDarwin/Cases/JSqlParser-jsqlparser-0.9.4/target/generated-sources/javacc/net/sf/jsqlparser/parser/CCJSqlParser.java uses unchecked or unsafe operations.
[INFO] /home/perham/Study/Experiments/2015-10-23-ICST/LittleDarwin/Cases/JSqlParser-jsqlparser-0.9.4/target/generated-sources/javacc/net/sf/jsqlparser/parser/CCJSqlParser.java: Recompile with -Xlint:unchecked for details.
[INFO] 
[INFO] --- maven-resources-plugin:2.6:testResources (default-testResources) @ jsqlparser ---
[INFO] Using 'UTF-8' encoding to copy filtered resources.
[INFO] Copying 280 resources
[INFO] 
[INFO] --- maven-compiler-plugin:3.3:testCompile (default-testCompile) @ jsqlparser ---
[INFO] Nothing to compile - all classes are up to date
[INFO] 
[INFO] --- maven-surefire-plugin:2.10:test (default-test) @ jsqlparser ---
[INFO] Surefire report directory: /home/perham/Study/Experiments/2015-10-23-ICST/LittleDarwin/Cases/JSqlParser-jsqlparser-0.9.4/target/surefire-reports

-------------------------------------------------------
 T E S T S
-------------------------------------------------------
Running net.sf.jsqlparser.test.alter.AlterTest
Tests run: 3, Failures: 0, Errors: 0, Skipped: 0, Time elapsed: 0.062 sec
Running net.sf.jsqlparser.test.create.CreateTableTest
Tests run: 27, Failures: 2, Errors: 0, Skipped: 0, Time elapsed: 0.133 sec <<< FAILURE!
Running net.sf.jsqlparser.test.create.CreateIndexTest
Tests run: 6, Failures: 0, Errors: 0, Skipped: 0, Time elapsed: 0.001 sec
Running net.sf.jsqlparser.test.create.CreateViewTest
Tests run: 8, Failures: 8, Errors: 0, Skipped: 0, Time elapsed: 0.013 sec <<< FAILURE!
Running net.sf.jsqlparser.test.delete.DeleteTest
Tests run: 2, Failures: 0, Errors: 0, Skipped: 0, Time elapsed: 0.003 sec
Running net.sf.jsqlparser.test.simpleparsing.CCJSqlParserManagerTest
Tests run: 1, Failures: 0, Errors: 0, Skipped: 0, Time elapsed: 0.187 sec
Running net.sf.jsqlparser.test.drop.DropTest
Tests run: 2, Failures: 0, Errors: 0, Skipped: 0, Time elapsed: 0.001 sec
Running net.sf.jsqlparser.test.insert.InsertTest
Tests run: 15, Failures: 3, Errors: 0, Skipped: 0, Time elapsed: 0.042 sec <<< FAILURE!
Running net.sf.jsqlparser.test.TestUtils
Tests run: 1, Failures: 0, Errors: 0, Skipped: 0, Time elapsed: 0 sec
Running net.sf.jsqlparser.test.update.UpdateTest
Tests run: 7, Failures: 2, Errors: 0, Skipped: 0, Time elapsed: 0.005 sec <<< FAILURE!
Running net.sf.jsqlparser.test.replace.ReplaceTest
Tests run: 4, Failures: 1, Errors: 0, Skipped: 0, Time elapsed: 0.003 sec <<< FAILURE!
Running net.sf.jsqlparser.test.select.SelectASTTest
*Statement
* Column
* Column
* Table
* Column
* Column
Tests run: 2, Failures: 0, Errors: 0, Skipped: 0, Time elapsed: 0.003 sec
Running net.sf.jsqlparser.test.select.SpecialOracleTest
Oct 06, 2015 7:49:54 AM net.sf.jsqlparser.test.select.SpecialOracleTest testAllSqlsParseDeparse
INFO: testing string01.sql
Oct 06, 2015 7:49:54 AM net.sf.jsqlparser.test.select.SpecialOracleTest testAllSqlsParseDeparse
INFO:    -> PROBLEM net.sf.jsqlparser.JSQLParserException
Oct 06, 2015 7:49:54 AM net.sf.jsqlparser.test.select.SpecialOracleTest testAllSqlsParseDeparse
INFO: testing returning01.sql
Oct 06, 2015 7:49:54 AM net.sf.jsqlparser.test.select.SpecialOracleTest testAllSqlsParseDeparse
INFO:    -> PROBLEM net.sf.jsqlparser.JSQLParserException
Oct 06, 2015 7:49:54 AM net.sf.jsqlparser.test.select.SpecialOracleTest testAllSqlsParseDeparse
INFO: testing keywordasidentifier05.sql
Oct 06, 2015 7:49:54 AM net.sf.jsqlparser.test.select.SpecialOracleTest testAllSqlsOnlyParse
INFO: testing comment02.sql
Oct 06, 2015 7:49:54 AM net.sf.jsqlparser.test.select.SpecialOracleTest testAllSqlsOnlyParse
INFO:    -> SUCCESS
Oct 06, 2015 7:49:54 AM net.sf.jsqlparser.test.select.SpecialOracleTest testAllSqlsOnlyParse
INFO: testing numbers02.sql
Oct 06, 2015 7:49:54 AM net.sf.jsqlparser.test.select.SpecialOracleTest testAllSqlsOnlyParse
INFO:    -> SUCCESS
Oct 06, 2015 7:49:54 AM net.sf.jsqlparser.test.select.SpecialOracleTest testAllSqlsOnlyParse
INFO: testing comment01.sql
Oct 06, 2015 7:49:54 AM net.sf.jsqlparser.test.select.SpecialOracleTest testAllSqlsOnlyParse
INFO:    -> SUCCESS
Tests run: 2, Failures: 1, Errors: 0, Skipped: 0, Time elapsed: 0.083 sec <<< FAILURE!
Running net.sf.jsqlparser.test.select.SelectTest
Tests run: 228, Failures: 207, Errors: 0, Skipped: 0, Time elapsed: 0.543 sec <<< FAILURE!
Running net.sf.jsqlparser.test.select.SpeedTest
42500 statements parsed in 7947 milliseconds
 (5347 statements per second,  0.000187 seconds per statement )
38500 select scans for table name executed in 138 milliseconds
 (278985 select scans for table name per second,  0.0000036 seconds per select scans for table name)
Tests run: 1, Failures: 0, Errors: 0, Skipped: 0, Time elapsed: 8.075 sec
Running net.sf.jsqlparser.test.truncate.TruncateTest
Tests run: 1, Failures: 0, Errors: 0, Skipped: 0, Time elapsed: 0.001 sec
Running net.sf.jsqlparser.util.TablesNamesFinderTest
Tests run: 19, Failures: 0, Errors: 0, Skipped: 0, Time elapsed: 0.015 sec
Running net.sf.jsqlparser.util.ConnectExpressionsVisitorTest
Tests run: 2, Failures: 2, Errors: 0, Skipped: 0, Time elapsed: 0.004 sec <<< FAILURE!
Running net.sf.jsqlparser.util.AddAliasesVisitorTest
Tests run: 4, Failures: 4, Errors: 0, Skipped: 0, Time elapsed: 0.003 sec <<< FAILURE!
Running net.sf.jsqlparser.util.SelectUtilsTest
Tests run: 6, Failures: 6, Errors: 0, Skipped: 0, Time elapsed: 0.005 sec <<< FAILURE!
Running net.sf.jsqlparser.expression.ExpressionVisitorAdapterTest
Tests run: 2, Failures: 0, Errors: 0, Skipped: 0, Time elapsed: 0.001 sec
Running net.sf.jsqlparser.expression.SignedExpressionTest
Tests run: 1, Failures: 0, Errors: 0, Skipped: 0, Time elapsed: 0.001 sec
Running net.sf.jsqlparser.schema.ServerTest
Tests run: 2, Failures: 0, Errors: 0, Skipped: 0, Time elapsed: 0 sec
Running net.sf.jsqlparser.parser.CCJSqlParserUtilTest
Tests run: 3, Failures: 0, Errors: 0, Skipped: 0, Time elapsed: 0 sec
Running net.sf.jsqlparser.statement.SetStatementTest
Tests run: 1, Failures: 0, Errors: 0, Skipped: 0, Time elapsed: 0.004 sec
Running net.sf.jsqlparser.statement.AdaptersTest
Tests run: 1, Failures: 0, Errors: 0, Skipped: 0, Time elapsed: 0.002 sec
Running net.sf.jsqlparser.statement.StatementsTest
Tests run: 1, Failures: 1, Errors: 0, Skipped: 0, Time elapsed: 0.002 sec <<< FAILURE!
Running net.sf.jsqlparser.statement.execute.ExecuteTest
Tests run: 1, Failures: 0, Errors: 0, Skipped: 0, Time elapsed: 0 sec

Results :

Failed tests:   testCreateTableAsSelect(net.sf.jsqlparser.test.create.CreateTableTest): expected:<...CT col1, col2 FROM b[]> but was:<...CT col1, col2 FROM b[null]>
  testCreateTableAsSelect2(net.sf.jsqlparser.test.create.CreateTableTest): expected:<... col3 FROM testtable[) SELECT col1, col2, col3 FROM b INNER JOIN a ON b.col1 = a.col1]> but was:<... col3 FROM testtable[null) SELECT col1, col2, col3 FROM b INNER JOIN a ON b.col1 = a.col1null]>
  testCreateView2(net.sf.jsqlparser.test.create.CreateViewTest): expected:<... SELECT * FROM mytab[]> but was:<... SELECT * FROM mytab[null]>
  testCreateView3(net.sf.jsqlparser.test.create.CreateViewTest): expected:<... SELECT * FROM mytab[]> but was:<... SELECT * FROM mytab[null]>
  testCreateView4(net.sf.jsqlparser.test.create.CreateViewTest): expected:<...col1 = testtab2.col2[]> but was:<...col1 = testtab2.col2[null]>
  testCreateView5(net.sf.jsqlparser.test.create.CreateViewTest): expected:<...(SELECT * FROM mytab[])> but was:<...(SELECT * FROM mytab[null])>
  testCreateView(net.sf.jsqlparser.test.create.CreateViewTest): expected:<... SELECT * FROM mytab[]> but was:<... SELECT * FROM mytab[null]>
  testCreateViewUnion(net.sf.jsqlparser.test.create.CreateViewTest): expected:<...CT a, b FROM testtab[) UNION (SELECT b, c FROM testtab2])> but was:<...CT a, b FROM testtab[null) UNION (SELECT b, c FROM testtab2null])>
  testCreateMaterializedView(net.sf.jsqlparser.test.create.CreateViewTest): expected:<...CT a, b FROM testtab[]> but was:<...CT a, b FROM testtab[null]>
  testCreateViewWithColumnNames1(net.sf.jsqlparser.test.create.CreateViewTest): expected:<...CT a, b FROM testtab[]> but was:<...CT a, b FROM testtab[null]>
  testInsertFromSelect(net.sf.jsqlparser.test.insert.InsertTest): expected:<...LECT * FROM mytable2[]> but was:<...LECT * FROM mytable2[null]>
  testInsertWithSelect(net.sf.jsqlparser.test.insert.InsertTest): expected:<...ycolumn FROM mytable[) SELECT mycolumn FROM a]> but was:<...ycolumn FROM mytable[null) SELECT mycolumn FROM anull]>
  testInsertSelect(net.sf.jsqlparser.test.insert.InsertTest): expected:<...ycolumn FROM mytable[]> but was:<...ycolumn FROM mytable[null]>
  testUpdateWithSelect2(net.sf.jsqlparser.test.update.UpdateTest): expected:<..., b, c FROM mytable2[])> but was:<..., b, c FROM mytable2[null])>
  testUpdateWithSelect(net.sf.jsqlparser.test.update.UpdateTest): expected:<...ROM SYSIBM.SYSDUMMY1[])> but was:<...ROM SYSIBM.SYSDUMMY1[null])>
  testProblemReplaceParseDeparse(net.sf.jsqlparser.test.replace.ReplaceTest): expected:<...D, A, B FROM b_table[]> but was:<...D, A, B FROM b_table[null]>
  testAllSqlsParseDeparse(net.sf.jsqlparser.test.select.SpecialOracleTest): expected:<...ption from exception[]> but was:<...ption from exception[null]>
  testSelectAliasWithoutAs(net.sf.jsqlparser.test.select.SelectTest): expected:<...n Name" FROM mytable[]> but was:<...n Name" FROM mytable[null]>
  testAllConditionSubSelect(net.sf.jsqlparser.test.select.SelectTest): expected:<...WHERE e2.deptno = 10[)]> but was:<...WHERE e2.deptno = 10[null)null]>
  testSimpleSigns(net.sf.jsqlparser.test.select.SelectTest): expected:<...1, -1 FROM tableName[]> but was:<...1, -1 FROM tableName[null]>
  testMultiValueIn2(net.sf.jsqlparser.test.select.SelectTest): expected:<...T a, b FROM mytable2[)]> but was:<...T a, b FROM mytable2[null)null]>
  testSelectForUpdateOfTable(net.sf.jsqlparser.test.select.SelectTest): expected:<... foo.id = bar.foo_id[] FOR UPDATE OF foo> but was:<... foo.id = bar.foo_id[null] FOR UPDATE OF foo>
  testPostgreSQLRegExpCaseSensitiveMatch(net.sf.jsqlparser.test.select.SelectTest): expected:<...WHERE a ~ '[help].*'[]> but was:<...WHERE a ~ '[help].*'[null]>
  testOracleJoin2(net.sf.jsqlparser.test.select.SelectTest): expected:<...e1.a(+) = tabelle2.b[]> but was:<...e1.a(+) = tabelle2.b[null]>
  testOracleJoin3(net.sf.jsqlparser.test.select.SelectTest): expected:<...e1.a(+) > tabelle2.b[]> but was:<...e1.a(+) > tabelle2.b[null]>
  testOracleJoin4(net.sf.jsqlparser.test.select.SelectTest): expected:<...1.b(+) IN ('A', 'B')[]> but was:<...1.b(+) IN ('A', 'B')[null]>
  testMultiPartTableNameWithSchemaName(net.sf.jsqlparser.test.select.SelectTest): expected:<...schemaName.tableName[]> but was:<...schemaName.tableName[null]>
  testSimpleAdditionsAndSubtractionsWithSigns(net.sf.jsqlparser.test.select.SelectTest): expected:<...1 - 1 FROM tableName[]> but was:<...1 - 1 FROM tableName[null]>
  testSelectAliasInQuotes(net.sf.jsqlparser.test.select.SelectTest): expected:<...n Name" FROM mytable[]> but was:<...n Name" FROM mytable[null]>
  testOrderBy(net.sf.jsqlparser.test.select.SelectTest): expected:<...1.a DESC, tab1.b ASC[]> but was:<...1.a DESC, tab1.b ASC[null]>
  testCastTypeProblem2(net.sf.jsqlparser.test.select.SelectTest): expected:<...archar FROM tabelle1[]> but was:<...archar FROM tabelle1[null]>
  testCastTypeProblem3(net.sf.jsqlparser.test.select.SelectTest): expected:<... (256) FROM tabelle1[]> but was:<... (256) FROM tabelle1[null]>
  testCastTypeProblem4(net.sf.jsqlparser.test.select.SelectTest): expected:<... (256) FROM tabelle1[]> but was:<... (256) FROM tabelle1[null]>
  testCastTypeProblem5(net.sf.jsqlparser.test.select.SelectTest): expected:<... (256) FROM tabelle1[]> but was:<... (256) FROM tabelle1[null]>
  testCastTypeProblem6(net.sf.jsqlparser.test.select.SelectTest): expected:<...arying FROM tabelle1[]> but was:<...arying FROM tabelle1[null]>
  testCastTypeProblem7(net.sf.jsqlparser.test.select.SelectTest): expected:<...rying) FROM tabelle1[]> but was:<...rying) FROM tabelle1[null]>
  testCastInCast(net.sf.jsqlparser.test.select.SelectTest): expected:<...rchar) FROM tabelle1[]> but was:<...rchar) FROM tabelle1[null]>
  testSkipFirst(net.sf.jsqlparser.test.select.SelectTest): expected:<...ST f1 c1, c2 FROM t1[]> but was:<...ST f1 c1, c2 FROM t1[null]>
  testMultiPartTableNameWithDatabaseNameAndSchemaName(net.sf.jsqlparser.test.select.SelectTest): expected:<...schemaName.tableName[]> but was:<...schemaName.tableName[null]>
  testSelectJoinWithComma(net.sf.jsqlparser.test.select.SelectTest): expected:<...b.the_geom = es.geom[]> but was:<...b.the_geom = es.geom[null]>
  testAdditionalLettersGerman(net.sf.jsqlparser.test.select.SelectTest): expected:<...lü FROM testtableäöü[]> but was:<...lü FROM testtableäöü[null]>
  testTop(net.sf.jsqlparser.test.select.SelectTest): expected:<...HERE mytable.col = 9[]> but was:<...HERE mytable.col = 9[null]>
  testWithUnionProblem(net.sf.jsqlparser.test.select.SelectTest): expected:<...T mslink FROM tablea[) UNION (SELECT mslink FROM tableb)) SELECT * FROM tablea WHERE mslink IN (SELECT mslink FROM test)]> but was:<...T mslink FROM tablea[null) UNION (SELECT mslink FROM tablebnull)) SELECT * FROM tablea WHERE mslink IN (SELECT mslink FROM testnull)null]>
  testMysqlQuote(net.sf.jsqlparser.test.select.SelectTest): expected:<...AND b.ITEM = 'Chair'[]> but was:<...AND b.ITEM = 'Chair'[null]>
  testSelectInnerWith(net.sf.jsqlparser.test.select.SelectTest): expected:<...CT 'a' aid FROM DUAL[) SELECT aid FROM actor)]> but was:<...CT 'a' aid FROM DUAL[null) SELECT aid FROM actornull)null]>
  testReservedKeyword2(net.sf.jsqlparser.test.select.SelectTest): expected:<... open FROM tableName[]> but was:<... open FROM tableName[null]>
  testFirst(net.sf.jsqlparser.test.select.SelectTest): expected:<...ias.columnName2 DESC[]> but was:<...ias.columnName2 DESC[null]>
  testIlike(net.sf.jsqlparser.test.select.SelectTest): expected:<...col1 ILIKE '%hello%'[]> but was:<...col1 ILIKE '%hello%'[null]>
  testIsNot(net.sf.jsqlparser.test.select.SelectTest): expected:<... WHERE a IS NOT NULL[]> but was:<... WHERE a IS NOT NULL[null]>
  testLimit(net.sf.jsqlparser.test.select.SelectTest): expected:<...ERE mytable.col = 9 [LIMIT ? ]OFFSET 3> but was:<...ERE mytable.col = 9 []OFFSET 3>
  testSigns(net.sf.jsqlparser.test.select.SelectTest): expected:<...nName FROM tableName[]> but was:<...nName FROM tableName[null]>
  testUnion(net.sf.jsqlparser.test.select.SelectTest): expected:<...HERE mytable.col = 9[) UNION (SELECT * FROM mytable3 WHERE mytable3.col = ?) UNION (SELECT * FROM mytable2 LIMIT 4 OFFSET 3])> but was:<...HERE mytable.col = 9[null) UNION (SELECT * FROM mytable3 WHERE mytable3.col = ?null) UNION (SELECT * FROM mytable2])>
  testWhere(net.sf.jsqlparser.test.select.SelectTest): expected:<...a / b * (a + b)) > ?[]> but was:<...a / b * (a + b)) > ?[null]>
  testRegexpLike1(net.sf.jsqlparser.test.select.SelectTest): expected:<...me, '^Ste(v|ph)en$')[]> but was:<...me, '^Ste(v|ph)en$')[null]>
  testRegexpLike2(net.sf.jsqlparser.test.select.SelectTest): expected:<...E 2 END FROM mytable[]> but was:<...E 2 END FROM mytable[null]>
  testRegexpMySQL(net.sf.jsqlparser.test.select.SelectTest): expected:<...GEXP '^Ste(v|ph)en$'[]> but was:<...GEXP '^Ste(v|ph)en$'[null]>
  testCase(net.sf.jsqlparser.test.select.SelectTest): expected:<...THEN 2 END FROM tab1[]> but was:<...THEN 2 END FROM tab1[null]>
  testCast(net.sf.jsqlparser.test.select.SelectTest): expected:<...rchar) FROM tabelle1[]> but was:<...rchar) FROM tabelle1[null]>
  testFrom(net.sf.jsqlparser.test.select.SelectTest): expected:<...LECT * FROM mytable3[) AS mytable4 WHERE mytable.col = 9]> but was:<...LECT * FROM mytable3[null) AS mytable4 WHERE mytable.col = 9null]>
  testJoin(net.sf.jsqlparser.test.select.SelectTest): expected:<...ON tab1.id = tab2.id[]> but was:<...ON tab1.id = tab2.id[null]>
  testLike(net.sf.jsqlparser.test.select.SelectTest): expected:<... WHERE a LIKE 'test'[]> but was:<... WHERE a LIKE 'test'[null]>
  testSkip(net.sf.jsqlparser.test.select.SelectTest): expected:<...ias.columnName2 DESC[]> but was:<...ias.columnName2 DESC[null]>
  testTime(net.sf.jsqlparser.test.select.SelectTest): expected:<...E a > {t '04:05:34'}[]> but was:<...E a > {t '04:05:34'}[null]>
  testWith(net.sf.jsqlparser.test.select.SelectTest): expected:<...P BY OTHERS.WORKDEPT[), DINFOMAX AS (SELECT MAX(AVGSALARY) AS AVGMAX FROM DINFO) SELECT THIS_EMP.EMPNO, THIS_EMP.SALARY, DINFO.AVGSALARY, DINFO.EMPCOUNT, DINFOMAX.AVGMAX FROM EMPLOYEE AS THIS_EMP INNER JOIN DINFO INNER JOIN DINFOMAX WHERE THIS_EMP.JOB = 'SALESREP' AND THIS_EMP.WORKDEPT = DINFO.DEPTNO]> but was:<...P BY OTHERS.WORKDEPT[null), DINFOMAX AS (SELECT MAX(AVGSALARY) AS AVGMAX FROM DINFOnull) SELECT THIS_EMP.EMPNO, THIS_EMP.SALARY, DINFO.AVGSALARY, DINFO.EMPCOUNT, DINFOMAX.AVGMAX FROM EMPLOYEE AS THIS_EMP INNER JOIN DINFO INNER JOIN DINFOMAX WHERE THIS_EMP.JOB = 'SALESREP' AND THIS_EMP.WORKDEPT = DINFO.DEPTNOnull]>
  testJsonExpression(net.sf.jsqlparser.test.select.SelectTest): expected:<...thumb FROM instagram[]> but was:<...thumb FROM instagram[null]>
  testConcatProblem2_5_1(net.sf.jsqlparser.test.select.SelectTest): expected:<... || c FROM testtable[]> but was:<... || c FROM testtable[null]>
  testConcatProblem2_5_2(net.sf.jsqlparser.test.select.SelectTest): expected:<...) + c FROM testtable[]> but was:<...) + c FROM testtable[null]>
  testProblemSqlAnalytic8Complex(net.sf.jsqlparser.test.select.SelectTest): expected:<... ID < 60 ORDER BY ID[]> but was:<... ID < 60 ORDER BY ID[null]>
  testWithUnionAllProblem(net.sf.jsqlparser.test.select.SelectTest): expected:<...T mslink FROM tablea[) UNION ALL (SELECT mslink FROM tableb)) SELECT * FROM tablea WHERE mslink IN (SELECT mslink FROM test)]> but was:<...T mslink FROM tablea[null) UNION ALL (SELECT mslink FROM tablebnull)) SELECT * FROM tablea WHERE mslink IN (SELECT mslink FROM testnull)null]>
  testOracleJoin2_1(net.sf.jsqlparser.test.select.SelectTest): expected:<...lle1.a(+)=tabelle2.b[]> but was:<...lle1.a(+)=tabelle2.b[null]>
  testOracleJoin2_2(net.sf.jsqlparser.test.select.SelectTest): expected:<...lle1.a=tabelle2.b(+)[]> but was:<...lle1.a=tabelle2.b(+)[null]>
  testOracleJoin3_1(net.sf.jsqlparser.test.select.SelectTest): expected:<...e1.a > tabelle2.b(+)[]> but was:<...e1.a > tabelle2.b(+)[null]>
  testAnyConditionSubSelect(net.sf.jsqlparser.test.select.SelectTest): expected:<...WHERE e2.deptno = 10[)]> but was:<...WHERE e2.deptno = 10[null)null]>
  testPivotXml1(net.sf.jsqlparser.test.select.SelectTest): expected:<...) FOR b IN ('val1'))[]> but was:<...) FOR b IN ('val1'))[null]>
  testPivotXml2(net.sf.jsqlparser.test.select.SelectTest): expected:<...ls FROM myothertable[))]> but was:<...ls FROM myothertable[null))null]>
  testPivotXml3(net.sf.jsqlparser.test.select.SelectTest): expected:<...t(a) FOR b IN (ANY))[]> but was:<...t(a) FOR b IN (ANY))[null]>
  testOrderByNullsFirst(net.sf.jsqlparser.test.select.SelectTest): expected:<...DER BY a NULLS FIRST[]> but was:<...DER BY a NULLS FIRST[null]>
  testMultiTableJoin(net.sf.jsqlparser.test.select.SelectTest): expected:<...d ON tabc.c = tabd.c[]> but was:<...d ON tabc.c = tabd.c[null]>
  testProblemSqlServer_Modulo_mod(net.sf.jsqlparser.test.select.SelectTest): expected:<...ECT mod(5, 2) FROM A[]> but was:<...ECT mod(5, 2) FROM A[null]>
  testProblemSqlAnalytic(net.sf.jsqlparser.test.select.SelectTest): expected:<... a) AS n FROM table1[]> but was:<... a) AS n FROM table1[null]>
  testIssue160_signedParameter2(net.sf.jsqlparser.test.select.SelectTest): expected:<...mytable WHERE -? = 5[]> but was:<...mytable WHERE -? = 5[null]>
  testAdditionalLettersSpanish(net.sf.jsqlparser.test.select.SelectTest): expected:<SELECT * FROM años[]> but was:<SELECT * FROM años[null]>
  testLateral1(net.sf.jsqlparser.test.select.SelectTest): expected:<....ORDERID = O.ORDERID[) AS OL]> but was:<....ORDERID = O.ORDERID[null) AS OLnull]>
  testSelectNumericBind(net.sf.jsqlparser.test.select.SelectTest): expected:<... FROM b WHERE c = :1[]> but was:<... FROM b WHERE c = :1[null]>
  testRegexpBinaryMySQL(net.sf.jsqlparser.test.select.SelectTest): expected:<...NARY '^Ste(v|ph)en$'[]> but was:<...NARY '^Ste(v|ph)en$'[null]>
  testLateralComplex1(net.sf.jsqlparser.test.select.SelectTest): expected:<....ORDERID = O.ORDERID[) AS OL, LATERAL(SELECT SUM(CHGAMT) AS ORDCHGTOTAL FROM ORDERCHARGES CHARGES WHERE LINES.ORDERID = O.ORDERID) AS OC, LATERAL(SELECT SUM(TAXAMT) AS TAXTOTAL FROM ORDERTAXES TAXES WHERE TAXES.ORDERID = O.ORDERID) AS OT]> but was:<....ORDERID = O.ORDERID[null) AS OL, LATERAL(SELECT SUM(CHGAMT) AS ORDCHGTOTAL FROM ORDERCHARGES CHARGES WHERE LINES.ORDERID = O.ORDERIDnull) AS OC, LATERAL(SELECT SUM(TAXAMT) AS TAXTOTAL FROM ORDERTAXES TAXES WHERE TAXES.ORDERID = O.ORDERIDnull) AS OTnull]>
  testMultiValueIn(net.sf.jsqlparser.test.select.SelectTest): expected:<..., b, c FROM mytable2[)]> but was:<..., b, c FROM mytable2[null)null]>
  testProblemSqlIntersect(net.sf.jsqlparser.test.select.SelectTest): expected:<(SELECT * FROM a[) INTERSECT (SELECT * FROM b])> but was:<(SELECT * FROM a[null) INTERSECT (SELECT * FROM bnull])>
  testProblemFunction(net.sf.jsqlparser.test.select.SelectTest): expected:<...est() FROM testtable[]> but was:<...est() FROM testtable[null]>
  testConcatProblem2(net.sf.jsqlparser.test.select.SelectTest): expected:<...T_TMP FROM testtable[]> but was:<...T_TMP FROM testtable[null]>
  testBitwise(net.sf.jsqlparser.test.select.SelectTest): expected:<...1 | col2 FROM table1[]> but was:<...1 | col2 FROM table1[null]>
  testSelectInto1(net.sf.jsqlparser.test.select.SelectTest): expected:<... user_copy FROM user[]> but was:<... user_copy FROM user[null]>
  testSelectItems(net.sf.jsqlparser.test.select.SelectTest): expected:<...HERE mytable.col = 9[]> but was:<...HERE mytable.col = 9[null]>
  testSelectJoin2(net.sf.jsqlparser.test.select.SelectTest): expected:<...g_constraint.conkey)[]> but was:<...g_constraint.conkey)[null]>
  testBrackets2(net.sf.jsqlparser.test.select.SelectTest): expected:<SELECT [a] FROM t[]> but was:<SELECT [a] FROM t[null]>
  testProblemSqlServer_Modulo_Proz(net.sf.jsqlparser.test.select.SelectTest): expected:<SELECT 5 % 2 FROM A[]> but was:<SELECT 5 % 2 FROM A[null]>
  testFirstWithKeywordLimit(net.sf.jsqlparser.test.select.SelectTest): expected:<...ias.columnName2 DESC[]> but was:<...ias.columnName2 DESC[null]>
  testGroupConcat(net.sf.jsqlparser.test.select.SelectTest): expected:<...ROUP BY student_name[]> but was:<...ROUP BY student_name[null]>
  testWithRecursive(net.sf.jsqlparser.test.select.SelectTest): expected:<...FROM t WHERE n < 100[)) SELECT sum(n) FROM t]> but was:<...FROM t WHERE n < 100[null)) SELECT sum(n) FROM tnull]>
  testSelectKeepOver(net.sf.jsqlparser.test.select.SelectTest): expected:<...epartment_id, salary[]> but was:<...epartment_id, salary[null]>
  testFunctionRight(net.sf.jsqlparser.test.select.SelectTest): expected:<...col1, 4) FROM table1[]> but was:<...col1, 4) FROM table1[null]>
  testMultiPartColumnName(net.sf.jsqlparser.test.select.SelectTest): expected:<...nName FROM tableName[]> but was:<...nName FROM tableName[null]>
  testWithUnionProblem3(net.sf.jsqlparser.test.select.SelectTest): expected:<...me IS NULL AND 1 = 0[) UNION ALL (SELECT mslink FROM tableb)) SELECT * FROM tablea WHERE mslink IN (SELECT mslink FROM test)]> but was:<...me IS NULL AND 1 = 0[null) UNION ALL (SELECT mslink FROM tablebnull)) SELECT * FROM tablea WHERE mslink IN (SELECT mslink FROM testnull)null]>
  testWithUnionProblem4(net.sf.jsqlparser.test.select.SelectTest): expected:<...L AND gl.mslink <> 0[) UNION ALL (SELECT gl.mslink, ba.gl_name AS txt, ba.gl_nummer AS nr, hist.level + 1 AS level, CAST(hist.path + '.' + CAST(gl.mslink AS VARCHAR) AS VARCHAR) AS path, ae.feature FROM tablea AS gl INNER JOIN tableb AS ba ON gl.mslink = ba.gl_mslink INNER JOIN tablec AS ae ON gl.mslink = ae.mslink AND ae.deleted = 0 INNER JOIN hist ON gl.parent = hist.mslink WHERE gl.mslink <> 0)) SELECT mslink, space(level * 4) + txt AS txt, nr, feature, path FROM hist WHERE EXISTS (SELECT feature FROM tablec WHERE mslink = 0 AND ((feature IN (1, 2) AND hist.feature = 3) OR (feature IN (4) AND hist.feature = 2)))]> but was:<...L AND gl.mslink <> 0[null) UNION ALL (SELECT gl.mslink, ba.gl_name AS txt, ba.gl_nummer AS nr, hist.level + 1 AS level, CAST(hist.path + '.' + CAST(gl.mslink AS VARCHAR) AS VARCHAR) AS path, ae.feature FROM tablea AS gl INNER JOIN tableb AS ba ON gl.mslink = ba.gl_mslink INNER JOIN tablec AS ae ON gl.mslink = ae.mslink AND ae.deleted = 0 INNER JOIN hist ON gl.parent = hist.mslink WHERE gl.mslink <> 0null)) SELECT mslink, space(level * 4) + txt AS txt, nr, feature, path FROM hist WHERE EXISTS (SELECT feature FROM tablec WHERE mslink = 0 AND ((feature IN (1, 2) AND hist.feature = 3) OR (feature IN (4) AND hist.feature = 2))null)null]>
  testWithUnionProblem5(net.sf.jsqlparser.test.select.SelectTest): expected:<...L AND gl.mslink <> 0[) UNION ALL (SELECT gl.mslink, ba.gl_name AS txt, ba.gl_nummer AS nr, hist.level + 1 AS level, CAST(hist.path + '.' + CAST(gl.mslink AS VARCHAR) AS VARCHAR) AS path, 5 AS feature FROM tablea AS gl INNER JOIN tableb AS ba ON gl.mslink = ba.gl_mslink INNER JOIN tablec AS ae ON gl.mslink = ae.mslink AND ae.deleted = 0 INNER JOIN hist ON gl.parent = hist.mslink WHERE gl.mslink <> 0)) SELECT * FROM hist]> but was:<...L AND gl.mslink <> 0[null) UNION ALL (SELECT gl.mslink, ba.gl_name AS txt, ba.gl_nummer AS nr, hist.level + 1 AS level, CAST(hist.path + '.' + CAST(gl.mslink AS VARCHAR) AS VARCHAR) AS path, 5 AS feature FROM tablea AS gl INNER JOIN tableb AS ba ON gl.mslink = ba.gl_mslink INNER JOIN tablec AS ae ON gl.mslink = ae.mslink AND ae.deleted = 0 INNER JOIN hist ON gl.parent = hist.mslink WHERE gl.mslink <> 0null)) SELECT * FROM histnull]>
  testValues2(net.sf.jsqlparser.test.select.SelectTest): expected:<... 1, 2, 3, 4) AS test[]> but was:<... 1, 2, 3, 4) AS test[null]>
  testValues3(net.sf.jsqlparser.test.select.SelectTest): expected:<... 2, 3, 4) AS test(a)[]> but was:<... 2, 3, 4) AS test(a)[null]>
  testValues4(net.sf.jsqlparser.test.select.SelectTest): expected:<...3, 4)) AS test(a, b)[]> but was:<...3, 4)) AS test(a, b)[null]>
  testValues5(net.sf.jsqlparser.test.select.SelectTest): expected:<... MY_TEMP_TABLE(X, Y)[]> but was:<... MY_TEMP_TABLE(X, Y)[null]>
  testGroupBy(net.sf.jsqlparser.test.select.SelectTest): expected:<...> 34 GROUP BY tab1.b[]> but was:<...> 34 GROUP BY tab1.b[null]>
  testMultiPartColumnNameWithTableName(net.sf.jsqlparser.test.select.SelectTest): expected:<...nName FROM tableName[]> but was:<...nName FROM tableName[null]>
  testMultiPartTableNameWithDatabaseName(net.sf.jsqlparser.test.select.SelectTest): expected:<...abaseName..tableName[]> but was:<...abaseName..tableName[null]>
  testLimitSqlServer1(net.sf.jsqlparser.test.select.SelectTest): expected:<... ORDER BY mytable.id[] OFFSET 3 ROWS FETCH...> but was:<... ORDER BY mytable.id[null] OFFSET 3 ROWS FETCH...>
  testLimitSqlServer2(net.sf.jsqlparser.test.select.SelectTest): expected:<... ORDER BY mytable.id[] OFFSET 3 ROW FETCH ...> but was:<... ORDER BY mytable.id[null] OFFSET 3 ROW FETCH ...>
  testLimitSqlServer3(net.sf.jsqlparser.test.select.SelectTest): expected:<... ORDER BY mytable.id[] OFFSET 3 ROWS> but was:<... ORDER BY mytable.id[null] OFFSET 3 ROWS>
  testLimitSqlServer4(net.sf.jsqlparser.test.select.SelectTest): expected:<... ORDER BY mytable.id[] FETCH NEXT 5 ROWS O...> but was:<... ORDER BY mytable.id[null] FETCH NEXT 5 ROWS O...>
  testPivotFunction(net.sf.jsqlparser.test.select.SelectTest): expected:<...ode FROM customers t[) PIVOT (count(state_code) FOR state_code IN ('NY', 'CT', 'NJ', 'FL', 'MO')) ORDER BY times_purchased)) FROM DUAL]> but was:<...ode FROM customers t[null) PIVOT (count(state_code) FOR state_code IN ('NY', 'CT', 'NJ', 'FL', 'MO')) ORDER BY times_purchasednull)) FROM DUALnull]>
  testMultiPartTableNameWithServerNameAndDatabaseName(net.sf.jsqlparser.test.select.SelectTest): expected:<...abaseName..tableName[]> but was:<...abaseName..tableName[null]>
  testConcatProblem2_1(net.sf.jsqlparser.test.select.SelectTest): expected:<...CHAR) FROM testtable[]> but was:<...CHAR) FROM testtable[null]>
  testConcatProblem2_2(net.sf.jsqlparser.test.select.SelectTest): expected:<...T_TMP FROM testtable[]> but was:<...T_TMP FROM testtable[null]>
  testConcatProblem2_3(net.sf.jsqlparser.test.select.SelectTest): expected:<...CHAR) FROM testtable[]> but was:<...CHAR) FROM testtable[null]>
  testConcatProblem2_4(net.sf.jsqlparser.test.select.SelectTest): expected:<...R (1) FROM testtable[]> but was:<...R (1) FROM testtable[null]>
  testConcatProblem2_5(net.sf.jsqlparser.test.select.SelectTest): expected:<...|| c) FROM testtable[]> but was:<...|| c) FROM testtable[null]>
  testConcatProblem2_6(net.sf.jsqlparser.test.select.SelectTest): expected:<...|| c) FROM testtable[]> but was:<...|| c) FROM testtable[null]>
  testMultiPartColumnNameWithDatabaseNameAndSchemaNameAndTableName(net.sf.jsqlparser.test.select.SelectTest): expected:<...nName FROM tableName[]> but was:<...nName FROM tableName[null]>
  testMultiPartColumnNameWithDatabaseNameAndTableName(net.sf.jsqlparser.test.select.SelectTest): expected:<...nName FROM tableName[]> but was:<...nName FROM tableName[null]>
  testReplaceAsFunction(net.sf.jsqlparser.test.select.SelectTest): expected:<...a, 'b', c) FROM tab1[]> but was:<...a, 'b', c) FROM tab1[null]>
  testSelectJPQLPositionalParameter(net.sf.jsqlparser.test.select.SelectTest): expected:<...D (username LIKE ?1)[]> but was:<...D (username LIKE ?1)[null]>
  testSelectWithinGroup(net.sf.jsqlparser.test.select.SelectTest): expected:<...BY col1) FROM table1[]> but was:<...BY col1) FROM table1[null]>
  testNotEqualsTo(net.sf.jsqlparser.test.select.SelectTest): expected:<...ROM foo WHERE a != b[]> but was:<...ROM foo WHERE a != b[null]>
  testSelectForUpdate(net.sf.jsqlparser.test.select.SelectTest): expected:<...CT * FROM user_table[] FOR UPDATE> but was:<...CT * FROM user_table[null] FOR UPDATE>
  testProblemSqlAnalytic10Lag(net.sf.jsqlparser.test.select.SelectTest): expected:<... b) AS n FROM table1[]> but was:<... b) AS n FROM table1[null]>
  testProblemSqlAnalytic11Lag(net.sf.jsqlparser.test.select.SelectTest): expected:<... b) AS n FROM table1[]> but was:<... b) AS n FROM table1[null]>
  testMatches(net.sf.jsqlparser.test.select.SelectTest): expected:<...w & york & yankees')[]> but was:<...w & york & yankees')[null]>
  testAnalyticFunctionProblem1(net.sf.jsqlparser.test.select.SelectTest): expected:<...te_id) AS col FROM s[]> but was:<...te_id) AS col FROM s[null]>
  testFunctions(net.sf.jsqlparser.test.select.SelectTest): expected:<...HERE mytable.col = 9[]> but was:<...HERE mytable.col = 9[null]>
  testProblemFunction2(net.sf.jsqlparser.test.select.SelectTest): expected:<...sdate FROM testtable[]> but was:<...sdate FROM testtable[null]>
  testProblemFunction3(net.sf.jsqlparser.test.select.SelectTest): expected:<...(col) FROM testtable[]> but was:<...(col) FROM testtable[null]>
  testSelectOrderHaving(net.sf.jsqlparser.test.select.SelectTest): expected:<...ts) > 1 ORDER BY num[]> but was:<...ts) > 1 ORDER BY num[null]>
  testAnalyticFunction12(net.sf.jsqlparser.test.select.SelectTest): expected:<...RDER BY c) FROM tab1[]> but was:<...RDER BY c) FROM tab1[null]>
  testAnalyticFunction13(net.sf.jsqlparser.test.select.SelectTest): expected:<...a) OVER () FROM tab1[]> but was:<...a) OVER () FROM tab1[null]>
  testAnalyticFunction14(net.sf.jsqlparser.test.select.SelectTest): expected:<...ION BY b ) FROM tab1[]> but was:<...ION BY b ) FROM tab1[null]>
  testAnalyticFunction15(net.sf.jsqlparser.test.select.SelectTest): expected:<...RDER BY c) FROM tab1[]> but was:<...RDER BY c) FROM tab1[null]>
  testAnalyticFunction16(net.sf.jsqlparser.test.select.SelectTest): expected:<...LLS FIRST) FROM tab1[]> but was:<...LLS FIRST) FROM tab1[null]>
  testAnalyticFunction17(net.sf.jsqlparser.test.select.SelectTest): expected:<...current_sal FROM emp[]> but was:<...current_sal FROM emp[null]>
  testAnalyticFunction18(net.sf.jsqlparser.test.select.SelectTest): expected:<...current_sal FROM emp[]> but was:<...current_sal FROM emp[null]>
  testMultiPartTableNameWithServerNameAndDatabaseNameAndSchemaName(net.sf.jsqlparser.test.select.SelectTest): expected:<...schemaName.tableName[]> but was:<...schemaName.tableName[null]>
  testBrackets(net.sf.jsqlparser.test.select.SelectTest): expected:<... [Test] FROM table_a[]> but was:<... [Test] FROM table_a[null]>
  testWithStatement(net.sf.jsqlparser.test.select.SelectTest): expected:<... mslink FROM feature[) SELECT * FROM feature WHERE mslink IN (SELECT mslink FROM test)]> but was:<... mslink FROM feature[null) SELECT * FROM feature WHERE mslink IN (SELECT mslink FROM testnull)null]>
  testIssue154_2(net.sf.jsqlparser.test.select.SelectTest): expected:<...L ORDER BY r.id DESC[]> but was:<...L ORDER BY r.id DESC[null]>
  testTimestamp(net.sf.jsqlparser.test.select.SelectTest): expected:<...-04-30 04:05:34.56'}[]> but was:<...-04-30 04:05:34.56'}[null]>
  testProblemSqlAnalytic5AggregateColumnValue(net.sf.jsqlparser.test.select.SelectTest): expected:<... () AS n FROM table1[]> but was:<... () AS n FROM table1[null]>
  testMultiPartTableNameWithColumnName(net.sf.jsqlparser.test.select.SelectTest): expected:<...nName FROM tableName[]> but was:<...nName FROM tableName[null]>
  testFunctionLeft(net.sf.jsqlparser.test.select.SelectTest): expected:<...col1, 4) FROM table1[]> but was:<...col1, 4) FROM table1[null]>
  testCharacterSetClause(net.sf.jsqlparser.test.select.SelectTest): expected:<....`nick2` IS NOT NULL[]> but was:<....`nick2` IS NOT NULL[null]>
  testComplexUnion1(net.sf.jsqlparser.test.select.SelectTest): expected:<... WHERE mytab.del = 0[) UNION (SELECT 'cde-' || coalesce(mytab2.a::varchar, '') AS a, mytab2.b, mytab2.bezeichnung AS c, 0 AS d, 0 AS e FROM mytab2 WHERE mytab2.del = 0])> but was:<... WHERE mytab.del = 0[null) UNION (SELECT 'cde-' || coalesce(mytab2.a::varchar, '') AS a, mytab2.b, mytab2.bezeichnung AS c, 0 AS d, 0 AS e FROM mytab2 WHERE mytab2.del = 0null])>
  testProblemSqlAnalytic6AggregateColumnValue(net.sf.jsqlparser.test.select.SelectTest): expected:<... a) AS n FROM table1[]> but was:<... a) AS n FROM table1[null]>
  testDistinct(net.sf.jsqlparser.test.select.SelectTest): expected:<...HERE mytable.col = 9[]> but was:<...HERE mytable.col = 9[null]>
  testMultiPartColumnNameWithSchemaNameAndTableName(net.sf.jsqlparser.test.select.SelectTest): expected:<...nName FROM tableName[]> but was:<...nName FROM tableName[null]>
  testMultiPartTableNameWithServerName(net.sf.jsqlparser.test.select.SelectTest): expected:<...nstance]...tableName[]> but was:<...nstance]...tableName[null]>
  testProblemSqlAnalytic7Count(net.sf.jsqlparser.test.select.SelectTest): expected:<... () AS n FROM table1[]> but was:<... () AS n FROM table1[null]>
  testAllColumnsFromTable(net.sf.jsqlparser.test.select.SelectTest): expected:<...ame.* FROM tableName[]> but was:<...ame.* FROM tableName[null]>
  testProblemSqlCombinedSets(net.sf.jsqlparser.test.select.SelectTest): expected:<(SELECT * FROM a[) INTERSECT (SELECT * FROM b) UNION (SELECT * FROM c])> but was:<(SELECT * FROM a[null) INTERSECT (SELECT * FROM bnull) UNION (SELECT * FROM cnull])>
  testInterval2(net.sf.jsqlparser.test.select.SelectTest): expected:<...START_TIME FROM tab1[]> but was:<...START_TIME FROM tab1[null]>
  testConcat(net.sf.jsqlparser.test.select.SelectTest): expected:<...|| b || c + 4 FROM t[]> but was:<...|| b || c + 4 FROM t[null]>
  testCount2(net.sf.jsqlparser.test.select.SelectTest): expected:<...+ col2) FROM mytable[]> but was:<...+ col2) FROM mytable[null]>
  testSignedColumns(net.sf.jsqlparser.test.select.SelectTest): expected:<...Name) FROM tableName[]> but was:<...Name) FROM tableName[null]>
  testDouble(net.sf.jsqlparser.test.select.SelectTest): expected:<...HERE mytable.col = 9[]> but was:<...HERE mytable.col = 9[null]>
  testProblemSqlMinus(net.sf.jsqlparser.test.select.SelectTest): expected:<(SELECT * FROM a[) MINUS (SELECT * FROM b])> but was:<(SELECT * FROM a[null) MINUS (SELECT * FROM bnull])>
  testExists(net.sf.jsqlparser.test.select.SelectTest): expected:<... (SELECT * FROM tab2[)]> but was:<... (SELECT * FROM tab2[null)null]>
  testMultiPartTableNameWithServerProblem(net.sf.jsqlparser.test.select.SelectTest): expected:<...dbo.t_transfer_num a[]> but was:<...dbo.t_transfer_num a[null]>
  testGroupByExpression(net.sf.jsqlparser.test.select.SelectTest): expected:<...1, col2, col1 + col2[]> but was:<...1, col2, col1 + col2[null]>
  testHaving(net.sf.jsqlparser.test.select.SelectTest): expected:<...ING MAX(tab1.b) > 56[]> but was:<...ING MAX(tab1.b) > 56[null]>
  testIssue154(net.sf.jsqlparser.test.select.SelectTest): expected:<...DER BY modified_time[]> but was:<...DER BY modified_time[null]>
  testDistinctTop(net.sf.jsqlparser.test.select.SelectTest): expected:<...HERE mytable.col = 9[]> but was:<...HERE mytable.col = 9[null]>
  testSelectUserVariable(net.sf.jsqlparser.test.select.SelectTest): expected:<SELECT @col FROM t1[]> but was:<SELECT @col FROM t1[null]>
  testIsNot2(net.sf.jsqlparser.test.select.SelectTest): expected:<... WHERE a IS NOT NULL[]> but was:<... WHERE a IS NOT NULL[null]>
  testTopWithParenthesis(net.sf.jsqlparser.test.select.SelectTest): expected:<...ias.columnName2 DESC[]> but was:<...ias.columnName2 DESC[null]>
  testSelectOracleColl(net.sf.jsqlparser.test.select.SelectTest): expected:<...L1 = lines(idx).COL1[]> but was:<...L1 = lines(idx).COL1[null]>
  testOracleJoin(net.sf.jsqlparser.test.select.SelectTest): expected:<...e1.a = tabelle2.b(+)[]> but was:<...e1.a = tabelle2.b(+)[null]>
  testPostgreSQLRegExpCaseSensitiveMatch2(net.sf.jsqlparser.test.select.SelectTest): expected:<...HERE a ~* '[help].*'[]> but was:<...HERE a ~* '[help].*'[null]>
  testPostgreSQLRegExpCaseSensitiveMatch3(net.sf.jsqlparser.test.select.SelectTest): expected:<...HERE a !~ '[help].*'[]> but was:<...HERE a !~ '[help].*'[null]>
  testPostgreSQLRegExpCaseSensitiveMatch4(net.sf.jsqlparser.test.select.SelectTest): expected:<...ERE a !~* '[help].*'[]> but was:<...ERE a !~* '[help].*'[null]>
  testRowConstructor1(net.sf.jsqlparser.test.select.SelectTest): expected:<...ROM t2 WHERE id = 10[)]> but was:<...ROM t2 WHERE id = 10[null)null]>
  testRowConstructor2(net.sf.jsqlparser.test.select.SelectTest): expected:<...ROM t2 WHERE id = 10[)]> but was:<...ROM t2 WHERE id = 10[null)null]>
  testLimit2(net.sf.jsqlparser.test.select.SelectTest): expected:<...ERE mytable.col = 9 [LIMIT ? ]OFFSET 3> but was:<...ERE mytable.col = 9 []OFFSET 3>
  testTableCrossJoin(net.sf.jsqlparser.test.select.SelectTest): expected:<...taba CROSS JOIN tabb[]> but was:<...taba CROSS JOIN tabb[null]>
  testProblemSqlAnalytic2(net.sf.jsqlparser.test.select.SelectTest): expected:<... b) AS n FROM table1[]> but was:<... b) AS n FROM table1[null]>
  testProblemSqlAnalytic3(net.sf.jsqlparser.test.select.SelectTest): expected:<... b) AS n FROM table1[]> but was:<... b) AS n FROM table1[null]>
  testProblemSqlAnalytic9CommaListPartition(net.sf.jsqlparser.test.select.SelectTest): expected:<... b) AS n FROM table1[]> but was:<... b) AS n FROM table1[null]>
  testOracleHierarchicalQuery(net.sf.jsqlparser.test.select.SelectTest): expected:<...d ORDER BY last_name[]> but was:<...d ORDER BY last_name[null]>
  testPivot1(net.sf.jsqlparser.test.select.SelectTest): expected:<...) FOR b IN ('val1'))[]> but was:<...) FOR b IN ('val1'))[null]>
  testPivot2(net.sf.jsqlparser.test.select.SelectTest): expected:<...R b IN (10, 20, 30))[]> but was:<...R b IN (10, 20, 30))[null]>
  testPivot3(net.sf.jsqlparser.test.select.SelectTest): expected:<...S d1, 20, 30 AS d3))[]> but was:<...S d1, 20, 30 AS d3))[null]>
  testPivot4(net.sf.jsqlparser.test.select.SelectTest): expected:<...R b IN (10, 20, 30))[]> but was:<...R b IN (10, 20, 30))[null]>
  testPivot5(net.sf.jsqlparser.test.select.SelectTest): expected:<...0, 'b'), (30, 'c')))[]> but was:<...0, 'b'), (30, 'c')))[null]>
  testSelectWithBrackets(net.sf.jsqlparser.test.select.SelectTest): expected:<...ELECT 1 FROM mytable[])> but was:<...ELECT 1 FROM mytable[null])>
  testAnalyticFunctionProblem1b(net.sf.jsqlparser.test.select.SelectTest): expected:<...OWING) AS col FROM s[]> but was:<...OWING) AS col FROM s[null]>
  testDeparser(net.sf.jsqlparser.test.select.SelectTest): expected:<...AND b.ITEM = 'Chair'[]> but was:<...AND b.ITEM = 'Chair'[null]>
  testPivotXmlSubquery1(net.sf.jsqlparser.test.select.SelectTest): expected:<...ode FROM customers t[) PIVOT (count(state_code) FOR state_code IN ('NY', 'CT', 'NJ', 'FL', 'MO')) ORDER BY times_purchased]> but was:<...ode FROM customers t[null) PIVOT (count(state_code) FOR state_code IN ('NY', 'CT', 'NJ', 'FL', 'MO')) ORDER BY times_purchasednull]>
  testOracleHierarchicalQuery2(net.sf.jsqlparser.test.select.SelectTest): expected:<...oyee_id = manager_id[]> but was:<...oyee_id = manager_id[null]>
  testOracleHierarchicalQuery3(net.sf.jsqlparser.test.select.SelectTest): expected:<...IBLINGS BY last_name[]> but was:<...IBLINGS BY last_name[null]>
  testOracleHierarchicalQuery4(net.sf.jsqlparser.test.select.SelectTest): expected:<...IBLINGS BY last_name[]> but was:<...IBLINGS BY last_name[null]>
  testExtractFrom1(net.sf.jsqlparser.test.select.SelectTest): expected:<...lumn) FROM testtable[]> but was:<...lumn) FROM testtable[null]>
  testExtractFrom2(net.sf.jsqlparser.test.select.SelectTest): expected:<...ow()) FROM testtable[]> but was:<...ow()) FROM testtable[null]>
  testExtractFrom3(net.sf.jsqlparser.test.select.SelectTest): expected:<...- 2)) FROM testtable[]> but was:<...- 2)) FROM testtable[null]>
  testExtractFrom4(net.sf.jsqlparser.test.select.SelectTest): expected:<...:00') FROM testtable[]> but was:<...:00') FROM testtable[null]>
  testProblemSqlAnalytic4EmptyOver(net.sf.jsqlparser.test.select.SelectTest): expected:<... () AS n FROM table1[]> but was:<... () AS n FROM table1[null]>
  testCastTypeProblem(net.sf.jsqlparser.test.select.SelectTest): expected:<...(256)) FROM tabelle1[]> but was:<...(256)) FROM tabelle1[null]>
  testSelectKeywordPercent(net.sf.jsqlparser.test.select.SelectTest): expected:<...ercent FROM MY_TABLE[]> but was:<...ercent FROM MY_TABLE[null]>
  testValues(net.sf.jsqlparser.test.select.SelectTest): expected:<... 2), (3, 4)) AS test[]> but was:<... 2), (3, 4)) AS test[null]>
  testValues6BothVariants(net.sf.jsqlparser.test.select.SelectTest): expected:<...VALUES 1, 2) AS TEST[)]> but was:<...VALUES 1, 2) AS TEST[null)null]>
  testProblemSqlExcept(net.sf.jsqlparser.test.select.SelectTest): expected:<(SELECT * FROM a[) EXCEPT (SELECT * FROM b])> but was:<(SELECT * FROM a[null) EXCEPT (SELECT * FROM bnull])>
  testMultiPartTableNameWithServerNameAndSchemaName(net.sf.jsqlparser.test.select.SelectTest): expected:<...schemaName.tableName[]> but was:<...schemaName.tableName[null]>
  testProblemSqlServer_Modulo(net.sf.jsqlparser.test.select.SelectTest): expected:<...nth' FROM test_table[]> but was:<...nth' FROM test_table[null]>
  testReservedKeyword(net.sf.jsqlparser.test.select.SelectTest): expected:<..., xml FROM tableName[]> but was:<..., xml FROM tableName[null]>
  testLimitSqlServerJdbcParameters(net.sf.jsqlparser.test.select.SelectTest): expected:<... ORDER BY mytable.id[] OFFSET ? ROWS FETCH...> but was:<... ORDER BY mytable.id[null] OFFSET ? ROWS FETCH...>
  testSelectJoin(net.sf.jsqlparser.test.select.SelectTest): expected:<...g_constraint.conname[]> but was:<...g_constraint.conname[null]>
  testSelectKeep(net.sf.jsqlparser.test.select.SelectTest): expected:<...Y col5 ORDER BY col3[]> but was:<...Y col5 ORDER BY col3[null]>
  testCaseElseAddition(net.sf.jsqlparser.test.select.SelectTest): expected:<...1 END AS d FROM dual[]> but was:<...1 END AS d FROM dual[null]>
  testNamedParameter2(net.sf.jsqlparser.test.select.SelectTest): expected:<...ram2 AND b = :param3[]> but was:<...ram2 AND b = :param3[null]>
  testBooleanFunction1(net.sf.jsqlparser.test.select.SelectTest): expected:<...HERE test_func(col1)[]> but was:<...HERE test_func(col1)[null]>
  testCastInCast2(net.sf.jsqlparser.test.select.SelectTest): expected:<...rchar) FROM tabelle1[]> but was:<...rchar) FROM tabelle1[null]>
  testNamedParameter(net.sf.jsqlparser.test.select.SelectTest): expected:<...ble WHERE b = :param[]> but was:<...ble WHERE b = :param[null]>
  testVisit_PlainSelect_concat(net.sf.jsqlparser.util.ConnectExpressionsVisitorTest): expected:<... c AS expr FROM test[]> but was:<... c AS expr FROM test[null]>
  testVisit_PlainSelect_addition(net.sf.jsqlparser.util.ConnectExpressionsVisitorTest): expected:<...S testexpr FROM test[]> but was:<...S testexpr FROM test[null]>
  testVisit_SetOperationList(net.sf.jsqlparser.util.AddAliasesVisitorTest): expected:<... + 4 AS A1 FROM test[) UNION (SELECT 7 + 8 AS A1 FROM test2])> but was:<... + 4 AS A1 FROM test[null) UNION (SELECT 7 + 8 AS A1 FROM test2null])>
  testVisit_PlainSelect(net.sf.jsqlparser.util.AddAliasesVisitorTest): expected:<...2, c AS A3 FROM test[]> but was:<...2, c AS A3 FROM test[null]>
  testVisit_PlainSelect_expression(net.sf.jsqlparser.util.AddAliasesVisitorTest): expected:<... + 4 AS A1 FROM test[]> but was:<... + 4 AS A1 FROM test[null]>
  testVisit_PlainSelect_duplicates(net.sf.jsqlparser.util.AddAliasesVisitorTest): expected:<...1, c AS A3 FROM test[]> but was:<...1, c AS A3 FROM test[null]>
  testBuildSelectFromTableAndExpressions(net.sf.jsqlparser.util.SelectUtilsTest): expected:<...CT a, b FROM mytable[]> but was:<...CT a, b FROM mytable[null]>
  testAddExpr(net.sf.jsqlparser.util.SelectUtilsTest): expected:<...CT a, b FROM mytable[]> but was:<...CT a, b FROM mytable[null]>
  testAddJoin(net.sf.jsqlparser.util.SelectUtilsTest): expected:<...IN mytable2 ON a = b[]> but was:<...IN mytable2 ON a = b[null]>
  testBuildSelectFromTable(net.sf.jsqlparser.util.SelectUtilsTest): expected:<...ELECT * FROM mytable[]> but was:<...ELECT * FROM mytable[null]>
  testBuildSelectFromTableWithGroupBy(net.sf.jsqlparser.util.SelectUtilsTest): expected:<...M mytable GROUP BY b[]> but was:<...M mytable GROUP BY b[null]>
  testBuildSelectFromTableAndParsedExpression(net.sf.jsqlparser.util.SelectUtilsTest): expected:<...b, test FROM mytable[]> but was:<...b, test FROM mytable[null]>
  testStatements(net.sf.jsqlparser.statement.StatementsTest): expected:<...ELECT * FROM mytable[;

Tests run: 353, Failures: 237, Errors: 0, Skipped: 0

[INFO] ------------------------------------------------------------------------
[INFO] BUILD FAILURE
[INFO] ------------------------------------------------------------------------
[INFO] Total time: 15.908s
[INFO] Finished at: Tue Oct 06 07:50:02 CEST 2015
[INFO] Final Memory: 23M/346M
[INFO] ------------------------------------------------------------------------
[ERROR] Failed to execute goal org.apache.maven.plugins:maven-surefire-plugin:2.10:test (default-test) on project jsqlparser: There are test failures.
[ERROR] 
[ERROR] Please refer to /home/perham/Study/Experiments/2015-10-23-ICST/LittleDarwin/Cases/JSqlParser-jsqlparser-0.9.4/target/surefire-reports for the individual test results.
[ERROR] -> [Help 1]
[ERROR] 
[ERROR] To see the full stack trace of the errors, re-run Maven with the -e switch.
[ERROR] Re-run Maven using the -X switch to enable full debug logging.
[ERROR] 
[ERROR] For more information about the errors and possible solutions, please read the following articles:
[ERROR] [Help 1] http://cwiki.apache.org/confluence/display/MAVEN/MojoFailureException
