[INFO] Scanning for projects...
[INFO]                                                                         
[INFO] ------------------------------------------------------------------------
[INFO] Building JSQLParser library 0.9.4
[INFO] ------------------------------------------------------------------------
[INFO] 
[INFO] --- javacc-maven-plugin:2.6:jjtree-javacc (javacc) @ jsqlparser ---
[INFO] Skipping - all parsers are up to date
[INFO] 
[INFO] --- license-maven-plugin:1.6:update-file-header (first) @ jsqlparser ---
[INFO] Will search files to update from root /home/perham/Study/Experiments/2015-10-23-ICST/LittleDarwin/Cases/JSqlParser-jsqlparser-0.9.4/src/main/java
[INFO]  - adding license header on file /home/perham/Study/Experiments/2015-10-23-ICST/LittleDarwin/Cases/JSqlParser-jsqlparser-0.9.4/src/main/java/net/sf/jsqlparser/statement/select/OrderByElement.java
[INFO] Scan 164 files header done in 223.669ms.
[INFO] 
 * uptodate header on 163 files.
 * add header on 1 file.
[INFO] 
[INFO] --- maven-resources-plugin:2.6:resources (default-resources) @ jsqlparser ---
[INFO] Using 'UTF-8' encoding to copy filtered resources.
[INFO] skip non existing resourceDirectory /home/perham/Study/Experiments/2015-10-23-ICST/LittleDarwin/Cases/JSqlParser-jsqlparser-0.9.4/src/main/resources
[INFO] 
[INFO] --- maven-compiler-plugin:3.3:compile (default-compile) @ jsqlparser ---
[INFO] Changes detected - recompiling the module!
[INFO] Compiling 177 source files to /home/perham/Study/Experiments/2015-10-23-ICST/LittleDarwin/Cases/JSqlParser-jsqlparser-0.9.4/target/classes
[WARNING] bootstrap class path not set in conjunction with -source 1.6
[INFO] /home/perham/Study/Experiments/2015-10-23-ICST/LittleDarwin/Cases/JSqlParser-jsqlparser-0.9.4/target/generated-sources/javacc/net/sf/jsqlparser/parser/CCJSqlParser.java: /home/perham/Study/Experiments/2015-10-23-ICST/LittleDarwin/Cases/JSqlParser-jsqlparser-0.9.4/target/generated-sources/javacc/net/sf/jsqlparser/parser/CCJSqlParser.java uses unchecked or unsafe operations.
[INFO] /home/perham/Study/Experiments/2015-10-23-ICST/LittleDarwin/Cases/JSqlParser-jsqlparser-0.9.4/target/generated-sources/javacc/net/sf/jsqlparser/parser/CCJSqlParser.java: Recompile with -Xlint:unchecked for details.
[INFO] 
[INFO] --- maven-resources-plugin:2.6:testResources (default-testResources) @ jsqlparser ---
[INFO] Using 'UTF-8' encoding to copy filtered resources.
[INFO] Copying 280 resources
[INFO] 
[INFO] --- maven-compiler-plugin:3.3:testCompile (default-testCompile) @ jsqlparser ---
[INFO] Nothing to compile - all classes are up to date
[INFO] 
[INFO] --- maven-surefire-plugin:2.10:test (default-test) @ jsqlparser ---
[INFO] Surefire report directory: /home/perham/Study/Experiments/2015-10-23-ICST/LittleDarwin/Cases/JSqlParser-jsqlparser-0.9.4/target/surefire-reports

-------------------------------------------------------
 T E S T S
-------------------------------------------------------
Running net.sf.jsqlparser.test.alter.AlterTest
Tests run: 3, Failures: 0, Errors: 0, Skipped: 0, Time elapsed: 0.056 sec
Running net.sf.jsqlparser.test.create.CreateTableTest
Tests run: 27, Failures: 0, Errors: 0, Skipped: 0, Time elapsed: 0.125 sec
Running net.sf.jsqlparser.test.create.CreateIndexTest
Tests run: 6, Failures: 0, Errors: 0, Skipped: 0, Time elapsed: 0.001 sec
Running net.sf.jsqlparser.test.create.CreateViewTest
Tests run: 8, Failures: 0, Errors: 0, Skipped: 0, Time elapsed: 0.009 sec
Running net.sf.jsqlparser.test.delete.DeleteTest
Tests run: 2, Failures: 0, Errors: 0, Skipped: 0, Time elapsed: 0.006 sec
Running net.sf.jsqlparser.test.simpleparsing.CCJSqlParserManagerTest
Tests run: 1, Failures: 0, Errors: 0, Skipped: 0, Time elapsed: 0.186 sec
Running net.sf.jsqlparser.test.drop.DropTest
Tests run: 2, Failures: 0, Errors: 0, Skipped: 0, Time elapsed: 0.001 sec
Running net.sf.jsqlparser.test.insert.InsertTest
Tests run: 15, Failures: 0, Errors: 0, Skipped: 0, Time elapsed: 0.037 sec
Running net.sf.jsqlparser.test.TestUtils
Tests run: 1, Failures: 0, Errors: 0, Skipped: 0, Time elapsed: 0 sec
Running net.sf.jsqlparser.test.update.UpdateTest
Tests run: 7, Failures: 0, Errors: 0, Skipped: 0, Time elapsed: 0.006 sec
Running net.sf.jsqlparser.test.replace.ReplaceTest
Tests run: 4, Failures: 0, Errors: 0, Skipped: 0, Time elapsed: 0 sec
Running net.sf.jsqlparser.test.select.SelectASTTest
*Statement
* Column
* Column
* Table
* Column
* Column
Tests run: 2, Failures: 0, Errors: 0, Skipped: 0, Time elapsed: 0.003 sec
Running net.sf.jsqlparser.test.select.SpecialOracleTest
Oct 06, 2015 7:42:33 AM net.sf.jsqlparser.test.select.SpecialOracleTest testAllSqlsParseDeparse
INFO: testing string01.sql
Oct 06, 2015 7:42:33 AM net.sf.jsqlparser.test.select.SpecialOracleTest testAllSqlsParseDeparse
INFO:    -> PROBLEM net.sf.jsqlparser.JSQLParserException
Oct 06, 2015 7:42:33 AM net.sf.jsqlparser.test.select.SpecialOracleTest testAllSqlsParseDeparse
INFO: testing returning01.sql
Oct 06, 2015 7:42:33 AM net.sf.jsqlparser.test.select.SpecialOracleTest testAllSqlsParseDeparse
INFO:    -> PROBLEM net.sf.jsqlparser.JSQLParserException
Oct 06, 2015 7:42:33 AM net.sf.jsqlparser.test.select.SpecialOracleTest testAllSqlsParseDeparse
INFO: testing keywordasidentifier05.sql
Oct 06, 2015 7:42:33 AM net.sf.jsqlparser.test.select.SpecialOracleTest testAllSqlsParseDeparse
INFO:    -> SUCCESS
Oct 06, 2015 7:42:33 AM net.sf.jsqlparser.test.select.SpecialOracleTest testAllSqlsParseDeparse
INFO: testing function07.sql
Oct 06, 2015 7:42:33 AM net.sf.jsqlparser.test.select.SpecialOracleTest testAllSqlsParseDeparse
INFO:    -> PROBLEM net.sf.jsqlparser.JSQLParserException
Oct 06, 2015 7:42:33 AM net.sf.jsqlparser.test.select.SpecialOracleTest testAllSqlsParseDeparse
INFO: testing cast_multiset15.sql
Oct 06, 2015 7:42:33 AM net.sf.jsqlparser.test.select.SpecialOracleTest testAllSqlsParseDeparse
INFO:    -> PROBLEM net.sf.jsqlparser.JSQLParserException
Oct 06, 2015 7:42:33 AM net.sf.jsqlparser.test.select.SpecialOracleTest testAllSqlsParseDeparse
INFO: testing interval01.sql
Oct 06, 2015 7:42:33 AM net.sf.jsqlparser.test.select.SpecialOracleTest testAllSqlsParseDeparse
INFO:    -> PROBLEM net.sf.jsqlparser.JSQLParserException
Oct 06, 2015 7:42:33 AM net.sf.jsqlparser.test.select.SpecialOracleTest testAllSqlsParseDeparse
INFO: testing analytic_query04.sql
Oct 06, 2015 7:42:33 AM net.sf.jsqlparser.test.select.SpecialOracleTest testAllSqlsParseDeparse
INFO:    -> PROBLEM net.sf.jsqlparser.JSQLParserException
Oct 06, 2015 7:42:33 AM net.sf.jsqlparser.test.select.SpecialOracleTest testAllSqlsParseDeparse
INFO: testing join10.sql
Oct 06, 2015 7:42:33 AM net.sf.jsqlparser.test.select.SpecialOracleTest testAllSqlsParseDeparse
INFO:    -> SUCCESS
Oct 06, 2015 7:42:33 AM net.sf.jsqlparser.test.select.SpecialOracleTest testAllSqlsParseDeparse
INFO: testing pivot04.sql
Oct 06, 2015 7:42:33 AM net.sf.jsqlparser.test.select.SpecialOracleTest testAllSqlsParseDeparse
INFO:    -> PROBLEM net.sf.jsqlparser.JSQLParserException
Oct 06, 2015 7:42:33 AM net.sf.jsqlparser.test.select.SpecialOracleTest testAllSqlsParseDeparse
INFO: testing condition08.sql
Oct 06, 2015 7:42:33 AM net.sf.jsqlparser.test.select.SpecialOracleTest testAllSqlsParseDeparse
INFO:    -> PROBLEM net.sf.jsqlparser.JSQLParserException
Oct 06, 2015 7:42:33 AM net.sf.jsqlparser.test.select.SpecialOracleTest testAllSqlsParseDeparse
INFO: testing function03.sql
Oct 06, 2015 7:42:33 AM net.sf.jsqlparser.test.select.SpecialOracleTest testAllSqlsParseDeparse
INFO:    -> PROBLEM net.sf.jsqlparser.JSQLParserException
Oct 06, 2015 7:42:33 AM net.sf.jsqlparser.test.select.SpecialOracleTest testAllSqlsParseDeparse
INFO: testing merge03.sql
Oct 06, 2015 7:42:33 AM net.sf.jsqlparser.test.select.SpecialOracleTest testAllSqlsParseDeparse
INFO:    -> PROBLEM net.sf.jsqlparser.JSQLParserException
Oct 06, 2015 7:42:33 AM net.sf.jsqlparser.test.select.SpecialOracleTest testAllSqlsParseDeparse
INFO: testing insert02.sql
Oct 06, 2015 7:42:33 AM net.sf.jsqlparser.test.select.SpecialOracleTest testAllSqlsParseDeparse
INFO:    -> PROBLEM net.sf.jsqlparser.JSQLParserException
Oct 06, 2015 7:42:33 AM net.sf.jsqlparser.test.select.SpecialOracleTest testAllSqlsParseDeparse
INFO: testing insert11.sql
Oct 06, 2015 7:42:33 AM net.sf.jsqlparser.test.select.SpecialOracleTest testAllSqlsParseDeparse
INFO:    -> PROBLEM net.sf.jsqlparser.JSQLParserException
Oct 06, 2015 7:42:33 AM net.sf.jsqlparser.test.select.SpecialOracleTest testAllSqlsParseDeparse
INFO: testing interval02.sql
Oct 06, 2015 7:42:33 AM net.sf.jsqlparser.test.select.SpecialOracleTest testAllSqlsParseDeparse
INFO:    -> SUCCESS
Oct 06, 2015 7:42:33 AM net.sf.jsqlparser.test.select.SpecialOracleTest testAllSqlsParseDeparse
INFO: testing cast_multiset18.sql
Oct 06, 2015 7:42:33 AM net.sf.jsqlparser.test.select.SpecialOracleTest testAllSqlsParseDeparse
INFO:    -> PROBLEM net.sf.jsqlparser.JSQLParserException
Oct 06, 2015 7:42:33 AM net.sf.jsqlparser.test.select.SpecialOracleTest testAllSqlsParseDeparse
INFO: testing query_factoring08.sql
Oct 06, 2015 7:42:33 AM net.sf.jsqlparser.test.select.SpecialOracleTest testAllSqlsParseDeparse
INFO:    -> SUCCESS
Oct 06, 2015 7:42:33 AM net.sf.jsqlparser.test.select.SpecialOracleTest testAllSqlsParseDeparse
INFO: testing condition04.sql
Oct 06, 2015 7:42:40 AM net.sf.jsqlparser.test.select.SpecialOracleTest testAllSqlsParseDeparse
INFO:    -> SUCCESS
Oct 06, 2015 7:42:40 AM net.sf.jsqlparser.test.select.SpecialOracleTest testAllSqlsParseDeparse
INFO: testing xmltable02.sql
Oct 06, 2015 7:42:40 AM net.sf.jsqlparser.test.select.SpecialOracleTest testAllSqlsParseDeparse
INFO:    -> PROBLEM net.sf.jsqlparser.JSQLParserException
Oct 06, 2015 7:42:40 AM net.sf.jsqlparser.test.select.SpecialOracleTest testAllSqlsParseDeparse
INFO: testing for_update08.sql
Oct 06, 2015 7:42:40 AM net.sf.jsqlparser.test.select.SpecialOracleTest testAllSqlsParseDeparse
INFO:    -> PROBLEM net.sf.jsqlparser.JSQLParserException
Oct 06, 2015 7:42:40 AM net.sf.jsqlparser.test.select.SpecialOracleTest testAllSqlsParseDeparse
INFO: testing for_update03.sql
Oct 06, 2015 7:42:40 AM net.sf.jsqlparser.test.select.SpecialOracleTest testAllSqlsParseDeparse
INFO:    -> SUCCESS
Oct 06, 2015 7:42:40 AM net.sf.jsqlparser.test.select.SpecialOracleTest testAllSqlsParseDeparse
INFO: testing condition06.sql
Oct 06, 2015 7:42:40 AM net.sf.jsqlparser.test.select.SpecialOracleTest testAllSqlsParseDeparse
INFO:    -> PROBLEM net.sf.jsqlparser.JSQLParserException
Oct 06, 2015 7:42:40 AM net.sf.jsqlparser.test.select.SpecialOracleTest testAllSqlsParseDeparse
INFO: testing cast_multiset29.sql
Oct 06, 2015 7:42:40 AM net.sf.jsqlparser.test.select.SpecialOracleTest testAllSqlsParseDeparse
INFO:    -> SUCCESS
Oct 06, 2015 7:42:40 AM net.sf.jsqlparser.test.select.SpecialOracleTest testAllSqlsParseDeparse
INFO: testing cast_multiset38.sql
Oct 06, 2015 7:42:40 AM net.sf.jsqlparser.test.select.SpecialOracleTest testAllSqlsParseDeparse
INFO:    -> PROBLEM net.sf.jsqlparser.JSQLParserException
Oct 06, 2015 7:42:40 AM net.sf.jsqlparser.test.select.SpecialOracleTest testAllSqlsParseDeparse
INFO: testing query_factoring09.sql
Oct 06, 2015 7:42:40 AM net.sf.jsqlparser.test.select.SpecialOracleTest testAllSqlsOnlyParse
INFO: testing comment02.sql
Oct 06, 2015 7:42:40 AM net.sf.jsqlparser.test.select.SpecialOracleTest testAllSqlsOnlyParse
INFO:    -> SUCCESS
Oct 06, 2015 7:42:40 AM net.sf.jsqlparser.test.select.SpecialOracleTest testAllSqlsOnlyParse
INFO: testing numbers02.sql
Oct 06, 2015 7:42:40 AM net.sf.jsqlparser.test.select.SpecialOracleTest testAllSqlsOnlyParse
INFO:    -> SUCCESS
Oct 06, 2015 7:42:40 AM net.sf.jsqlparser.test.select.SpecialOracleTest testAllSqlsOnlyParse
INFO: testing comment01.sql
Oct 06, 2015 7:42:40 AM net.sf.jsqlparser.test.select.SpecialOracleTest testAllSqlsOnlyParse
INFO:    -> SUCCESS
Tests run: 2, Failures: 1, Errors: 0, Skipped: 0, Time elapsed: 6.676 sec <<< FAILURE!
Running net.sf.jsqlparser.test.select.SelectTest
Tests run: 228, Failures: 39, Errors: 0, Skipped: 0, Time elapsed: 0.199 sec <<< FAILURE!
Running net.sf.jsqlparser.test.select.SpeedTest
42500 statements parsed in 7976 milliseconds
 (5328 statements per second,  0.0001877 seconds per statement )
38500 select scans for table name executed in 128 milliseconds
 (300781 select scans for table name per second,  0.0000033 seconds per select scans for table name)
Tests run: 1, Failures: 0, Errors: 0, Skipped: 0, Time elapsed: 8.106 sec
Running net.sf.jsqlparser.test.truncate.TruncateTest
Tests run: 1, Failures: 0, Errors: 0, Skipped: 0, Time elapsed: 0 sec
Running net.sf.jsqlparser.util.TablesNamesFinderTest
Tests run: 19, Failures: 0, Errors: 0, Skipped: 0, Time elapsed: 0.015 sec
Running net.sf.jsqlparser.util.ConnectExpressionsVisitorTest
Tests run: 2, Failures: 0, Errors: 0, Skipped: 0, Time elapsed: 0.002 sec
Running net.sf.jsqlparser.util.AddAliasesVisitorTest
Tests run: 4, Failures: 0, Errors: 0, Skipped: 0, Time elapsed: 0.003 sec
Running net.sf.jsqlparser.util.SelectUtilsTest
Tests run: 6, Failures: 0, Errors: 0, Skipped: 0, Time elapsed: 0.003 sec
Running net.sf.jsqlparser.expression.ExpressionVisitorAdapterTest
Tests run: 2, Failures: 0, Errors: 0, Skipped: 0, Time elapsed: 0.003 sec
Running net.sf.jsqlparser.expression.SignedExpressionTest
Tests run: 1, Failures: 0, Errors: 0, Skipped: 0, Time elapsed: 0 sec
Running net.sf.jsqlparser.schema.ServerTest
Tests run: 2, Failures: 0, Errors: 0, Skipped: 0, Time elapsed: 0 sec
Running net.sf.jsqlparser.parser.CCJSqlParserUtilTest
Tests run: 3, Failures: 0, Errors: 0, Skipped: 0, Time elapsed: 0 sec
Running net.sf.jsqlparser.statement.SetStatementTest
Tests run: 1, Failures: 0, Errors: 0, Skipped: 0, Time elapsed: 0.003 sec
Running net.sf.jsqlparser.statement.AdaptersTest
Tests run: 1, Failures: 0, Errors: 0, Skipped: 0, Time elapsed: 0.002 sec
Running net.sf.jsqlparser.statement.StatementsTest
Tests run: 1, Failures: 0, Errors: 0, Skipped: 0, Time elapsed: 0 sec
Running net.sf.jsqlparser.statement.execute.ExecuteTest
Tests run: 1, Failures: 0, Errors: 0, Skipped: 0, Time elapsed: 0.001 sec

Results :

Failed tests:   testAllSqlsParseDeparse(net.sf.jsqlparser.test.select.SpecialOracleTest): expected:<...cases order by pname[]> but was:<...cases order by pname[ desc]>
  testOrderBy(net.sf.jsqlparser.test.select.SelectTest): expected:<...1.b ORDER BY tab1.a [DESC, tab1.b A]SC> but was:<...1.b ORDER BY tab1.a [ASC, tab1.b DE]SC>
  testFirst(net.sf.jsqlparser.test.select.SelectTest): expected:<...Y alias.columnName2 [DE]SC> but was:<...Y alias.columnName2 [A]SC>
  testSkip(net.sf.jsqlparser.test.select.SelectTest): expected:<...Y alias.columnName2 [DE]SC> but was:<...Y alias.columnName2 [A]SC>
  testProblemSqlAnalytic8Complex(net.sf.jsqlparser.test.select.SelectTest): expected:<... ID < 60 ORDER BY ID[]> but was:<... ID < 60 ORDER BY ID[ DESC]>
  testOrderByNullsFirst(net.sf.jsqlparser.test.select.SelectTest): expected:<...ROM tab1 ORDER BY a []NULLS FIRST> but was:<...ROM tab1 ORDER BY a [DESC ]NULLS FIRST>
  testProblemSqlAnalytic(net.sf.jsqlparser.test.select.SelectTest): expected:<...r() OVER (ORDER BY a[]) AS n FROM table1> but was:<...r() OVER (ORDER BY a[ DESC]) AS n FROM table1>
  testFirstWithKeywordLimit(net.sf.jsqlparser.test.select.SelectTest): expected:<...Y alias.columnName2 [DE]SC> but was:<...Y alias.columnName2 [A]SC>
  testGroupConcat(net.sf.jsqlparser.test.select.SelectTest): expected:<...ORDER BY test_score [DE]SC SEPARATOR ' ') FR...> but was:<...ORDER BY test_score [A]SC SEPARATOR ' ') FR...>
  testSelectKeepOver(net.sf.jsqlparser.test.select.SelectTest): expected:<...ER BY commission_pct[) OVER (PARTITION BY department_id ) "Worst" FROM employees ORDER BY department_id, salary]> but was:<...ER BY commission_pct[ DESC) OVER (PARTITION BY department_id ) "Worst" FROM employees ORDER BY department_id DESC, salary DESC]>
  testLimitSqlServer1(net.sf.jsqlparser.test.select.SelectTest): expected:<...ORDER BY mytable.id []OFFSET 3 ROWS FETCH ...> but was:<...ORDER BY mytable.id [DESC ]OFFSET 3 ROWS FETCH ...>
  testLimitSqlServer2(net.sf.jsqlparser.test.select.SelectTest): expected:<...ORDER BY mytable.id []OFFSET 3 ROW FETCH F...> but was:<...ORDER BY mytable.id [DESC ]OFFSET 3 ROW FETCH F...>
  testLimitSqlServer3(net.sf.jsqlparser.test.select.SelectTest): expected:<...ORDER BY mytable.id []OFFSET 3 ROWS> but was:<...ORDER BY mytable.id [DESC ]OFFSET 3 ROWS>
  testLimitSqlServer4(net.sf.jsqlparser.test.select.SelectTest): expected:<...ORDER BY mytable.id []FETCH NEXT 5 ROWS ON...> but was:<...ORDER BY mytable.id [DESC ]FETCH NEXT 5 ROWS ON...>
  testPivotFunction(net.sf.jsqlparser.test.select.SelectTest): expected:<...R BY times_purchased[])) FROM DUAL> but was:<...R BY times_purchased[ DESC])) FROM DUAL>
  testSelectWithinGroup(net.sf.jsqlparser.test.select.SelectTest): expected:<...GROUP (ORDER BY col1[]) FROM table1> but was:<...GROUP (ORDER BY col1[ DESC]) FROM table1>
  testProblemSqlAnalytic10Lag(net.sf.jsqlparser.test.select.SelectTest): expected:<...TION BY c ORDER BY a[, b]) AS n FROM table1> but was:<...TION BY c ORDER BY a[ DESC, b DESC]) AS n FROM table1>
  testProblemSqlAnalytic11Lag(net.sf.jsqlparser.test.select.SelectTest): expected:<...TION BY c ORDER BY a[, b]) AS n FROM table1> but was:<...TION BY c ORDER BY a[ DESC, b DESC]) AS n FROM table1>
  testAnalyticFunctionProblem1(net.sf.jsqlparser.test.select.SelectTest): expected:<...) ORDER BY s.date_id[]) AS col FROM s> but was:<...) ORDER BY s.date_id[ DESC]) AS col FROM s>
  testSelectOrderHaving(net.sf.jsqlparser.test.select.SelectTest): expected:<...ts) > 1 ORDER BY num[]> but was:<...ts) > 1 ORDER BY num[ DESC]>
  testAnalyticFunction12(net.sf.jsqlparser.test.select.SelectTest): expected:<...TION BY b ORDER BY c[]) FROM tab1> but was:<...TION BY b ORDER BY c[ DESC]) FROM tab1>
  testAnalyticFunction15(net.sf.jsqlparser.test.select.SelectTest): expected:<...(a) OVER (ORDER BY c[]) FROM tab1> but was:<...(a) OVER (ORDER BY c[ DESC]) FROM tab1>
  testAnalyticFunction16(net.sf.jsqlparser.test.select.SelectTest): expected:<...a) OVER (ORDER BY c []NULLS FIRST) FROM ta...> but was:<...a) OVER (ORDER BY c [DESC ]NULLS FIRST) FROM ta...>
  testAnalyticFunction17(net.sf.jsqlparser.test.select.SelectTest): expected:<...deptno ORDER BY sal []ROWS BETWEEN 0 PRECE...> but was:<...deptno ORDER BY sal [DESC ]ROWS BETWEEN 0 PRECE...>
  testAnalyticFunction18(net.sf.jsqlparser.test.select.SelectTest): expected:<...deptno ORDER BY sal []RANGE CURRENT ROW) A...> but was:<...deptno ORDER BY sal [DESC ]RANGE CURRENT ROW) A...>
  testIssue154_2(net.sf.jsqlparser.test.select.SelectTest): expected:<... NULL ORDER BY r.id [DE]SC> but was:<... NULL ORDER BY r.id [A]SC>
  testProblemSqlAnalytic6AggregateColumnValue(net.sf.jsqlparser.test.select.SelectTest): expected:<... 5) OVER (ORDER BY a[]) AS n FROM table1> but was:<... 5) OVER (ORDER BY a[ DESC]) AS n FROM table1>
  testIssue154(net.sf.jsqlparser.test.select.SelectTest): expected:<...DER BY modified_time[]> but was:<...DER BY modified_time[ DESC]>
  testTopWithParenthesis(net.sf.jsqlparser.test.select.SelectTest): expected:<...Y alias.columnName2 [DE]SC> but was:<...Y alias.columnName2 [A]SC>
  testProblemSqlAnalytic2(net.sf.jsqlparser.test.select.SelectTest): expected:<...r() OVER (ORDER BY a[, b]) AS n FROM table1> but was:<...r() OVER (ORDER BY a[ DESC, b DESC]) AS n FROM table1>
  testProblemSqlAnalytic3(net.sf.jsqlparser.test.select.SelectTest): expected:<...TION BY c ORDER BY a[, b]) AS n FROM table1> but was:<...TION BY c ORDER BY a[ DESC, b DESC]) AS n FROM table1>
  testProblemSqlAnalytic9CommaListPartition(net.sf.jsqlparser.test.select.SelectTest): expected:<...N BY c, d ORDER BY a[, b]) AS n FROM table1> but was:<...N BY c, d ORDER BY a[ DESC, b DESC]) AS n FROM table1>
  testOracleHierarchicalQuery(net.sf.jsqlparser.test.select.SelectTest): expected:<...d ORDER BY last_name[]> but was:<...d ORDER BY last_name[ DESC]>
  testAnalyticFunctionProblem1b(net.sf.jsqlparser.test.select.SelectTest): expected:<... ORDER BY s.date_id []ROWS BETWEEN UNBOUND...> but was:<... ORDER BY s.date_id [DESC ]ROWS BETWEEN UNBOUND...>
  testPivotXmlSubquery1(net.sf.jsqlparser.test.select.SelectTest): expected:<...R BY times_purchased[]> but was:<...R BY times_purchased[ DESC]>
  testOracleHierarchicalQuery3(net.sf.jsqlparser.test.select.SelectTest): expected:<...IBLINGS BY last_name[]> but was:<...IBLINGS BY last_name[ DESC]>
  testOracleHierarchicalQuery4(net.sf.jsqlparser.test.select.SelectTest): expected:<...IBLINGS BY last_name[]> but was:<...IBLINGS BY last_name[ DESC]>
  testLimitSqlServerJdbcParameters(net.sf.jsqlparser.test.select.SelectTest): expected:<...ORDER BY mytable.id []OFFSET ? ROWS FETCH ...> but was:<...ORDER BY mytable.id [DESC ]OFFSET ? ROWS FETCH ...>
  testSelectJoin(net.sf.jsqlparser.test.select.SelectTest): expected:<...g_constraint.conname[]> but was:<...g_constraint.conname[ DESC]>
  testSelectKeep(net.sf.jsqlparser.test.select.SelectTest): expected:<... FIRST ORDER BY col3[), col4 FROM table1 GROUP BY col5 ORDER BY col3]> but was:<... FIRST ORDER BY col3[ DESC), col4 FROM table1 GROUP BY col5 ORDER BY col3 DESC]>

Tests run: 353, Failures: 40, Errors: 0, Skipped: 0

[INFO] ------------------------------------------------------------------------
[INFO] BUILD FAILURE
[INFO] ------------------------------------------------------------------------
[INFO] Total time: 22.014s
[INFO] Finished at: Tue Oct 06 07:42:48 CEST 2015
[INFO] Final Memory: 22M/346M
[INFO] ------------------------------------------------------------------------
[ERROR] Failed to execute goal org.apache.maven.plugins:maven-surefire-plugin:2.10:test (default-test) on project jsqlparser: There are test failures.
[ERROR] 
[ERROR] Please refer to /home/perham/Study/Experiments/2015-10-23-ICST/LittleDarwin/Cases/JSqlParser-jsqlparser-0.9.4/target/surefire-reports for the individual test results.
[ERROR] -> [Help 1]
[ERROR] 
[ERROR] To see the full stack trace of the errors, re-run Maven with the -e switch.
[ERROR] Re-run Maven using the -X switch to enable full debug logging.
[ERROR] 
[ERROR] For more information about the errors and possible solutions, please read the following articles:
[ERROR] [Help 1] http://cwiki.apache.org/confluence/display/MAVEN/MojoFailureException
