[INFO] Scanning for projects...
[INFO]                                                                         
[INFO] ------------------------------------------------------------------------
[INFO] Building JSQLParser library 0.9.4
[INFO] ------------------------------------------------------------------------
[INFO] 
[INFO] --- javacc-maven-plugin:2.6:jjtree-javacc (javacc) @ jsqlparser ---
[INFO] Skipping - all parsers are up to date
[INFO] 
[INFO] --- license-maven-plugin:1.6:update-file-header (first) @ jsqlparser ---
[INFO] Will search files to update from root /home/perham/Study/Experiments/2015-10-23-ICST/LittleDarwin/Cases/JSqlParser-jsqlparser-0.9.4/src/main/java
[INFO]  - adding license header on file /home/perham/Study/Experiments/2015-10-23-ICST/LittleDarwin/Cases/JSqlParser-jsqlparser-0.9.4/src/main/java/net/sf/jsqlparser/statement/create/table/ColDataType.java
[INFO] Scan 164 files header done in 219.568ms.
[INFO] 
 * uptodate header on 163 files.
 * add header on 1 file.
[INFO] 
[INFO] --- maven-resources-plugin:2.6:resources (default-resources) @ jsqlparser ---
[INFO] Using 'UTF-8' encoding to copy filtered resources.
[INFO] skip non existing resourceDirectory /home/perham/Study/Experiments/2015-10-23-ICST/LittleDarwin/Cases/JSqlParser-jsqlparser-0.9.4/src/main/resources
[INFO] 
[INFO] --- maven-compiler-plugin:3.3:compile (default-compile) @ jsqlparser ---
[INFO] Changes detected - recompiling the module!
[INFO] Compiling 177 source files to /home/perham/Study/Experiments/2015-10-23-ICST/LittleDarwin/Cases/JSqlParser-jsqlparser-0.9.4/target/classes
[WARNING] bootstrap class path not set in conjunction with -source 1.6
[INFO] /home/perham/Study/Experiments/2015-10-23-ICST/LittleDarwin/Cases/JSqlParser-jsqlparser-0.9.4/target/generated-sources/javacc/net/sf/jsqlparser/parser/CCJSqlParser.java: /home/perham/Study/Experiments/2015-10-23-ICST/LittleDarwin/Cases/JSqlParser-jsqlparser-0.9.4/target/generated-sources/javacc/net/sf/jsqlparser/parser/CCJSqlParser.java uses unchecked or unsafe operations.
[INFO] /home/perham/Study/Experiments/2015-10-23-ICST/LittleDarwin/Cases/JSqlParser-jsqlparser-0.9.4/target/generated-sources/javacc/net/sf/jsqlparser/parser/CCJSqlParser.java: Recompile with -Xlint:unchecked for details.
[INFO] 
[INFO] --- maven-resources-plugin:2.6:testResources (default-testResources) @ jsqlparser ---
[INFO] Using 'UTF-8' encoding to copy filtered resources.
[INFO] Copying 280 resources
[INFO] 
[INFO] --- maven-compiler-plugin:3.3:testCompile (default-testCompile) @ jsqlparser ---
[INFO] Nothing to compile - all classes are up to date
[INFO] 
[INFO] --- maven-surefire-plugin:2.10:test (default-test) @ jsqlparser ---
[INFO] Surefire report directory: /home/perham/Study/Experiments/2015-10-23-ICST/LittleDarwin/Cases/JSqlParser-jsqlparser-0.9.4/target/surefire-reports

-------------------------------------------------------
 T E S T S
-------------------------------------------------------
Running net.sf.jsqlparser.test.alter.AlterTest
Tests run: 3, Failures: 1, Errors: 0, Skipped: 0, Time elapsed: 0.06 sec <<< FAILURE!
Running net.sf.jsqlparser.test.create.CreateTableTest
Tests run: 27, Failures: 24, Errors: 0, Skipped: 0, Time elapsed: 0.086 sec <<< FAILURE!
Running net.sf.jsqlparser.test.create.CreateIndexTest
Tests run: 6, Failures: 0, Errors: 0, Skipped: 0, Time elapsed: 0 sec
Running net.sf.jsqlparser.test.create.CreateViewTest
Tests run: 8, Failures: 0, Errors: 0, Skipped: 0, Time elapsed: 0.001 sec
Running net.sf.jsqlparser.test.delete.DeleteTest
Tests run: 2, Failures: 0, Errors: 0, Skipped: 0, Time elapsed: 0.005 sec
Running net.sf.jsqlparser.test.simpleparsing.CCJSqlParserManagerTest
Tests run: 1, Failures: 0, Errors: 0, Skipped: 0, Time elapsed: 0.17 sec
Running net.sf.jsqlparser.test.drop.DropTest
Tests run: 2, Failures: 0, Errors: 0, Skipped: 0, Time elapsed: 0.001 sec
Running net.sf.jsqlparser.test.insert.InsertTest
Tests run: 15, Failures: 0, Errors: 0, Skipped: 0, Time elapsed: 0.036 sec
Running net.sf.jsqlparser.test.TestUtils
Tests run: 1, Failures: 0, Errors: 0, Skipped: 0, Time elapsed: 0 sec
Running net.sf.jsqlparser.test.update.UpdateTest
Tests run: 7, Failures: 0, Errors: 0, Skipped: 0, Time elapsed: 0.009 sec
Running net.sf.jsqlparser.test.replace.ReplaceTest
Tests run: 4, Failures: 0, Errors: 0, Skipped: 0, Time elapsed: 0.001 sec
Running net.sf.jsqlparser.test.select.SelectASTTest
*Statement
* Column
* Column
* Table
* Column
* Column
Tests run: 2, Failures: 0, Errors: 0, Skipped: 0, Time elapsed: 0.004 sec
Running net.sf.jsqlparser.test.select.SpecialOracleTest
Oct 06, 2015 7:18:37 AM net.sf.jsqlparser.test.select.SpecialOracleTest testAllSqlsParseDeparse
INFO: testing string01.sql
Oct 06, 2015 7:18:37 AM net.sf.jsqlparser.test.select.SpecialOracleTest testAllSqlsParseDeparse
INFO:    -> PROBLEM net.sf.jsqlparser.JSQLParserException
Oct 06, 2015 7:18:37 AM net.sf.jsqlparser.test.select.SpecialOracleTest testAllSqlsParseDeparse
INFO: testing returning01.sql
Oct 06, 2015 7:18:37 AM net.sf.jsqlparser.test.select.SpecialOracleTest testAllSqlsParseDeparse
INFO:    -> PROBLEM net.sf.jsqlparser.JSQLParserException
Oct 06, 2015 7:18:37 AM net.sf.jsqlparser.test.select.SpecialOracleTest testAllSqlsParseDeparse
INFO: testing keywordasidentifier05.sql
Oct 06, 2015 7:18:37 AM net.sf.jsqlparser.test.select.SpecialOracleTest testAllSqlsParseDeparse
INFO:    -> SUCCESS
Oct 06, 2015 7:18:37 AM net.sf.jsqlparser.test.select.SpecialOracleTest testAllSqlsParseDeparse
INFO: testing function07.sql
Oct 06, 2015 7:18:37 AM net.sf.jsqlparser.test.select.SpecialOracleTest testAllSqlsParseDeparse
INFO:    -> PROBLEM net.sf.jsqlparser.JSQLParserException
Oct 06, 2015 7:18:37 AM net.sf.jsqlparser.test.select.SpecialOracleTest testAllSqlsParseDeparse
INFO: testing cast_multiset15.sql
Oct 06, 2015 7:18:37 AM net.sf.jsqlparser.test.select.SpecialOracleTest testAllSqlsParseDeparse
INFO:    -> PROBLEM net.sf.jsqlparser.JSQLParserException
Oct 06, 2015 7:18:37 AM net.sf.jsqlparser.test.select.SpecialOracleTest testAllSqlsParseDeparse
INFO: testing interval01.sql
Oct 06, 2015 7:18:37 AM net.sf.jsqlparser.test.select.SpecialOracleTest testAllSqlsParseDeparse
INFO:    -> PROBLEM net.sf.jsqlparser.JSQLParserException
Oct 06, 2015 7:18:37 AM net.sf.jsqlparser.test.select.SpecialOracleTest testAllSqlsParseDeparse
INFO: testing analytic_query04.sql
Oct 06, 2015 7:18:37 AM net.sf.jsqlparser.test.select.SpecialOracleTest testAllSqlsParseDeparse
INFO:    -> PROBLEM net.sf.jsqlparser.JSQLParserException
Oct 06, 2015 7:18:37 AM net.sf.jsqlparser.test.select.SpecialOracleTest testAllSqlsParseDeparse
INFO: testing join10.sql
Oct 06, 2015 7:18:37 AM net.sf.jsqlparser.test.select.SpecialOracleTest testAllSqlsParseDeparse
INFO:    -> SUCCESS
Oct 06, 2015 7:18:37 AM net.sf.jsqlparser.test.select.SpecialOracleTest testAllSqlsParseDeparse
INFO: testing pivot04.sql
Oct 06, 2015 7:18:37 AM net.sf.jsqlparser.test.select.SpecialOracleTest testAllSqlsParseDeparse
INFO:    -> PROBLEM net.sf.jsqlparser.JSQLParserException
Oct 06, 2015 7:18:37 AM net.sf.jsqlparser.test.select.SpecialOracleTest testAllSqlsParseDeparse
INFO: testing condition08.sql
Oct 06, 2015 7:18:37 AM net.sf.jsqlparser.test.select.SpecialOracleTest testAllSqlsParseDeparse
INFO:    -> PROBLEM net.sf.jsqlparser.JSQLParserException
Oct 06, 2015 7:18:37 AM net.sf.jsqlparser.test.select.SpecialOracleTest testAllSqlsParseDeparse
INFO: testing function03.sql
Oct 06, 2015 7:18:37 AM net.sf.jsqlparser.test.select.SpecialOracleTest testAllSqlsParseDeparse
INFO:    -> PROBLEM net.sf.jsqlparser.JSQLParserException
Oct 06, 2015 7:18:37 AM net.sf.jsqlparser.test.select.SpecialOracleTest testAllSqlsParseDeparse
INFO: testing merge03.sql
Oct 06, 2015 7:18:37 AM net.sf.jsqlparser.test.select.SpecialOracleTest testAllSqlsParseDeparse
INFO:    -> PROBLEM net.sf.jsqlparser.JSQLParserException
Oct 06, 2015 7:18:37 AM net.sf.jsqlparser.test.select.SpecialOracleTest testAllSqlsParseDeparse
INFO: testing insert02.sql
Oct 06, 2015 7:18:37 AM net.sf.jsqlparser.test.select.SpecialOracleTest testAllSqlsParseDeparse
INFO:    -> PROBLEM net.sf.jsqlparser.JSQLParserException
Oct 06, 2015 7:18:37 AM net.sf.jsqlparser.test.select.SpecialOracleTest testAllSqlsParseDeparse
INFO: testing insert11.sql
Oct 06, 2015 7:18:37 AM net.sf.jsqlparser.test.select.SpecialOracleTest testAllSqlsParseDeparse
INFO:    -> PROBLEM net.sf.jsqlparser.JSQLParserException
Oct 06, 2015 7:18:37 AM net.sf.jsqlparser.test.select.SpecialOracleTest testAllSqlsParseDeparse
INFO: testing interval02.sql
Oct 06, 2015 7:18:37 AM net.sf.jsqlparser.test.select.SpecialOracleTest testAllSqlsParseDeparse
INFO:    -> SUCCESS
Oct 06, 2015 7:18:37 AM net.sf.jsqlparser.test.select.SpecialOracleTest testAllSqlsParseDeparse
INFO: testing cast_multiset18.sql
Oct 06, 2015 7:18:37 AM net.sf.jsqlparser.test.select.SpecialOracleTest testAllSqlsParseDeparse
INFO:    -> PROBLEM net.sf.jsqlparser.JSQLParserException
Oct 06, 2015 7:18:37 AM net.sf.jsqlparser.test.select.SpecialOracleTest testAllSqlsParseDeparse
INFO: testing query_factoring08.sql
Oct 06, 2015 7:18:37 AM net.sf.jsqlparser.test.select.SpecialOracleTest testAllSqlsParseDeparse
INFO:    -> SUCCESS
Oct 06, 2015 7:18:37 AM net.sf.jsqlparser.test.select.SpecialOracleTest testAllSqlsParseDeparse
INFO: testing condition04.sql
Oct 06, 2015 7:18:44 AM net.sf.jsqlparser.test.select.SpecialOracleTest testAllSqlsParseDeparse
INFO:    -> SUCCESS
Oct 06, 2015 7:18:44 AM net.sf.jsqlparser.test.select.SpecialOracleTest testAllSqlsParseDeparse
INFO: testing xmltable02.sql
Oct 06, 2015 7:18:44 AM net.sf.jsqlparser.test.select.SpecialOracleTest testAllSqlsParseDeparse
INFO:    -> PROBLEM net.sf.jsqlparser.JSQLParserException
Oct 06, 2015 7:18:44 AM net.sf.jsqlparser.test.select.SpecialOracleTest testAllSqlsParseDeparse
INFO: testing for_update08.sql
Oct 06, 2015 7:18:44 AM net.sf.jsqlparser.test.select.SpecialOracleTest testAllSqlsParseDeparse
INFO:    -> PROBLEM net.sf.jsqlparser.JSQLParserException
Oct 06, 2015 7:18:44 AM net.sf.jsqlparser.test.select.SpecialOracleTest testAllSqlsParseDeparse
INFO: testing for_update03.sql
Oct 06, 2015 7:18:44 AM net.sf.jsqlparser.test.select.SpecialOracleTest testAllSqlsParseDeparse
INFO:    -> SUCCESS
Oct 06, 2015 7:18:44 AM net.sf.jsqlparser.test.select.SpecialOracleTest testAllSqlsParseDeparse
INFO: testing condition06.sql
Oct 06, 2015 7:18:44 AM net.sf.jsqlparser.test.select.SpecialOracleTest testAllSqlsParseDeparse
INFO:    -> PROBLEM net.sf.jsqlparser.JSQLParserException
Oct 06, 2015 7:18:44 AM net.sf.jsqlparser.test.select.SpecialOracleTest testAllSqlsParseDeparse
INFO: testing cast_multiset29.sql
Oct 06, 2015 7:18:44 AM net.sf.jsqlparser.test.select.SpecialOracleTest testAllSqlsParseDeparse
INFO:    -> SUCCESS
Oct 06, 2015 7:18:44 AM net.sf.jsqlparser.test.select.SpecialOracleTest testAllSqlsParseDeparse
INFO: testing cast_multiset38.sql
Oct 06, 2015 7:18:44 AM net.sf.jsqlparser.test.select.SpecialOracleTest testAllSqlsParseDeparse
INFO:    -> PROBLEM net.sf.jsqlparser.JSQLParserException
Oct 06, 2015 7:18:44 AM net.sf.jsqlparser.test.select.SpecialOracleTest testAllSqlsParseDeparse
INFO: testing query_factoring09.sql
Oct 06, 2015 7:18:44 AM net.sf.jsqlparser.test.select.SpecialOracleTest testAllSqlsParseDeparse
INFO:    -> SUCCESS
Oct 06, 2015 7:18:44 AM net.sf.jsqlparser.test.select.SpecialOracleTest testAllSqlsParseDeparse
INFO: testing condition19.sql
Oct 06, 2015 7:18:44 AM net.sf.jsqlparser.test.select.SpecialOracleTest testAllSqlsParseDeparse
INFO:    -> PROBLEM net.sf.jsqlparser.JSQLParserException
Oct 06, 2015 7:18:44 AM net.sf.jsqlparser.test.select.SpecialOracleTest testAllSqlsParseDeparse
INFO: testing union02.sql
Oct 06, 2015 7:18:44 AM net.sf.jsqlparser.test.select.SpecialOracleTest testAllSqlsParseDeparse
INFO:    -> SUCCESS
Oct 06, 2015 7:18:44 AM net.sf.jsqlparser.test.select.SpecialOracleTest testAllSqlsParseDeparse
INFO: testing groupby22.sql
Oct 06, 2015 7:18:44 AM net.sf.jsqlparser.test.select.SpecialOracleTest testAllSqlsParseDeparse
INFO:    -> SUCCESS
Oct 06, 2015 7:18:44 AM net.sf.jsqlparser.test.select.SpecialOracleTest testAllSqlsParseDeparse
INFO: testing set02.sql
Oct 06, 2015 7:18:44 AM net.sf.jsqlparser.test.select.SpecialOracleTest testAllSqlsParseDeparse
INFO:    -> PROBLEM net.sf.jsqlparser.JSQLParserException
Oct 06, 2015 7:18:44 AM net.sf.jsqlparser.test.select.SpecialOracleTest testAllSqlsParseDeparse
INFO: testing cast_multiset10.sql
Oct 06, 2015 7:18:44 AM net.sf.jsqlparser.test.select.SpecialOracleTest testAllSqlsParseDeparse
INFO:    -> SUCCESS
Oct 06, 2015 7:18:44 AM net.sf.jsqlparser.test.select.SpecialOracleTest testAllSqlsParseDeparse
INFO: testing simple06.sql
Oct 06, 2015 7:18:44 AM net.sf.jsqlparser.test.select.SpecialOracleTest testAllSqlsParseDeparse
INFO:    -> SUCCESS
Oct 06, 2015 7:18:44 AM net.sf.jsqlparser.test.select.SpecialOracleTest testAllSqlsParseDeparse
INFO: testing groupby12.sql
Oct 06, 2015 7:18:44 AM net.sf.jsqlparser.test.select.SpecialOracleTest testAllSqlsParseDeparse
INFO:    -> SUCCESS
Oct 06, 2015 7:18:44 AM net.sf.jsqlparser.test.select.SpecialOracleTest testAllSqlsParseDeparse
INFO: testing join07.sql
Oct 06, 2015 7:18:44 AM net.sf.jsqlparser.test.select.SpecialOracleTest testAllSqlsParseDeparse
INFO:    -> SUCCESS
Oct 06, 2015 7:18:44 AM net.sf.jsqlparser.test.select.SpecialOracleTest testAllSqlsParseDeparse
INFO: testing cast_multiset06.sql
Oct 06, 2015 7:18:44 AM net.sf.jsqlparser.test.select.SpecialOracleTest testAllSqlsParseDeparse
INFO:    -> SUCCESS
Oct 06, 2015 7:18:44 AM net.sf.jsqlparser.test.select.SpecialOracleTest testAllSqlsParseDeparse
INFO: testing bindvar04.sql
Oct 06, 2015 7:18:44 AM net.sf.jsqlparser.test.select.SpecialOracleTest testAllSqlsParseDeparse
INFO:    -> PROBLEM net.sf.jsqlparser.JSQLParserException
Oct 06, 2015 7:18:44 AM net.sf.jsqlparser.test.select.SpecialOracleTest testAllSqlsParseDeparse
INFO: testing cast_multiset26.sql
Oct 06, 2015 7:18:44 AM net.sf.jsqlparser.test.select.SpecialOracleTest testAllSqlsParseDeparse
INFO:    -> PROBLEM net.sf.jsqlparser.JSQLParserException
Oct 06, 2015 7:18:44 AM net.sf.jsqlparser.test.select.SpecialOracleTest testAllSqlsParseDeparse
INFO: testing join17.sql
Oct 06, 2015 7:18:44 AM net.sf.jsqlparser.test.select.SpecialOracleTest testAllSqlsParseDeparse
INFO:    -> PROBLEM net.sf.jsqlparser.JSQLParserException
Oct 06, 2015 7:18:44 AM net.sf.jsqlparser.test.select.SpecialOracleTest testAllSqlsParseDeparse
INFO: testing join13.sql
Oct 06, 2015 7:18:44 AM net.sf.jsqlparser.test.select.SpecialOracleTest testAllSqlsParseDeparse
INFO:    -> PROBLEM net.sf.jsqlparser.JSQLParserException
Oct 06, 2015 7:18:44 AM net.sf.jsqlparser.test.select.SpecialOracleTest testAllSqlsParseDeparse
INFO: testing for_update05.sql
Oct 06, 2015 7:18:44 AM net.sf.jsqlparser.test.select.SpecialOracleTest testAllSqlsParseDeparse
INFO:    -> PROBLEM net.sf.jsqlparser.JSQLParserException
Oct 06, 2015 7:18:44 AM net.sf.jsqlparser.test.select.SpecialOracleTest testAllSqlsParseDeparse
INFO: testing keywordasidentifier01.sql
Oct 06, 2015 7:18:44 AM net.sf.jsqlparser.test.select.SpecialOracleTest testAllSqlsParseDeparse
INFO:    -> SUCCESS
Oct 06, 2015 7:18:44 AM net.sf.jsqlparser.test.select.SpecialOracleTest testAllSqlsParseDeparse
INFO: testing pivot05.sql
Oct 06, 2015 7:18:44 AM net.sf.jsqlparser.test.select.SpecialOracleTest testAllSqlsParseDeparse
INFO:    -> SUCCESS
Oct 06, 2015 7:18:44 AM net.sf.jsqlparser.test.select.SpecialOracleTest testAllSqlsParseDeparse
INFO: testing loop02.sql
Oct 06, 2015 7:18:44 AM net.sf.jsqlparser.test.select.SpecialOracleTest testAllSqlsParseDeparse
INFO:    -> PROBLEM net.sf.jsqlparser.JSQLParserException
Oct 06, 2015 7:18:44 AM net.sf.jsqlparser.test.select.SpecialOracleTest testAllSqlsParseDeparse
INFO: testing interval05.sql
Oct 06, 2015 7:18:44 AM net.sf.jsqlparser.test.select.SpecialOracleTest testAllSqlsParseDeparse
INFO:    -> PROBLEM net.sf.jsqlparser.JSQLParserException
Oct 06, 2015 7:18:44 AM net.sf.jsqlparser.test.select.SpecialOracleTest testAllSqlsParseDeparse
INFO: testing cast_multiset03.sql
Oct 06, 2015 7:18:44 AM net.sf.jsqlparser.test.select.SpecialOracleTest testAllSqlsParseDeparse
INFO:    -> PROBLEM net.sf.jsqlparser.JSQLParserException
Oct 06, 2015 7:18:44 AM net.sf.jsqlparser.test.select.SpecialOracleTest testAllSqlsParseDeparse
INFO: testing model_clause10.sql
Oct 06, 2015 7:18:44 AM net.sf.jsqlparser.test.select.SpecialOracleTest testAllSqlsParseDeparse
INFO:    -> PROBLEM net.sf.jsqlparser.JSQLParserException
Oct 06, 2015 7:18:44 AM net.sf.jsqlparser.test.select.SpecialOracleTest testAllSqlsParseDeparse
INFO: testing join16.sql
Oct 06, 2015 7:18:44 AM net.sf.jsqlparser.test.select.SpecialOracleTest testAllSqlsParseDeparse
INFO:    -> SUCCESS
Oct 06, 2015 7:18:44 AM net.sf.jsqlparser.test.select.SpecialOracleTest testAllSqlsParseDeparse
INFO: testing join18.sql
Oct 06, 2015 7:18:44 AM net.sf.jsqlparser.test.select.SpecialOracleTest testAllSqlsParseDeparse
INFO:    -> SUCCESS
Oct 06, 2015 7:18:44 AM net.sf.jsqlparser.test.select.SpecialOracleTest testAllSqlsParseDeparse
INFO: testing query_factoring01.sql
Oct 06, 2015 7:18:44 AM net.sf.jsqlparser.test.select.SpecialOracleTest testAllSqlsParseDeparse
INFO:    -> SUCCESS
Oct 06, 2015 7:18:44 AM net.sf.jsqlparser.test.select.SpecialOracleTest testAllSqlsParseDeparse
INFO: testing groupby14.sql
Oct 06, 2015 7:18:44 AM net.sf.jsqlparser.test.select.SpecialOracleTest testAllSqlsParseDeparse
INFO:    -> SUCCESS
Oct 06, 2015 7:18:44 AM net.sf.jsqlparser.test.select.SpecialOracleTest testAllSqlsParseDeparse
INFO: testing model_clause16.sql
Oct 06, 2015 7:18:44 AM net.sf.jsqlparser.test.select.SpecialOracleTest testAllSqlsParseDeparse
INFO:    -> PROBLEM net.sf.jsqlparser.JSQLParserException
Oct 06, 2015 7:18:44 AM net.sf.jsqlparser.test.select.SpecialOracleTest testAllSqlsParseDeparse
INFO: testing join12.sql
Oct 06, 2015 7:18:44 AM net.sf.jsqlparser.test.select.SpecialOracleTest testAllSqlsParseDeparse
INFO:    -> SUCCESS
Oct 06, 2015 7:18:44 AM net.sf.jsqlparser.test.select.SpecialOracleTest testAllSqlsParseDeparse
INFO: testing analytic_query03.sql
Oct 06, 2015 7:18:44 AM net.sf.jsqlparser.test.select.SpecialOracleTest testAllSqlsParseDeparse
INFO:    -> PROBLEM net.sf.jsqlparser.JSQLParserException
Oct 06, 2015 7:18:44 AM net.sf.jsqlparser.test.select.SpecialOracleTest testAllSqlsParseDeparse
INFO: testing cast_multiset17.sql
Oct 06, 2015 7:18:44 AM net.sf.jsqlparser.test.select.SpecialOracleTest testAllSqlsParseDeparse
INFO:    -> SUCCESS
Oct 06, 2015 7:18:44 AM net.sf.jsqlparser.test.select.SpecialOracleTest testAllSqlsParseDeparse
INFO: testing simple11.sql
Oct 06, 2015 7:18:44 AM net.sf.jsqlparser.test.select.SpecialOracleTest testAllSqlsParseDeparse
INFO:    -> SUCCESS
Oct 06, 2015 7:18:44 AM net.sf.jsqlparser.test.select.SpecialOracleTest testAllSqlsParseDeparse
INFO: testing condition02.sql
Oct 06, 2015 7:18:44 AM net.sf.jsqlparser.test.select.SpecialOracleTest testAllSqlsParseDeparse
INFO:    -> SUCCESS
Oct 06, 2015 7:18:44 AM net.sf.jsqlparser.test.select.SpecialOracleTest testAllSqlsParseDeparse
INFO: testing cast_multiset35.sql
Oct 06, 2015 7:18:44 AM net.sf.jsqlparser.test.select.SpecialOracleTest testAllSqlsParseDeparse
INFO:    -> SUCCESS
Oct 06, 2015 7:18:44 AM net.sf.jsqlparser.test.select.SpecialOracleTest testAllSqlsParseDeparse
INFO: testing merge02.sql
Oct 06, 2015 7:18:44 AM net.sf.jsqlparser.test.select.SpecialOracleTest testAllSqlsParseDeparse
INFO:    -> PROBLEM net.sf.jsqlparser.JSQLParserException
Oct 06, 2015 7:18:44 AM net.sf.jsqlparser.test.select.SpecialOracleTest testAllSqlsParseDeparse
INFO: testing cast_multiset39.sql
Oct 06, 2015 7:18:44 AM net.sf.jsqlparser.test.select.SpecialOracleTest testAllSqlsParseDeparse
INFO:    -> PROBLEM net.sf.jsqlparser.JSQLParserException
Oct 06, 2015 7:18:44 AM net.sf.jsqlparser.test.select.SpecialOracleTest testAllSqlsParseDeparse
INFO: testing for_update04.sql
Oct 06, 2015 7:18:44 AM net.sf.jsqlparser.test.select.SpecialOracleTest testAllSqlsParseDeparse
INFO:    -> PROBLEM net.sf.jsqlparser.JSQLParserException
Oct 06, 2015 7:18:44 AM net.sf.jsqlparser.test.select.SpecialOracleTest testAllSqlsParseDeparse
INFO: testing groupby08.sql
Oct 06, 2015 7:18:44 AM net.sf.jsqlparser.test.select.SpecialOracleTest testAllSqlsParseDeparse
INFO:    -> SUCCESS
Oct 06, 2015 7:18:44 AM net.sf.jsqlparser.test.select.SpecialOracleTest testAllSqlsParseDeparse
INFO: testing bindvar03.sql
Oct 06, 2015 7:18:44 AM net.sf.jsqlparser.test.select.SpecialOracleTest testAllSqlsParseDeparse
INFO:    -> PROBLEM net.sf.jsqlparser.JSQLParserException
Oct 06, 2015 7:18:44 AM net.sf.jsqlparser.test.select.SpecialOracleTest testAllSqlsParseDeparse
INFO: testing simple03.sql
Oct 06, 2015 7:18:44 AM net.sf.jsqlparser.test.select.SpecialOracleTest testAllSqlsParseDeparse
INFO:    -> SUCCESS
Oct 06, 2015 7:18:44 AM net.sf.jsqlparser.test.select.SpecialOracleTest testAllSqlsParseDeparse
INFO: testing keywordasidentifier03.sql
Oct 06, 2015 7:18:44 AM net.sf.jsqlparser.test.select.SpecialOracleTest testAllSqlsParseDeparse
INFO:    -> SUCCESS
Oct 06, 2015 7:18:44 AM net.sf.jsqlparser.test.select.SpecialOracleTest testAllSqlsParseDeparse
INFO: testing simple12.sql
Oct 06, 2015 7:18:44 AM net.sf.jsqlparser.test.select.SpecialOracleTest testAllSqlsParseDeparse
INFO:    -> SUCCESS
Oct 06, 2015 7:18:44 AM net.sf.jsqlparser.test.select.SpecialOracleTest testAllSqlsParseDeparse
INFO: testing cast_multiset30.sql
Oct 06, 2015 7:18:44 AM net.sf.jsqlparser.test.select.SpecialOracleTest testAllSqlsParseDeparse
INFO:    -> SUCCESS
Oct 06, 2015 7:18:44 AM net.sf.jsqlparser.test.select.SpecialOracleTest testAllSqlsParseDeparse
INFO: testing simple09.sql
Oct 06, 2015 7:18:44 AM net.sf.jsqlparser.test.select.SpecialOracleTest testAllSqlsParseDeparse
INFO:    -> SUCCESS
Oct 06, 2015 7:18:44 AM net.sf.jsqlparser.test.select.SpecialOracleTest testAllSqlsParseDeparse
INFO: testing cast_multiset12.sql
Oct 06, 2015 7:18:44 AM net.sf.jsqlparser.test.select.SpecialOracleTest testAllSqlsParseDeparse
INFO:    -> PROBLEM net.sf.jsqlparser.JSQLParserException
Oct 06, 2015 7:18:44 AM net.sf.jsqlparser.test.select.SpecialOracleTest testAllSqlsParseDeparse
INFO: testing interval04.sql
Oct 06, 2015 7:18:44 AM net.sf.jsqlparser.test.select.SpecialOracleTest testAllSqlsParseDeparse
INFO:    -> SUCCESS
Oct 06, 2015 7:18:44 AM net.sf.jsqlparser.test.select.SpecialOracleTest testAllSqlsParseDeparse
INFO: testing function02.sql
Oct 06, 2015 7:18:44 AM net.sf.jsqlparser.test.select.SpecialOracleTest testAllSqlsParseDeparse
INFO:    -> SUCCESS
Oct 06, 2015 7:18:44 AM net.sf.jsqlparser.test.select.SpecialOracleTest testAllSqlsParseDeparse
INFO: testing groupby07.sql
Oct 06, 2015 7:18:44 AM net.sf.jsqlparser.test.select.SpecialOracleTest testAllSqlsParseDeparse
INFO:    -> PROBLEM net.sf.jsqlparser.JSQLParserException
Oct 06, 2015 7:18:44 AM net.sf.jsqlparser.test.select.SpecialOracleTest testAllSqlsParseDeparse
INFO: testing model_clause11.sql
Oct 06, 2015 7:18:44 AM net.sf.jsqlparser.test.select.SpecialOracleTest testAllSqlsParseDeparse
INFO:    -> PROBLEM net.sf.jsqlparser.JSQLParserException
Oct 06, 2015 7:18:44 AM net.sf.jsqlparser.test.select.SpecialOracleTest testAllSqlsParseDeparse
INFO: testing query_factoring11.sql
Oct 06, 2015 7:18:44 AM net.sf.jsqlparser.test.select.SpecialOracleTest testAllSqlsParseDeparse
INFO:    -> SUCCESS
Oct 06, 2015 7:18:44 AM net.sf.jsqlparser.test.select.SpecialOracleTest testAllSqlsParseDeparse
INFO: testing groupby21.sql
Oct 06, 2015 7:18:44 AM net.sf.jsqlparser.test.select.SpecialOracleTest testAllSqlsParseDeparse
INFO:    -> SUCCESS
Oct 06, 2015 7:18:44 AM net.sf.jsqlparser.test.select.SpecialOracleTest testAllSqlsParseDeparse
INFO: testing condition07.sql
Oct 06, 2015 7:18:44 AM net.sf.jsqlparser.test.select.SpecialOracleTest testAllSqlsParseDeparse
INFO:    -> PROBLEM net.sf.jsqlparser.JSQLParserException
Oct 06, 2015 7:18:44 AM net.sf.jsqlparser.test.select.SpecialOracleTest testAllSqlsParseDeparse
INFO: testing condition20.sql
Oct 06, 2015 7:18:44 AM net.sf.jsqlparser.test.select.SpecialOracleTest testAllSqlsParseDeparse
INFO:    -> SUCCESS
Oct 06, 2015 7:18:44 AM net.sf.jsqlparser.test.select.SpecialOracleTest testAllSqlsParseDeparse
INFO: testing analytic_query09.sql
Oct 06, 2015 7:18:44 AM net.sf.jsqlparser.test.select.SpecialOracleTest testAllSqlsParseDeparse
INFO:    -> PROBLEM net.sf.jsqlparser.JSQLParserException
Oct 06, 2015 7:18:44 AM net.sf.jsqlparser.test.select.SpecialOracleTest testAllSqlsParseDeparse
INFO: testing model_clause13.sql
Oct 06, 2015 7:18:44 AM net.sf.jsqlparser.test.select.SpecialOracleTest testAllSqlsParseDeparse
INFO:    -> PROBLEM net.sf.jsqlparser.JSQLParserException
Oct 06, 2015 7:18:44 AM net.sf.jsqlparser.test.select.SpecialOracleTest testAllSqlsParseDeparse
INFO: testing insert04.sql
Oct 06, 2015 7:18:44 AM net.sf.jsqlparser.test.select.SpecialOracleTest testAllSqlsParseDeparse
INFO:    -> PROBLEM net.sf.jsqlparser.JSQLParserException
Oct 06, 2015 7:18:44 AM net.sf.jsqlparser.test.select.SpecialOracleTest testAllSqlsParseDeparse
INFO: testing insert01.sql
Oct 06, 2015 7:18:44 AM net.sf.jsqlparser.test.select.SpecialOracleTest testAllSqlsParseDeparse
INFO:    -> PROBLEM net.sf.jsqlparser.JSQLParserException
Oct 06, 2015 7:18:44 AM net.sf.jsqlparser.test.select.SpecialOracleTest testAllSqlsParseDeparse
INFO: testing analytic_query06.sql
Oct 06, 2015 7:18:44 AM net.sf.jsqlparser.test.select.SpecialOracleTest testAllSqlsParseDeparse
INFO:    -> PROBLEM net.sf.jsqlparser.JSQLParserException
Oct 06, 2015 7:18:44 AM net.sf.jsqlparser.test.select.SpecialOracleTest testAllSqlsParseDeparse
INFO: testing cast_multiset05.sql
Oct 06, 2015 7:18:44 AM net.sf.jsqlparser.test.select.SpecialOracleTest testAllSqlsParseDeparse
INFO:    -> PROBLEM net.sf.jsqlparser.JSQLParserException
Oct 06, 2015 7:18:44 AM net.sf.jsqlparser.test.select.SpecialOracleTest testAllSqlsParseDeparse
INFO: testing cast_multiset01.sql
Oct 06, 2015 7:18:44 AM net.sf.jsqlparser.test.select.SpecialOracleTest testAllSqlsParseDeparse
INFO:    -> PROBLEM net.sf.jsqlparser.JSQLParserException
Oct 06, 2015 7:18:44 AM net.sf.jsqlparser.test.select.SpecialOracleTest testAllSqlsParseDeparse
INFO: testing insert06.sql
Oct 06, 2015 7:18:44 AM net.sf.jsqlparser.test.select.SpecialOracleTest testAllSqlsParseDeparse
INFO:    -> PROBLEM net.sf.jsqlparser.JSQLParserException
Oct 06, 2015 7:18:44 AM net.sf.jsqlparser.test.select.SpecialOracleTest testAllSqlsParseDeparse
INFO: testing insert08.sql
Oct 06, 2015 7:18:44 AM net.sf.jsqlparser.test.select.SpecialOracleTest testAllSqlsParseDeparse
INFO:    -> PROBLEM net.sf.jsqlparser.JSQLParserException
Oct 06, 2015 7:18:44 AM net.sf.jsqlparser.test.select.SpecialOracleTest testAllSqlsParseDeparse
INFO: testing keywordasidentifier02.sql
Oct 06, 2015 7:18:44 AM net.sf.jsqlparser.test.select.SpecialOracleTest testAllSqlsParseDeparse
INFO:    -> SUCCESS
Oct 06, 2015 7:18:44 AM net.sf.jsqlparser.test.select.SpecialOracleTest testAllSqlsParseDeparse
INFO: testing condition12.sql
Oct 06, 2015 7:18:44 AM net.sf.jsqlparser.test.select.SpecialOracleTest testAllSqlsParseDeparse
INFO:    -> SUCCESS
Oct 06, 2015 7:18:44 AM net.sf.jsqlparser.test.select.SpecialOracleTest testAllSqlsParseDeparse
INFO: testing pivot12.sql
Oct 06, 2015 7:18:44 AM net.sf.jsqlparser.test.select.SpecialOracleTest testAllSqlsParseDeparse
INFO:    -> PROBLEM net.sf.jsqlparser.JSQLParserException
Oct 06, 2015 7:18:44 AM net.sf.jsqlparser.test.select.SpecialOracleTest testAllSqlsParseDeparse
INFO: testing union03.sql
Oct 06, 2015 7:18:44 AM net.sf.jsqlparser.test.select.SpecialOracleTest testAllSqlsParseDeparse
INFO:    -> SUCCESS
Oct 06, 2015 7:18:44 AM net.sf.jsqlparser.test.select.SpecialOracleTest testAllSqlsParseDeparse
INFO: testing groupby17.sql
Oct 06, 2015 7:18:44 AM net.sf.jsqlparser.test.select.SpecialOracleTest testAllSqlsParseDeparse
INFO:    -> PROBLEM net.sf.jsqlparser.JSQLParserException
Oct 06, 2015 7:18:44 AM net.sf.jsqlparser.test.select.SpecialOracleTest testAllSqlsParseDeparse
INFO: testing condition14.sql
Oct 06, 2015 7:18:44 AM net.sf.jsqlparser.test.select.SpecialOracleTest testAllSqlsParseDeparse
INFO:    -> SUCCESS
Oct 06, 2015 7:18:44 AM net.sf.jsqlparser.test.select.SpecialOracleTest testAllSqlsParseDeparse
INFO: testing join20.sql
Oct 06, 2015 7:18:44 AM net.sf.jsqlparser.test.select.SpecialOracleTest testAllSqlsParseDeparse
INFO:    -> SUCCESS
Oct 06, 2015 7:18:44 AM net.sf.jsqlparser.test.select.SpecialOracleTest testAllSqlsParseDeparse
INFO: testing object_access01.sql
Oct 06, 2015 7:18:44 AM net.sf.jsqlparser.test.select.SpecialOracleTest testAllSqlsParseDeparse
INFO:    -> PROBLEM net.sf.jsqlparser.JSQLParserException
Oct 06, 2015 7:18:44 AM net.sf.jsqlparser.test.select.SpecialOracleTest testAllSqlsParseDeparse
INFO: testing groupby20.sql
Oct 06, 2015 7:18:44 AM net.sf.jsqlparser.test.select.SpecialOracleTest testAllSqlsParseDeparse
INFO:    -> SUCCESS
Oct 06, 2015 7:18:44 AM net.sf.jsqlparser.test.select.SpecialOracleTest testAllSqlsParseDeparse
INFO: testing join05.sql
Oct 06, 2015 7:18:44 AM net.sf.jsqlparser.test.select.SpecialOracleTest testAllSqlsParseDeparse
INFO:    -> PROBLEM net.sf.jsqlparser.JSQLParserException
Oct 06, 2015 7:18:44 AM net.sf.jsqlparser.test.select.SpecialOracleTest testAllSqlsParseDeparse
INFO: testing xmltable01.sql
Oct 06, 2015 7:18:44 AM net.sf.jsqlparser.test.select.SpecialOracleTest testAllSqlsParseDeparse
INFO:    -> PROBLEM net.sf.jsqlparser.JSQLParserException
Oct 06, 2015 7:18:44 AM net.sf.jsqlparser.test.select.SpecialOracleTest testAllSqlsParseDeparse
INFO: testing cast_multiset04.sql
Oct 06, 2015 7:18:44 AM net.sf.jsqlparser.test.select.SpecialOracleTest testAllSqlsParseDeparse
INFO:    -> PROBLEM net.sf.jsqlparser.JSQLParserException
Oct 06, 2015 7:18:44 AM net.sf.jsqlparser.test.select.SpecialOracleTest testAllSqlsParseDeparse
INFO: testing groupby18.sql
Oct 06, 2015 7:18:44 AM net.sf.jsqlparser.test.select.SpecialOracleTest testAllSqlsParseDeparse
INFO:    -> PROBLEM net.sf.jsqlparser.JSQLParserException
Oct 06, 2015 7:18:44 AM net.sf.jsqlparser.test.select.SpecialOracleTest testAllSqlsParseDeparse
INFO: testing cast_multiset31.sql
Oct 06, 2015 7:18:44 AM net.sf.jsqlparser.test.select.SpecialOracleTest testAllSqlsParseDeparse
INFO:    -> PROBLEM net.sf.jsqlparser.JSQLParserException
Oct 06, 2015 7:18:44 AM net.sf.jsqlparser.test.select.SpecialOracleTest testAllSqlsParseDeparse
INFO: testing groupby02.sql
Oct 06, 2015 7:18:44 AM net.sf.jsqlparser.test.select.SpecialOracleTest testAllSqlsParseDeparse
INFO:    -> PROBLEM net.sf.jsqlparser.JSQLParserException
Oct 06, 2015 7:18:44 AM net.sf.jsqlparser.test.select.SpecialOracleTest testAllSqlsParseDeparse
INFO: testing pivot07.sql
Oct 06, 2015 7:18:44 AM net.sf.jsqlparser.test.select.SpecialOracleTest testAllSqlsParseDeparse
INFO:    -> SUCCESS
Oct 06, 2015 7:18:44 AM net.sf.jsqlparser.test.select.SpecialOracleTest testAllSqlsParseDeparse
INFO: testing groupby23.sql
Oct 06, 2015 7:18:44 AM net.sf.jsqlparser.test.select.SpecialOracleTest testAllSqlsParseDeparse
INFO:    -> SUCCESS
Oct 06, 2015 7:18:44 AM net.sf.jsqlparser.test.select.SpecialOracleTest testAllSqlsParseDeparse
INFO: testing insert03.sql
Oct 06, 2015 7:18:44 AM net.sf.jsqlparser.test.select.SpecialOracleTest testAllSqlsParseDeparse
INFO:    -> PROBLEM net.sf.jsqlparser.JSQLParserException
Oct 06, 2015 7:18:44 AM net.sf.jsqlparser.test.select.SpecialOracleTest testAllSqlsParseDeparse
INFO: testing model_clause15.sql
Oct 06, 2015 7:18:44 AM net.sf.jsqlparser.test.select.SpecialOracleTest testAllSqlsParseDeparse
INFO:    -> PROBLEM net.sf.jsqlparser.JSQLParserException
Oct 06, 2015 7:18:44 AM net.sf.jsqlparser.test.select.SpecialOracleTest testAllSqlsParseDeparse
INFO: testing connect_by03.sql
Oct 06, 2015 7:18:44 AM net.sf.jsqlparser.test.select.SpecialOracleTest testAllSqlsParseDeparse
INFO:    -> SUCCESS
Oct 06, 2015 7:18:44 AM net.sf.jsqlparser.test.select.SpecialOracleTest testAllSqlsParseDeparse
INFO: testing cast_multiset07.sql
Oct 06, 2015 7:18:44 AM net.sf.jsqlparser.test.select.SpecialOracleTest testAllSqlsParseDeparse
INFO:    -> PROBLEM net.sf.jsqlparser.JSQLParserException
Oct 06, 2015 7:18:44 AM net.sf.jsqlparser.test.select.SpecialOracleTest testAllSqlsParseDeparse
INFO: testing simple08.sql
Oct 06, 2015 7:18:44 AM net.sf.jsqlparser.test.select.SpecialOracleTest testAllSqlsParseDeparse
INFO:    -> SUCCESS
Oct 06, 2015 7:18:44 AM net.sf.jsqlparser.test.select.SpecialOracleTest testAllSqlsParseDeparse
INFO: testing join08.sql
Oct 06, 2015 7:18:44 AM net.sf.jsqlparser.test.select.SpecialOracleTest testAllSqlsParseDeparse
INFO:    -> SUCCESS
Oct 06, 2015 7:18:44 AM net.sf.jsqlparser.test.select.SpecialOracleTest testAllSqlsParseDeparse
INFO: testing bindvar01.sql
Oct 06, 2015 7:18:44 AM net.sf.jsqlparser.test.select.SpecialOracleTest testAllSqlsParseDeparse
INFO:    -> SUCCESS
Oct 06, 2015 7:18:44 AM net.sf.jsqlparser.test.select.SpecialOracleTest testAllSqlsParseDeparse
INFO: testing insert09.sql
Oct 06, 2015 7:18:44 AM net.sf.jsqlparser.test.select.SpecialOracleTest testAllSqlsParseDeparse
INFO:    -> PROBLEM net.sf.jsqlparser.JSQLParserException
Oct 06, 2015 7:18:44 AM net.sf.jsqlparser.test.select.SpecialOracleTest testAllSqlsParseDeparse
INFO: testing numbers01.sql
Oct 06, 2015 7:18:44 AM net.sf.jsqlparser.test.select.SpecialOracleTest testAllSqlsParseDeparse
INFO:    -> PROBLEM net.sf.jsqlparser.JSQLParserException
Oct 06, 2015 7:18:44 AM net.sf.jsqlparser.test.select.SpecialOracleTest testAllSqlsParseDeparse
INFO: testing cast_multiset28.sql
Oct 06, 2015 7:18:44 AM net.sf.jsqlparser.test.select.SpecialOracleTest testAllSqlsParseDeparse
INFO:    -> SUCCESS
Oct 06, 2015 7:18:44 AM net.sf.jsqlparser.test.select.SpecialOracleTest testAllSqlsParseDeparse
INFO: testing bindvar05.sql
Oct 06, 2015 7:18:44 AM net.sf.jsqlparser.test.select.SpecialOracleTest testAllSqlsParseDeparse
INFO:    -> PROBLEM net.sf.jsqlparser.JSQLParserException
Oct 06, 2015 7:18:44 AM net.sf.jsqlparser.test.select.SpecialOracleTest testAllSqlsParseDeparse
INFO: testing cast_multiset32.sql
Oct 06, 2015 7:18:44 AM net.sf.jsqlparser.test.select.SpecialOracleTest testAllSqlsParseDeparse
INFO:    -> SUCCESS
Oct 06, 2015 7:18:44 AM net.sf.jsqlparser.test.select.SpecialOracleTest testAllSqlsParseDeparse
INFO: testing insert05.sql
Oct 06, 2015 7:18:44 AM net.sf.jsqlparser.test.select.SpecialOracleTest testAllSqlsParseDeparse
INFO:    -> PROBLEM net.sf.jsqlparser.JSQLParserException
Oct 06, 2015 7:18:44 AM net.sf.jsqlparser.test.select.SpecialOracleTest testAllSqlsParseDeparse
INFO: testing groupby03.sql
Oct 06, 2015 7:18:44 AM net.sf.jsqlparser.test.select.SpecialOracleTest testAllSqlsParseDeparse
INFO:    -> PROBLEM net.sf.jsqlparser.JSQLParserException
Oct 06, 2015 7:18:44 AM net.sf.jsqlparser.test.select.SpecialOracleTest testAllSqlsParseDeparse
INFO: testing groupby16.sql
Oct 06, 2015 7:18:44 AM net.sf.jsqlparser.test.select.SpecialOracleTest testAllSqlsParseDeparse
INFO:    -> PROBLEM net.sf.jsqlparser.JSQLParserException
Oct 06, 2015 7:18:44 AM net.sf.jsqlparser.test.select.SpecialOracleTest testAllSqlsParseDeparse
INFO: testing condition10.sql
Oct 06, 2015 7:18:44 AM net.sf.jsqlparser.test.select.SpecialOracleTest testAllSqlsParseDeparse
INFO:    -> SUCCESS
Oct 06, 2015 7:18:44 AM net.sf.jsqlparser.test.select.SpecialOracleTest testAllSqlsParseDeparse
INFO: testing query_factoring12.sql
Oct 06, 2015 7:18:44 AM net.sf.jsqlparser.test.select.SpecialOracleTest testAllSqlsParseDeparse
INFO:    -> SUCCESS
Oct 06, 2015 7:18:44 AM net.sf.jsqlparser.test.select.SpecialOracleTest testAllSqlsParseDeparse
INFO: testing model_clause09.sql
Oct 06, 2015 7:18:44 AM net.sf.jsqlparser.test.select.SpecialOracleTest testAllSqlsParseDeparse
INFO:    -> PROBLEM net.sf.jsqlparser.JSQLParserException
Oct 06, 2015 7:18:44 AM net.sf.jsqlparser.test.select.SpecialOracleTest testAllSqlsParseDeparse
INFO: testing insert12.sql
Oct 06, 2015 7:18:44 AM net.sf.jsqlparser.test.select.SpecialOracleTest testAllSqlsParseDeparse
INFO:    -> PROBLEM net.sf.jsqlparser.JSQLParserException
Oct 06, 2015 7:18:44 AM net.sf.jsqlparser.test.select.SpecialOracleTest testAllSqlsParseDeparse
INFO: testing explain01.sql
Oct 06, 2015 7:18:44 AM net.sf.jsqlparser.test.select.SpecialOracleTest testAllSqlsParseDeparse
INFO:    -> PROBLEM net.sf.jsqlparser.JSQLParserException
Oct 06, 2015 7:18:44 AM net.sf.jsqlparser.test.select.SpecialOracleTest testAllSqlsParseDeparse
INFO: testing model_clause12.sql
Oct 06, 2015 7:18:44 AM net.sf.jsqlparser.test.select.SpecialOracleTest testAllSqlsParseDeparse
INFO:    -> PROBLEM net.sf.jsqlparser.JSQLParserException
Oct 06, 2015 7:18:44 AM net.sf.jsqlparser.test.select.SpecialOracleTest testAllSqlsParseDeparse
INFO: testing condition05.sql
Oct 06, 2015 7:18:44 AM net.sf.jsqlparser.test.select.SpecialOracleTest testAllSqlsParseDeparse
INFO:    -> SUCCESS
Oct 06, 2015 7:18:44 AM net.sf.jsqlparser.test.select.SpecialOracleTest testAllSqlsParseDeparse
INFO: testing cast_multiset20.sql
Oct 06, 2015 7:18:44 AM net.sf.jsqlparser.test.select.SpecialOracleTest testAllSqlsParseDeparse
INFO:    -> SUCCESS
Oct 06, 2015 7:18:44 AM net.sf.jsqlparser.test.select.SpecialOracleTest testAllSqlsParseDeparse
INFO: testing groupby01.sql
Oct 06, 2015 7:18:44 AM net.sf.jsqlparser.test.select.SpecialOracleTest testAllSqlsParseDeparse
INFO:    -> PROBLEM net.sf.jsqlparser.JSQLParserException
Oct 06, 2015 7:18:44 AM net.sf.jsqlparser.test.select.SpecialOracleTest testAllSqlsParseDeparse
INFO: testing groupby06.sql
Oct 06, 2015 7:18:44 AM net.sf.jsqlparser.test.select.SpecialOracleTest testAllSqlsParseDeparse
INFO:    -> PROBLEM net.sf.jsqlparser.JSQLParserException
Oct 06, 2015 7:18:44 AM net.sf.jsqlparser.test.select.SpecialOracleTest testAllSqlsParseDeparse
INFO: testing bindvar02.sql
Oct 06, 2015 7:18:44 AM net.sf.jsqlparser.test.select.SpecialOracleTest testAllSqlsParseDeparse
INFO:    -> SUCCESS
Oct 06, 2015 7:18:44 AM net.sf.jsqlparser.test.select.SpecialOracleTest testAllSqlsParseDeparse
INFO: testing insert07.sql
Oct 06, 2015 7:18:44 AM net.sf.jsqlparser.test.select.SpecialOracleTest testAllSqlsParseDeparse
INFO:    -> PROBLEM net.sf.jsqlparser.JSQLParserException
Oct 06, 2015 7:18:44 AM net.sf.jsqlparser.test.select.SpecialOracleTest testAllSqlsParseDeparse
INFO: testing analytic_query07.sql
Oct 06, 2015 7:18:44 AM net.sf.jsqlparser.test.select.SpecialOracleTest testAllSqlsParseDeparse
INFO:    -> PROBLEM net.sf.jsqlparser.JSQLParserException
Oct 06, 2015 7:18:44 AM net.sf.jsqlparser.test.select.SpecialOracleTest testAllSqlsParseDeparse
INFO: testing for_update06.sql
Oct 06, 2015 7:18:44 AM net.sf.jsqlparser.test.select.SpecialOracleTest testAllSqlsParseDeparse
INFO:    -> PROBLEM net.sf.jsqlparser.JSQLParserException
Oct 06, 2015 7:18:44 AM net.sf.jsqlparser.test.select.SpecialOracleTest testAllSqlsParseDeparse
INFO: testing flashback01.sql
Oct 06, 2015 7:18:44 AM net.sf.jsqlparser.test.select.SpecialOracleTest testAllSqlsParseDeparse
INFO:    -> PROBLEM net.sf.jsqlparser.JSQLParserException
Oct 06, 2015 7:18:44 AM net.sf.jsqlparser.test.select.SpecialOracleTest testAllSqlsParseDeparse
INFO: testing condition09.sql
Oct 06, 2015 7:18:44 AM net.sf.jsqlparser.test.select.SpecialOracleTest testAllSqlsParseDeparse
INFO:    -> SUCCESS
Oct 06, 2015 7:18:44 AM net.sf.jsqlparser.test.select.SpecialOracleTest testAllSqlsParseDeparse
INFO: testing groupby11.sql
Oct 06, 2015 7:18:44 AM net.sf.jsqlparser.test.select.SpecialOracleTest testAllSqlsParseDeparse
INFO:    -> PROBLEM net.sf.jsqlparser.JSQLParserException
Oct 06, 2015 7:18:44 AM net.sf.jsqlparser.test.select.SpecialOracleTest testAllSqlsParseDeparse
INFO: testing groupby09.sql
Oct 06, 2015 7:18:44 AM net.sf.jsqlparser.test.select.SpecialOracleTest testAllSqlsParseDeparse
INFO:    -> SUCCESS
Oct 06, 2015 7:18:44 AM net.sf.jsqlparser.test.select.SpecialOracleTest testAllSqlsParseDeparse
INFO: testing lexer02.sql
Oct 06, 2015 7:18:44 AM net.sf.jsqlparser.test.select.SpecialOracleTest testAllSqlsParseDeparse
INFO:    -> PROBLEM net.sf.jsqlparser.JSQLParserException
Oct 06, 2015 7:18:44 AM net.sf.jsqlparser.test.select.SpecialOracleTest testAllSqlsParseDeparse
INFO: testing simple13.sql
Oct 06, 2015 7:18:44 AM net.sf.jsqlparser.test.select.SpecialOracleTest testAllSqlsParseDeparse
INFO:    -> PROBLEM net.sf.jsqlparser.JSQLParserException
Oct 06, 2015 7:18:44 AM net.sf.jsqlparser.test.select.SpecialOracleTest testAllSqlsParseDeparse
INFO: testing union10.sql
Oct 06, 2015 7:18:44 AM net.sf.jsqlparser.test.select.SpecialOracleTest testAllSqlsParseDeparse
INFO:    -> SUCCESS
Oct 06, 2015 7:18:44 AM net.sf.jsqlparser.test.select.SpecialOracleTest testAllSqlsParseDeparse
INFO: testing condition01.sql
Oct 06, 2015 7:18:44 AM net.sf.jsqlparser.test.select.SpecialOracleTest testAllSqlsParseDeparse
INFO:    -> SUCCESS
Oct 06, 2015 7:18:44 AM net.sf.jsqlparser.test.select.SpecialOracleTest testAllSqlsParseDeparse
INFO: testing connect_by01.sql
Oct 06, 2015 7:18:44 AM net.sf.jsqlparser.test.select.SpecialOracleTest testAllSqlsParseDeparse
INFO:    -> PROBLEM net.sf.jsqlparser.JSQLParserException
Oct 06, 2015 7:18:44 AM net.sf.jsqlparser.test.select.SpecialOracleTest testAllSqlsParseDeparse
INFO: testing for_update07.sql
Oct 06, 2015 7:18:44 AM net.sf.jsqlparser.test.select.SpecialOracleTest testAllSqlsParseDeparse
INFO:    -> PROBLEM net.sf.jsqlparser.JSQLParserException
Oct 06, 2015 7:18:44 AM net.sf.jsqlparser.test.select.SpecialOracleTest testAllSqlsParseDeparse
INFO: testing pivot03.sql
Oct 06, 2015 7:18:44 AM net.sf.jsqlparser.test.select.SpecialOracleTest testAllSqlsParseDeparse
INFO:    -> SUCCESS
Oct 06, 2015 7:18:44 AM net.sf.jsqlparser.test.select.SpecialOracleTest testAllSqlsParseDeparse
INFO: testing cast_multiset43.sql
Oct 06, 2015 7:18:44 AM net.sf.jsqlparser.test.select.SpecialOracleTest testAllSqlsParseDeparse
INFO:    -> SUCCESS
Oct 06, 2015 7:18:44 AM net.sf.jsqlparser.test.select.SpecialOracleTest testAllSqlsParseDeparse
INFO: testing function05.sql
Oct 06, 2015 7:18:44 AM net.sf.jsqlparser.test.select.SpecialOracleTest testAllSqlsParseDeparse
INFO:    -> PROBLEM net.sf.jsqlparser.JSQLParserException
Oct 06, 2015 7:18:44 AM net.sf.jsqlparser.test.select.SpecialOracleTest testAllSqlsParseDeparse
INFO: testing merge01.sql
Oct 06, 2015 7:18:44 AM net.sf.jsqlparser.test.select.SpecialOracleTest testAllSqlsParseDeparse
INFO:    -> PROBLEM net.sf.jsqlparser.JSQLParserException
Oct 06, 2015 7:18:44 AM net.sf.jsqlparser.test.select.SpecialOracleTest testAllSqlsParseDeparse
INFO: testing condition11.sql
Oct 06, 2015 7:18:44 AM net.sf.jsqlparser.test.select.SpecialOracleTest testAllSqlsParseDeparse
INFO:    -> PROBLEM net.sf.jsqlparser.JSQLParserException
Oct 06, 2015 7:18:44 AM net.sf.jsqlparser.test.select.SpecialOracleTest testAllSqlsParseDeparse
INFO: testing function06.sql
Oct 06, 2015 7:18:44 AM net.sf.jsqlparser.test.select.SpecialOracleTest testAllSqlsParseDeparse
INFO:    -> PROBLEM net.sf.jsqlparser.JSQLParserException
Oct 06, 2015 7:18:44 AM net.sf.jsqlparser.test.select.SpecialOracleTest testAllSqlsParseDeparse
INFO: testing union04.sql
Oct 06, 2015 7:18:44 AM net.sf.jsqlparser.test.select.SpecialOracleTest testAllSqlsParseDeparse
INFO:    -> PROBLEM net.sf.jsqlparser.JSQLParserException
Oct 06, 2015 7:18:44 AM net.sf.jsqlparser.test.select.SpecialOracleTest testAllSqlsParseDeparse
INFO: testing cast_multiset14.sql
Oct 06, 2015 7:18:44 AM net.sf.jsqlparser.test.select.SpecialOracleTest testAllSqlsParseDeparse
INFO:    -> PROBLEM net.sf.jsqlparser.JSQLParserException
Oct 06, 2015 7:18:44 AM net.sf.jsqlparser.test.select.SpecialOracleTest testAllSqlsParseDeparse
INFO: testing condition17.sql
Oct 06, 2015 7:18:44 AM net.sf.jsqlparser.test.select.SpecialOracleTest testAllSqlsParseDeparse
INFO:    -> PROBLEM net.sf.jsqlparser.JSQLParserException
Oct 06, 2015 7:18:44 AM net.sf.jsqlparser.test.select.SpecialOracleTest testAllSqlsParseDeparse
INFO: testing groupby15.sql
Oct 06, 2015 7:18:44 AM net.sf.jsqlparser.test.select.SpecialOracleTest testAllSqlsParseDeparse
INFO:    -> PROBLEM net.sf.jsqlparser.JSQLParserException
Oct 06, 2015 7:18:44 AM net.sf.jsqlparser.test.select.SpecialOracleTest testAllSqlsParseDeparse
INFO: testing model_clause06.sql
Oct 06, 2015 7:18:44 AM net.sf.jsqlparser.test.select.SpecialOracleTest testAllSqlsParseDeparse
INFO:    -> PROBLEM net.sf.jsqlparser.JSQLParserException
Oct 06, 2015 7:18:44 AM net.sf.jsqlparser.test.select.SpecialOracleTest testAllSqlsParseDeparse
INFO: testing interval03.sql
Oct 06, 2015 7:18:44 AM net.sf.jsqlparser.test.select.SpecialOracleTest testAllSqlsParseDeparse
INFO:    -> PROBLEM net.sf.jsqlparser.JSQLParserException
Oct 06, 2015 7:18:44 AM net.sf.jsqlparser.test.select.SpecialOracleTest testAllSqlsParseDeparse
INFO: testing pivot09.sql
Oct 06, 2015 7:18:44 AM net.sf.jsqlparser.test.select.SpecialOracleTest testAllSqlsParseDeparse
INFO:    -> SUCCESS
Oct 06, 2015 7:18:44 AM net.sf.jsqlparser.test.select.SpecialOracleTest testAllSqlsParseDeparse
INFO: testing query_factoring13.sql
Oct 06, 2015 7:18:44 AM net.sf.jsqlparser.test.select.SpecialOracleTest testAllSqlsParseDeparse
INFO:    -> PROBLEM net.sf.jsqlparser.JSQLParserException
Oct 06, 2015 7:18:44 AM net.sf.jsqlparser.test.select.SpecialOracleTest testAllSqlsParseDeparse
INFO: testing cast_multiset23.sql
Oct 06, 2015 7:18:44 AM net.sf.jsqlparser.test.select.SpecialOracleTest testAllSqlsParseDeparse
INFO:    -> SUCCESS
Oct 06, 2015 7:18:44 AM net.sf.jsqlparser.test.select.SpecialOracleTest testAllSqlsParseDeparse
INFO: testing join01.sql
Oct 06, 2015 7:18:44 AM net.sf.jsqlparser.test.select.SpecialOracleTest testAllSqlsParseDeparse
INFO:    -> SUCCESS
Oct 06, 2015 7:18:44 AM net.sf.jsqlparser.test.select.SpecialOracleTest testAllSqlsParseDeparse
INFO: testing cluster_set01.sql
Oct 06, 2015 7:18:44 AM net.sf.jsqlparser.test.select.SpecialOracleTest testAllSqlsParseDeparse
INFO:    -> PROBLEM net.sf.jsqlparser.JSQLParserException
Oct 06, 2015 7:18:44 AM net.sf.jsqlparser.test.select.SpecialOracleTest testAllSqlsParseDeparse
INFO: testing cast_multiset37.sql
Oct 06, 2015 7:18:44 AM net.sf.jsqlparser.test.select.SpecialOracleTest testAllSqlsParseDeparse
INFO:    -> PROBLEM net.sf.jsqlparser.JSQLParserException
Oct 06, 2015 7:18:44 AM net.sf.jsqlparser.test.select.SpecialOracleTest testAllSqlsParseDeparse
INFO: testing cast_multiset25.sql
Oct 06, 2015 7:18:44 AM net.sf.jsqlparser.test.select.SpecialOracleTest testAllSqlsParseDeparse
INFO:    -> SUCCESS
Oct 06, 2015 7:18:44 AM net.sf.jsqlparser.test.select.SpecialOracleTest testAllSqlsParseDeparse
INFO: testing function01.sql
Oct 06, 2015 7:18:44 AM net.sf.jsqlparser.test.select.SpecialOracleTest testAllSqlsParseDeparse
INFO:    -> SUCCESS
Oct 06, 2015 7:18:44 AM net.sf.jsqlparser.test.select.SpecialOracleTest testAllSqlsParseDeparse
INFO: testing condition18.sql
Oct 06, 2015 7:18:44 AM net.sf.jsqlparser.test.select.SpecialOracleTest testAllSqlsParseDeparse
INFO:    -> PROBLEM net.sf.jsqlparser.JSQLParserException
Oct 06, 2015 7:18:44 AM net.sf.jsqlparser.test.select.SpecialOracleTest testAllSqlsParseDeparse
INFO: testing join11.sql
Oct 06, 2015 7:18:44 AM net.sf.jsqlparser.test.select.SpecialOracleTest testAllSqlsParseDeparse
INFO:    -> SUCCESS
Oct 06, 2015 7:18:44 AM net.sf.jsqlparser.test.select.SpecialOracleTest testAllSqlsParseDeparse
INFO: testing model_clause14.sql
Oct 06, 2015 7:18:44 AM net.sf.jsqlparser.test.select.SpecialOracleTest testAllSqlsParseDeparse
INFO:    -> PROBLEM net.sf.jsqlparser.JSQLParserException
Oct 06, 2015 7:18:44 AM net.sf.jsqlparser.test.select.SpecialOracleTest testAllSqlsParseDeparse
INFO: testing join06.sql
Oct 06, 2015 7:18:44 AM net.sf.jsqlparser.test.select.SpecialOracleTest testAllSqlsParseDeparse
INFO:    -> SUCCESS
Oct 06, 2015 7:18:44 AM net.sf.jsqlparser.test.select.SpecialOracleTest testAllSqlsParseDeparse
INFO: testing groupby05.sql
Oct 06, 2015 7:18:44 AM net.sf.jsqlparser.test.select.SpecialOracleTest testAllSqlsParseDeparse
INFO:    -> PROBLEM net.sf.jsqlparser.JSQLParserException
Oct 06, 2015 7:18:44 AM net.sf.jsqlparser.test.select.SpecialOracleTest testAllSqlsParseDeparse
INFO: testing lexer05.sql
Oct 06, 2015 7:18:44 AM net.sf.jsqlparser.test.select.SpecialOracleTest testAllSqlsParseDeparse
INFO:    -> SUCCESS
Oct 06, 2015 7:18:44 AM net.sf.jsqlparser.test.select.SpecialOracleTest testAllSqlsParseDeparse
INFO: testing case_when04.sql
Oct 06, 2015 7:18:44 AM net.sf.jsqlparser.test.select.SpecialOracleTest testAllSqlsParseDeparse
INFO:    -> SUCCESS
Oct 06, 2015 7:18:44 AM net.sf.jsqlparser.test.select.SpecialOracleTest testAllSqlsParseDeparse
INFO: testing order_by05.sql
Oct 06, 2015 7:18:44 AM net.sf.jsqlparser.test.select.SpecialOracleTest testAllSqlsParseDeparse
INFO:    -> SUCCESS
Oct 06, 2015 7:18:44 AM net.sf.jsqlparser.test.select.SpecialOracleTest testAllSqlsParseDeparse
INFO: testing model_clause08.sql
Oct 06, 2015 7:18:44 AM net.sf.jsqlparser.test.select.SpecialOracleTest testAllSqlsParseDeparse
INFO:    -> PROBLEM net.sf.jsqlparser.JSQLParserException
Oct 06, 2015 7:18:44 AM net.sf.jsqlparser.test.select.SpecialOracleTest testAllSqlsParseDeparse
INFO: testing cast_multiset24.sql
Oct 06, 2015 7:18:44 AM net.sf.jsqlparser.test.select.SpecialOracleTest testAllSqlsParseDeparse
INFO:    -> PROBLEM net.sf.jsqlparser.JSQLParserException
Oct 06, 2015 7:18:44 AM net.sf.jsqlparser.test.select.SpecialOracleTest testAllSqlsParseDeparse
INFO: testing columns01.sql
Oct 06, 2015 7:18:44 AM net.sf.jsqlparser.test.select.SpecialOracleTest testAllSqlsParseDeparse
INFO:    -> SUCCESS
Oct 06, 2015 7:18:44 AM net.sf.jsqlparser.test.select.SpecialOracleTest testAllSqlsParseDeparse
INFO: testing query_factoring04.sql
Oct 06, 2015 7:18:44 AM net.sf.jsqlparser.test.select.SpecialOracleTest testAllSqlsParseDeparse
INFO:    -> PROBLEM net.sf.jsqlparser.JSQLParserException
Oct 06, 2015 7:18:44 AM net.sf.jsqlparser.test.select.SpecialOracleTest testAllSqlsParseDeparse
INFO: testing datetime01.sql
Oct 06, 2015 7:18:44 AM net.sf.jsqlparser.test.select.SpecialOracleTest testAllSqlsParseDeparse
INFO:    -> PROBLEM net.sf.jsqlparser.JSQLParserException
Oct 06, 2015 7:18:44 AM net.sf.jsqlparser.test.select.SpecialOracleTest testAllSqlsParseDeparse
INFO: testing pivot10.sql
Oct 06, 2015 7:18:44 AM net.sf.jsqlparser.test.select.SpecialOracleTest testAllSqlsParseDeparse
INFO:    -> PROBLEM net.sf.jsqlparser.JSQLParserException
Oct 06, 2015 7:18:44 AM net.sf.jsqlparser.test.select.SpecialOracleTest testAllSqlsParseDeparse
INFO: testing datetime04.sql
Oct 06, 2015 7:18:44 AM net.sf.jsqlparser.test.select.SpecialOracleTest testAllSqlsParseDeparse
INFO:    -> PROBLEM net.sf.jsqlparser.JSQLParserException
Oct 06, 2015 7:18:44 AM net.sf.jsqlparser.test.select.SpecialOracleTest testAllSqlsParseDeparse
INFO: testing order_by03.sql
Oct 06, 2015 7:18:44 AM net.sf.jsqlparser.test.select.SpecialOracleTest testAllSqlsParseDeparse
INFO:    -> SUCCESS
Oct 06, 2015 7:18:44 AM net.sf.jsqlparser.test.select.SpecialOracleTest testAllSqlsParseDeparse
INFO: testing groupby13.sql
Oct 06, 2015 7:18:44 AM net.sf.jsqlparser.test.select.SpecialOracleTest testAllSqlsParseDeparse
INFO:    -> PROBLEM net.sf.jsqlparser.JSQLParserException
Oct 06, 2015 7:18:44 AM net.sf.jsqlparser.test.select.SpecialOracleTest testAllSqlsParseDeparse
INFO: testing case_when05.sql
Oct 06, 2015 7:18:44 AM net.sf.jsqlparser.test.select.SpecialOracleTest testAllSqlsParseDeparse
INFO:    -> SUCCESS
Oct 06, 2015 7:18:44 AM net.sf.jsqlparser.test.select.SpecialOracleTest testAllSqlsParseDeparse
INFO: testing analytic_query02.sql
Oct 06, 2015 7:18:44 AM net.sf.jsqlparser.test.select.SpecialOracleTest testAllSqlsParseDeparse
INFO:    -> PROBLEM net.sf.jsqlparser.JSQLParserException
Oct 06, 2015 7:18:44 AM net.sf.jsqlparser.test.select.SpecialOracleTest testAllSqlsParseDeparse
INFO: testing union05.sql
Oct 06, 2015 7:18:44 AM net.sf.jsqlparser.test.select.SpecialOracleTest testAllSqlsParseDeparse
INFO:    -> SUCCESS
Oct 06, 2015 7:18:44 AM net.sf.jsqlparser.test.select.SpecialOracleTest testAllSqlsParseDeparse
INFO: testing query_factoring06.sql
Oct 06, 2015 7:18:44 AM net.sf.jsqlparser.test.select.SpecialOracleTest testAllSqlsParseDeparse
INFO:    -> SUCCESS
Oct 06, 2015 7:18:44 AM net.sf.jsqlparser.test.select.SpecialOracleTest testAllSqlsParseDeparse
INFO: testing case_when03.sql
Oct 06, 2015 7:18:44 AM net.sf.jsqlparser.test.select.SpecialOracleTest testAllSqlsParseDeparse
INFO:    -> SUCCESS
Oct 06, 2015 7:18:44 AM net.sf.jsqlparser.test.select.SpecialOracleTest testAllSqlsParseDeparse
INFO: testing cast_multiset09.sql
Oct 06, 2015 7:18:44 AM net.sf.jsqlparser.test.select.SpecialOracleTest testAllSqlsParseDeparse
INFO:    -> PROBLEM net.sf.jsqlparser.JSQLParserException
Oct 06, 2015 7:18:44 AM net.sf.jsqlparser.test.select.SpecialOracleTest testAllSqlsParseDeparse
INFO: testing cast_multiset13.sql
Oct 06, 2015 7:18:44 AM net.sf.jsqlparser.test.select.SpecialOracleTest testAllSqlsParseDeparse
INFO:    -> PROBLEM net.sf.jsqlparser.JSQLParserException
Oct 06, 2015 7:18:44 AM net.sf.jsqlparser.test.select.SpecialOracleTest testAllSqlsParseDeparse
INFO: testing simple02.sql
Oct 06, 2015 7:18:44 AM net.sf.jsqlparser.test.select.SpecialOracleTest testAllSqlsParseDeparse
INFO:    -> SUCCESS
Oct 06, 2015 7:18:44 AM net.sf.jsqlparser.test.select.SpecialOracleTest testAllSqlsParseDeparse
INFO: testing union01.sql
Oct 06, 2015 7:18:44 AM net.sf.jsqlparser.test.select.SpecialOracleTest testAllSqlsParseDeparse
INFO:    -> SUCCESS
Oct 06, 2015 7:18:44 AM net.sf.jsqlparser.test.select.SpecialOracleTest testAllSqlsParseDeparse
INFO: testing pivot08.sql
Oct 06, 2015 7:18:44 AM net.sf.jsqlparser.test.select.SpecialOracleTest testAllSqlsParseDeparse
INFO:    -> SUCCESS
Oct 06, 2015 7:18:44 AM net.sf.jsqlparser.test.select.SpecialOracleTest testAllSqlsParseDeparse
INFO: testing union09.sql
Oct 06, 2015 7:18:44 AM net.sf.jsqlparser.test.select.SpecialOracleTest testAllSqlsParseDeparse
INFO:    -> SUCCESS
Oct 06, 2015 7:18:44 AM net.sf.jsqlparser.test.select.SpecialOracleTest testAllSqlsParseDeparse
INFO: testing connect_by04.sql
Oct 06, 2015 7:18:44 AM net.sf.jsqlparser.test.select.SpecialOracleTest testAllSqlsParseDeparse
INFO:    -> SUCCESS
Oct 06, 2015 7:18:44 AM net.sf.jsqlparser.test.select.SpecialOracleTest testAllSqlsParseDeparse
INFO: testing join02.sql
Oct 06, 2015 7:18:44 AM net.sf.jsqlparser.test.select.SpecialOracleTest testAllSqlsParseDeparse
INFO:    -> SUCCESS
Oct 06, 2015 7:18:44 AM net.sf.jsqlparser.test.select.SpecialOracleTest testAllSqlsParseDeparse
INFO: testing connect_by06.sql
Oct 06, 2015 7:18:44 AM net.sf.jsqlparser.test.select.SpecialOracleTest testAllSqlsParseDeparse
INFO:    -> PROBLEM net.sf.jsqlparser.JSQLParserException
Oct 06, 2015 7:18:44 AM net.sf.jsqlparser.test.select.SpecialOracleTest testAllSqlsParseDeparse
INFO: testing datetime02.sql
Oct 06, 2015 7:18:44 AM net.sf.jsqlparser.test.select.SpecialOracleTest testAllSqlsParseDeparse
INFO:    -> SUCCESS
Oct 06, 2015 7:18:44 AM net.sf.jsqlparser.test.select.SpecialOracleTest testAllSqlsParseDeparse
INFO: testing simple04.sql
Oct 06, 2015 7:18:44 AM net.sf.jsqlparser.test.select.SpecialOracleTest testAllSqlsParseDeparse
INFO:    -> PROBLEM net.sf.jsqlparser.JSQLParserException
Oct 06, 2015 7:18:44 AM net.sf.jsqlparser.test.select.SpecialOracleTest testAllSqlsParseDeparse
INFO: testing union06.sql
Oct 06, 2015 7:18:44 AM net.sf.jsqlparser.test.select.SpecialOracleTest testAllSqlsParseDeparse
INFO:    -> SUCCESS
Oct 06, 2015 7:18:44 AM net.sf.jsqlparser.test.select.SpecialOracleTest testAllSqlsParseDeparse
INFO: testing model_clause04.sql
Oct 06, 2015 7:18:44 AM net.sf.jsqlparser.test.select.SpecialOracleTest testAllSqlsParseDeparse
INFO:    -> PROBLEM net.sf.jsqlparser.JSQLParserException
Oct 06, 2015 7:18:44 AM net.sf.jsqlparser.test.select.SpecialOracleTest testAllSqlsParseDeparse
INFO: testing cast_multiset16.sql
Oct 06, 2015 7:18:44 AM net.sf.jsqlparser.test.select.SpecialOracleTest testAllSqlsParseDeparse
INFO:    -> SUCCESS
Oct 06, 2015 7:18:44 AM net.sf.jsqlparser.test.select.SpecialOracleTest testAllSqlsParseDeparse
INFO: testing query_factoring14.sql
Oct 06, 2015 7:18:44 AM net.sf.jsqlparser.test.select.SpecialOracleTest testAllSqlsParseDeparse
INFO:    -> PROBLEM net.sf.jsqlparser.JSQLParserException
Oct 06, 2015 7:18:44 AM net.sf.jsqlparser.test.select.SpecialOracleTest testAllSqlsParseDeparse
INFO: testing connect_by02.sql
Oct 06, 2015 7:18:44 AM net.sf.jsqlparser.test.select.SpecialOracleTest testAllSqlsParseDeparse
INFO:    -> SUCCESS
Oct 06, 2015 7:18:44 AM net.sf.jsqlparser.test.select.SpecialOracleTest testAllSqlsParseDeparse
INFO: testing set01.sql
Oct 06, 2015 7:18:44 AM net.sf.jsqlparser.test.select.SpecialOracleTest testAllSqlsParseDeparse
INFO:    -> SUCCESS
Oct 06, 2015 7:18:44 AM net.sf.jsqlparser.test.select.SpecialOracleTest testAllSqlsParseDeparse
INFO: testing condition16.sql
Oct 06, 2015 7:18:44 AM net.sf.jsqlparser.test.select.SpecialOracleTest testAllSqlsParseDeparse
INFO:    -> PROBLEM net.sf.jsqlparser.JSQLParserException
Oct 06, 2015 7:18:44 AM net.sf.jsqlparser.test.select.SpecialOracleTest testAllSqlsParseDeparse
INFO: testing datetime06.sql
Oct 06, 2015 7:18:44 AM net.sf.jsqlparser.test.select.SpecialOracleTest testAllSqlsParseDeparse
INFO:    -> PROBLEM net.sf.jsqlparser.JSQLParserException
Oct 06, 2015 7:18:44 AM net.sf.jsqlparser.test.select.SpecialOracleTest testAllSqlsParseDeparse
INFO: testing keywordasidentifier04.sql
Oct 06, 2015 7:18:44 AM net.sf.jsqlparser.test.select.SpecialOracleTest testAllSqlsParseDeparse
INFO:    -> PROBLEM net.sf.jsqlparser.JSQLParserException
Oct 06, 2015 7:18:44 AM net.sf.jsqlparser.test.select.SpecialOracleTest testAllSqlsParseDeparse
INFO: testing simple10.sql
Oct 06, 2015 7:18:44 AM net.sf.jsqlparser.test.select.SpecialOracleTest testAllSqlsParseDeparse
INFO:    -> SUCCESS
Oct 06, 2015 7:18:44 AM net.sf.jsqlparser.test.select.SpecialOracleTest testAllSqlsParseDeparse
INFO: testing lexer01.sql
Oct 06, 2015 7:18:44 AM net.sf.jsqlparser.test.select.SpecialOracleTest testAllSqlsParseDeparse
INFO:    -> PROBLEM net.sf.jsqlparser.JSQLParserException
Oct 06, 2015 7:18:44 AM net.sf.jsqlparser.test.select.SpecialOracleTest testAllSqlsParseDeparse
INFO: testing pivot02.sql
Oct 06, 2015 7:18:44 AM net.sf.jsqlparser.test.select.SpecialOracleTest testAllSqlsParseDeparse
INFO:    -> SUCCESS
Oct 06, 2015 7:18:44 AM net.sf.jsqlparser.test.select.SpecialOracleTest testAllSqlsParseDeparse
INFO: testing join04.sql
Oct 06, 2015 7:18:44 AM net.sf.jsqlparser.test.select.SpecialOracleTest testAllSqlsParseDeparse
INFO:    -> SUCCESS
Oct 06, 2015 7:18:44 AM net.sf.jsqlparser.test.select.SpecialOracleTest testAllSqlsParseDeparse
INFO: testing dblink01.sql
Oct 06, 2015 7:18:44 AM net.sf.jsqlparser.test.select.SpecialOracleTest testAllSqlsParseDeparse
INFO:    -> SUCCESS
Oct 06, 2015 7:18:44 AM net.sf.jsqlparser.test.select.SpecialOracleTest testAllSqlsParseDeparse
INFO: testing union08.sql
Oct 06, 2015 7:18:44 AM net.sf.jsqlparser.test.select.SpecialOracleTest testAllSqlsParseDeparse
INFO:    -> SUCCESS
Oct 06, 2015 7:18:44 AM net.sf.jsqlparser.test.select.SpecialOracleTest testAllSqlsParseDeparse
INFO: testing connect_by05.sql
Oct 06, 2015 7:18:44 AM net.sf.jsqlparser.test.select.SpecialOracleTest testAllSqlsParseDeparse
INFO:    -> SUCCESS
Oct 06, 2015 7:18:44 AM net.sf.jsqlparser.test.select.SpecialOracleTest testAllSqlsParseDeparse
INFO: testing case_when02.sql
Oct 06, 2015 7:18:44 AM net.sf.jsqlparser.test.select.SpecialOracleTest testAllSqlsParseDeparse
INFO:    -> PROBLEM net.sf.jsqlparser.JSQLParserException
Oct 06, 2015 7:18:44 AM net.sf.jsqlparser.test.select.SpecialOracleTest testAllSqlsParseDeparse
INFO: testing analytic_query10.sql
Oct 06, 2015 7:18:44 AM net.sf.jsqlparser.test.select.SpecialOracleTest testAllSqlsParseDeparse
INFO:    -> SUCCESS
Oct 06, 2015 7:18:44 AM net.sf.jsqlparser.test.select.SpecialOracleTest testAllSqlsParseDeparse
INFO: testing query_factoring02.sql
Oct 06, 2015 7:18:44 AM net.sf.jsqlparser.test.select.SpecialOracleTest testAllSqlsOnlyParse
INFO: testing comment02.sql
Oct 06, 2015 7:18:44 AM net.sf.jsqlparser.test.select.SpecialOracleTest testAllSqlsOnlyParse
INFO:    -> SUCCESS
Oct 06, 2015 7:18:44 AM net.sf.jsqlparser.test.select.SpecialOracleTest testAllSqlsOnlyParse
INFO: testing numbers02.sql
Oct 06, 2015 7:18:44 AM net.sf.jsqlparser.test.select.SpecialOracleTest testAllSqlsOnlyParse
INFO:    -> SUCCESS
Oct 06, 2015 7:18:44 AM net.sf.jsqlparser.test.select.SpecialOracleTest testAllSqlsOnlyParse
INFO: testing comment01.sql
Oct 06, 2015 7:18:44 AM net.sf.jsqlparser.test.select.SpecialOracleTest testAllSqlsOnlyParse
INFO:    -> SUCCESS
Tests run: 2, Failures: 1, Errors: 0, Skipped: 0, Time elapsed: 7.136 sec <<< FAILURE!
Running net.sf.jsqlparser.test.select.SelectTest
Tests run: 228, Failures: 24, Errors: 0, Skipped: 0, Time elapsed: 0.193 sec <<< FAILURE!
Running net.sf.jsqlparser.test.select.SpeedTest
42500 statements parsed in 8197 milliseconds
 (5184 statements per second,  0.0001929 seconds per statement )
38500 select scans for table name executed in 131 milliseconds
 (293893 select scans for table name per second,  0.0000034 seconds per select scans for table name)
Tests run: 1, Failures: 0, Errors: 0, Skipped: 0, Time elapsed: 8.328 sec
Running net.sf.jsqlparser.test.truncate.TruncateTest
Tests run: 1, Failures: 0, Errors: 0, Skipped: 0, Time elapsed: 0 sec
Running net.sf.jsqlparser.util.TablesNamesFinderTest
Tests run: 19, Failures: 0, Errors: 0, Skipped: 0, Time elapsed: 0.014 sec
Running net.sf.jsqlparser.util.ConnectExpressionsVisitorTest
Tests run: 2, Failures: 0, Errors: 0, Skipped: 0, Time elapsed: 0.003 sec
Running net.sf.jsqlparser.util.AddAliasesVisitorTest
Tests run: 4, Failures: 0, Errors: 0, Skipped: 0, Time elapsed: 0.001 sec
Running net.sf.jsqlparser.util.SelectUtilsTest
Tests run: 6, Failures: 0, Errors: 0, Skipped: 0, Time elapsed: 0.003 sec
Running net.sf.jsqlparser.expression.ExpressionVisitorAdapterTest
Tests run: 2, Failures: 0, Errors: 0, Skipped: 0, Time elapsed: 0.003 sec
Running net.sf.jsqlparser.expression.SignedExpressionTest
Tests run: 1, Failures: 0, Errors: 0, Skipped: 0, Time elapsed: 0.001 sec
Running net.sf.jsqlparser.schema.ServerTest
Tests run: 2, Failures: 0, Errors: 0, Skipped: 0, Time elapsed: 0.001 sec
Running net.sf.jsqlparser.parser.CCJSqlParserUtilTest
Tests run: 3, Failures: 0, Errors: 0, Skipped: 0, Time elapsed: 0.001 sec
Running net.sf.jsqlparser.statement.SetStatementTest
Tests run: 1, Failures: 0, Errors: 0, Skipped: 0, Time elapsed: 0.003 sec
Running net.sf.jsqlparser.statement.AdaptersTest
Tests run: 1, Failures: 0, Errors: 0, Skipped: 0, Time elapsed: 0.001 sec
Running net.sf.jsqlparser.statement.StatementsTest
Tests run: 1, Failures: 0, Errors: 0, Skipped: 0, Time elapsed: 0.002 sec
Running net.sf.jsqlparser.statement.execute.ExecuteTest
Tests run: 1, Failures: 0, Errors: 0, Skipped: 0, Time elapsed: 0 sec

Results :

Failed tests:   testAlterTableAddColumn(net.sf.jsqlparser.test.alter.AlterTest): expected:<varchar[ (255)]> but was:<varchar[]>
  testCreateTableForeignKey(net.sf.jsqlparser.test.create.CreateTableTest): expected:<... TABLE test (id INT [UNSIGNED NOT NULL AUTO_INCREMENT, string VARCHAR (20), user_id INT] UNSIGNED, PRIMARY K...> but was:<... TABLE test (id INT [ UNSIGNED NOT NULL AUTO_INCREMENT, string VARCHAR, user_id INT ] UNSIGNED, PRIMARY K...>
  testCreateTableArrays(net.sf.jsqlparser.test.create.CreateTableTest): expected:<...E sal_emp (name text[, pay_by_quarter integer[], schedule text][][])> but was:<...E sal_emp (name text[ , pay_by_quarter integer [], schedule text ][][])>
  testCreateTable2(net.sf.jsqlparser.test.create.CreateTableTest): expected:<...ttab ("test" varchar[ (255)])> but was:<...ttab ("test" varchar[])>
  testCreateTable3(net.sf.jsqlparser.test.create.CreateTableTest): expected:<...ttab ("test" varchar[ (255), "test2" varchar (255)])> but was:<...ttab ("test" varchar[, "test2" varchar])>
  testCreateTableParams(net.sf.jsqlparser.test.create.CreateTableTest): expected:<...1 (PROCESSID VARCHAR[ (32)]) ON COMMIT PRESERVE...> but was:<...1 (PROCESSID VARCHAR[]) ON COMMIT PRESERVE...>
  testCreateTableDefault2(net.sf.jsqlparser.test.create.CreateTableTest): expected:<...ABLE T1 (id integer []default 1)> but was:<...ABLE T1 (id integer [ ]default 1)>
  testCreateTableWithKey(net.sf.jsqlparser.test.create.CreateTableTest): expected:<...y character varying [(255) ]NOT NULL)> but was:<...y character varying []NOT NULL)>
  testCreateTable(net.sf.jsqlparser.test.create.CreateTableTest): expected:<...ABLE mytab (mycol a [(10, 20) c nm g, mycol2 mypar1] mypar2 (23,323,3) a...> but was:<...ABLE mytab (mycol a [c nm g, mycol2 mypar1 ] mypar2 (23,323,3) a...>
  testCreateTablePrimaryKey(net.sf.jsqlparser.test.create.CreateTableTest): expected:<... TABLE test (id INT [UNSIGNED NOT NULL AUTO_INCREMENT, string VARCHAR (20), user_id INT] UNSIGNED, CONSTRAIN...> but was:<... TABLE test (id INT [ UNSIGNED NOT NULL AUTO_INCREMENT, string VARCHAR, user_id INT ] UNSIGNED, CONSTRAIN...>
  testCreateTableColumnValues(net.sf.jsqlparser.test.create.CreateTableTest): expected:<...ble1 (values INTEGER[])> but was:<...ble1 (values INTEGER[ ])>
  testCreateTableDefault(net.sf.jsqlparser.test.create.CreateTableTest): expected:<...ABLE T1 (id integer []default -1)> but was:<...ABLE T1 (id integer [ ]default -1)>
  testCreateTableWithRange(net.sf.jsqlparser.test.create.CreateTableTest): expected:<...me character varying[ (255), range character varying (255), start_range integer, end_range integer])> but was:<...me character varying[, range character varying, start_range integer , end_range integer ])>
  testCreateTableUniqueConstraint(net.sf.jsqlparser.test.create.CreateTableTest): expected:<...crement,uuid varchar[(255),user_id integer,sound_id integer,sound_type integer,comment_id integer,type string,tags varchar(255),created_at integer,content_id integer,sharing_note_text varchar(255)],sharing_note_create...> but was:<...crement,uuid varchar[,user_id integer,sound_id integer,sound_type integer,comment_id integer,type string,tags varchar,created_at integer,content_id integer,sharing_note_text varchar],sharing_note_create...>
  testCreateTableForeignKey2(net.sf.jsqlparser.test.create.CreateTableTest): expected:<... TABLE test (id INT [UNSIGNED NOT NULL AUTO_INCREMENT, string VARCHAR (20), user_id INT] UNSIGNED, PRIMARY K...> but was:<... TABLE test (id INT [ UNSIGNED NOT NULL AUTO_INCREMENT, string VARCHAR, user_id INT ] UNSIGNED, PRIMARY K...>
  testCreateTableForeignKey3(net.sf.jsqlparser.test.create.CreateTableTest): expected:<...ement,string varchar[(20)],user_id int unsigne...> but was:<...ement,string varchar[],user_id int unsigne...>
  testCreateTableForeignKey4(net.sf.jsqlparser.test.create.CreateTableTest): expected:<...ement,string varchar[(20)],user_id int unsigne...> but was:<...ement,string varchar[],user_id int unsigne...>
  testCreateTableWithUniqueKey(net.sf.jsqlparser.test.create.CreateTableTest): expected:<...BLE animals (id INT [NOT NULL, name VARCHAR (100)] UNIQUE KEY (id))> but was:<...BLE animals (id INT [ NOT NULL, name VARCHAR] UNIQUE KEY (id))>
  testCreateTableVeryComplex(net.sf.jsqlparser.test.create.CreateTableTest): expected:<...ta`(`meta_id` bigint[(20)unsigned not null auto_increment,`comment_id` bigint(20)unsigned not null default '0',`meta_key` varchar(255)]default null,`meta_v...> but was:<...ta`(`meta_id` bigint[ unsigned not null auto_increment,`comment_id` bigint unsigned not null default '0',`meta_key` varchar ]default null,`meta_v...>
  testCreateTableUnlogged2(net.sf.jsqlparser.test.create.CreateTableTest): expected:<...ABLE mytab (mycol a [(10, 20) c nm g, mycol2 mypar1] mypar2 (23,323,3) a...> but was:<...ABLE mytab (mycol a [c nm g, mycol2 mypar1 ] mypar2 (23,323,3) a...>
  testCreateTableColumnValue(net.sf.jsqlparser.test.create.CreateTableTest): expected:<...able1 (value INTEGER[])> but was:<...able1 (value INTEGER[ ])>
  testCreateTableInlinePrimaryKey(net.sf.jsqlparser.test.create.CreateTableTest): expected:<...BLE animals (id INT []PRIMARY KEY NOT NULL...> but was:<...BLE animals (id INT [ ]PRIMARY KEY NOT NULL...>
  testCreateTableArrays2(net.sf.jsqlparser.test.create.CreateTableTest): expected:<...E sal_emp (name text[, pay_by_quarter integer[5], schedule text][3][2])> but was:<...E sal_emp (name text[ , pay_by_quarter integer [5], schedule text ][3][2])>
  testCreateTableUnlogged(net.sf.jsqlparser.test.create.CreateTableTest): expected:<...ABLE mytab (mycol a [(10, 20) c nm g, mycol2 mypar1] mypar2 (23,323,3) a...> but was:<...ABLE mytab (mycol a [c nm g, mycol2 mypar1 ] mypar2 (23,323,3) a...>
  testCreateTableIfNotExists(net.sf.jsqlparser.test.create.CreateTableTest): expected:<...STS animals (id INT []NOT NULL)> but was:<...STS animals (id INT [ ]NOT NULL)>
  testAllSqlsParseDeparse(net.sf.jsqlparser.test.select.SpecialOracleTest): expected:<...nager_id as varchar2[(2000))from employees where employee_id=101)union all(select e.employee_id,e.last_name,e.manager_id,reportlevel+1,cast(mgr_list||','||manager_id as varchar2(2000)])from reports_to_101...> but was:<...nager_id as varchar2[)from employees where employee_id=101)union all(select e.employee_id,e.last_name,e.manager_id,reportlevel+1,cast(mgr_list||','||manager_id as varchar2])from reports_to_101...>
  testSelectBrackets2(net.sf.jsqlparser.test.select.SelectTest): expected:<..., d2)) / 2)::numeric[]> but was:<..., d2)) / 2)::numeric[ ]>
  testSelectBrackets3(net.sf.jsqlparser.test.select.SelectTest): expected:<..., d2)) / 2)::numeric[])> but was:<..., d2)) / 2)::numeric[ ])>
  testSelectBrackets4(net.sf.jsqlparser.test.select.SelectTest): expected:<...ECT (1 / 2)::numeric[]> but was:<...ECT (1 / 2)::numeric[ ]>
  testCastTypeProblem2(net.sf.jsqlparser.test.select.SelectTest): expected:<...ELECT col1::varchar []FROM tabelle1> but was:<...ELECT col1::varchar [ ]FROM tabelle1>
  testCastTypeProblem3(net.sf.jsqlparser.test.select.SelectTest): expected:<...ELECT col1::varchar [(256) ]FROM tabelle1> but was:<...ELECT col1::varchar []FROM tabelle1>
  testCastTypeProblem4(net.sf.jsqlparser.test.select.SelectTest): expected:<SELECT 5::varchar [(256) ]FROM tabelle1> but was:<SELECT 5::varchar []FROM tabelle1>
  testCastTypeProblem5(net.sf.jsqlparser.test.select.SelectTest): expected:<...ELECT 5.67::varchar [(256) ]FROM tabelle1> but was:<...ELECT 5.67::varchar []FROM tabelle1>
  testCastTypeProblem6(net.sf.jsqlparser.test.select.SelectTest): expected:<...::character varying []FROM tabelle1> but was:<...::character varying [ ]FROM tabelle1>
  testCastTypeProblem7(net.sf.jsqlparser.test.select.SelectTest): expected:<...AS character varying[]) FROM tabelle1> but was:<...AS character varying[ ]) FROM tabelle1>
  testCastInCast(net.sf.jsqlparser.test.select.SelectTest): expected:<...ST(CAST(a AS numeric[) AS varchar]) FROM tabelle1> but was:<...ST(CAST(a AS numeric[ ) AS varchar ]) FROM tabelle1>
  testCast(net.sf.jsqlparser.test.select.SelectTest): expected:<...CT CAST(a AS varchar[]) FROM tabelle1> but was:<...CT CAST(a AS varchar[ ]) FROM tabelle1>
  testConcatProblem2(net.sf.jsqlparser.test.select.SelectTest): expected:<...ERPERIODE)::VARCHAR [(2) || (VARCHAR(SPA.AANLEVERPERIODEJAAR))::VARCHAR (4)) || TO_CHAR(SPA.AANLEVERPERIODEVOLGNR, 'FM09'::VARCHAR)) || TO_CHAR((10000 - SPA.VERSCHIJNINGSVOLGNR), 'FM0999'::VARCHAR)) || (SPA.GESLACHT)::VARCHAR (1)])) AS GESLACHT_TMP F...> but was:<...ERPERIODE)::VARCHAR [|| (VARCHAR(SPA.AANLEVERPERIODEJAAR))::VARCHAR) || TO_CHAR(SPA.AANLEVERPERIODEVOLGNR, 'FM09'::VARCHAR )) || TO_CHAR((10000 - SPA.VERSCHIJNINGSVOLGNR), 'FM0999'::VARCHAR )) || (SPA.GESLACHT)::VARCHAR])) AS GESLACHT_TMP F...>
  testSelectBrackets(net.sf.jsqlparser.test.select.SelectTest): expected:<...g((123.250)::numeric[])> but was:<...g((123.250)::numeric[ ])>
  testWithUnionProblem3(net.sf.jsqlparser.test.select.SelectTest): expected:<...lea.fname AS varchar[]) FROM tablea INNER ...> but was:<...lea.fname AS varchar[ ]) FROM tablea INNER ...>
  testWithUnionProblem4(net.sf.jsqlparser.test.select.SelectTest): expected:<...gl.mslink AS VARCHAR[) AS path, ae.feature FROM tablea AS gl INNER JOIN tableb AS ba ON gl.mslink = ba.gl_mslink INNER JOIN tablec AS ae ON gl.mslink = ae.mslink AND ae.deleted = 0 WHERE gl.parent IS NULL AND gl.mslink <> 0) UNION ALL (SELECT gl.mslink, ba.gl_name AS txt, ba.gl_nummer AS nr, hist.level + 1 AS level, CAST(hist.path + '.' + CAST(gl.mslink AS VARCHAR) AS VARCHAR]) AS path, ae.featur...> but was:<...gl.mslink AS VARCHAR[ ) AS path, ae.feature FROM tablea AS gl INNER JOIN tableb AS ba ON gl.mslink = ba.gl_mslink INNER JOIN tablec AS ae ON gl.mslink = ae.mslink AND ae.deleted = 0 WHERE gl.parent IS NULL AND gl.mslink <> 0) UNION ALL (SELECT gl.mslink, ba.gl_name AS txt, ba.gl_nummer AS nr, hist.level + 1 AS level, CAST(hist.path + '.' + CAST(gl.mslink AS VARCHAR ) AS VARCHAR ]) AS path, ae.featur...>
  testWithUnionProblem5(net.sf.jsqlparser.test.select.SelectTest): expected:<...gl.mslink AS VARCHAR[) AS path, ae.feature FROM tablea AS gl INNER JOIN tableb AS ba ON gl.mslink = ba.gl_mslink INNER JOIN tablec AS ae ON gl.mslink = ae.mslink AND ae.deleted = 0 WHERE gl.parent IS NULL AND gl.mslink <> 0) UNION ALL (SELECT gl.mslink, ba.gl_name AS txt, ba.gl_nummer AS nr, hist.level + 1 AS level, CAST(hist.path + '.' + CAST(gl.mslink AS VARCHAR) AS VARCHAR]) AS path, 5 AS feat...> but was:<...gl.mslink AS VARCHAR[ ) AS path, ae.feature FROM tablea AS gl INNER JOIN tableb AS ba ON gl.mslink = ba.gl_mslink INNER JOIN tablec AS ae ON gl.mslink = ae.mslink AND ae.deleted = 0 WHERE gl.parent IS NULL AND gl.mslink <> 0) UNION ALL (SELECT gl.mslink, ba.gl_name AS txt, ba.gl_nummer AS nr, hist.level + 1 AS level, CAST(hist.path + '.' + CAST(gl.mslink AS VARCHAR ) AS VARCHAR ]) AS path, 5 AS feat...>
  testConcatProblem2_1(net.sf.jsqlparser.test.select.SelectTest): expected:<...GNR, 'FM09'::VARCHAR[]) FROM testtable> but was:<...GNR, 'FM09'::VARCHAR[ ]) FROM testtable>
  testConcatProblem2_2(net.sf.jsqlparser.test.select.SelectTest): expected:<...ERPERIODE)::VARCHAR [(2) || (VARCHAR(SPA.AANLEVERPERIODEJAAR))::VARCHAR (4)]) AS GESLACHT_TMP FR...> but was:<...ERPERIODE)::VARCHAR [|| (VARCHAR(SPA.AANLEVERPERIODEJAAR))::VARCHAR]) AS GESLACHT_TMP FR...>
  testConcatProblem2_3(net.sf.jsqlparser.test.select.SelectTest): expected:<...), 'FM0999'::VARCHAR[]) FROM testtable> but was:<...), 'FM0999'::VARCHAR[ ]) FROM testtable>
  testConcatProblem2_4(net.sf.jsqlparser.test.select.SelectTest): expected:<....GESLACHT)::VARCHAR [(1) ]FROM testtable> but was:<....GESLACHT)::VARCHAR []FROM testtable>
  testCharacterSetClause(net.sf.jsqlparser.test.select.SelectTest): expected:<...w0`.`nick2` AS CHAR [(8000) ]CHARACTER SET utf8) ...> but was:<...w0`.`nick2` AS CHAR []CHARACTER SET utf8) ...>
  testComplexUnion1(net.sf.jsqlparser.test.select.SelectTest): expected:<...sce(mytab.a::varchar[, '') AS a, mytab.b, mytab.c AS st, mytab.d, mytab.e FROM mytab WHERE mytab.del = 0) UNION (SELECT 'cde-' || coalesce(mytab2.a::varchar], '') AS a, mytab2.b...> but was:<...sce(mytab.a::varchar[ , '') AS a, mytab.b, mytab.c AS st, mytab.d, mytab.e FROM mytab WHERE mytab.del = 0) UNION (SELECT 'cde-' || coalesce(mytab2.a::varchar ], '') AS a, mytab2.b...>
  testCastTypeProblem(net.sf.jsqlparser.test.select.SelectTest): expected:<...CAST(col1 AS varchar[ (256)]) FROM tabelle1> but was:<...CAST(col1 AS varchar[]) FROM tabelle1>
  testCastInCast2(net.sf.jsqlparser.test.select.SelectTest): expected:<...sertEqual AS numeric[) AS varchar]) FROM tabelle1> but was:<...sertEqual AS numeric[ ) AS varchar ]) FROM tabelle1>

Tests run: 353, Failures: 50, Errors: 0, Skipped: 0

[INFO] ------------------------------------------------------------------------
[INFO] BUILD FAILURE
[INFO] ------------------------------------------------------------------------
[INFO] Total time: 22.580s
[INFO] Finished at: Tue Oct 06 07:18:53 CEST 2015
[INFO] Final Memory: 23M/346M
[INFO] ------------------------------------------------------------------------
[ERROR] Failed to execute goal org.apache.maven.plugins:maven-surefire-plugin:2.10:test (default-test) on project jsqlparser: There are test failures.
[ERROR] 
[ERROR] Please refer to /home/perham/Study/Experiments/2015-10-23-ICST/LittleDarwin/Cases/JSqlParser-jsqlparser-0.9.4/target/surefire-reports for the individual test results.
[ERROR] -> [Help 1]
[ERROR] 
[ERROR] To see the full stack trace of the errors, re-run Maven with the -e switch.
[ERROR] Re-run Maven using the -X switch to enable full debug logging.
[ERROR] 
[ERROR] For more information about the errors and possible solutions, please read the following articles:
[ERROR] [Help 1] http://cwiki.apache.org/confluence/display/MAVEN/MojoFailureException
