[INFO] Scanning for projects...
[INFO]                                                                         
[INFO] ------------------------------------------------------------------------
[INFO] Building JSQLParser library 0.9.4
[INFO] ------------------------------------------------------------------------
[INFO] 
[INFO] --- javacc-maven-plugin:2.6:jjtree-javacc (javacc) @ jsqlparser ---
[INFO] Skipping - all parsers are up to date
[INFO] 
[INFO] --- license-maven-plugin:1.6:update-file-header (first) @ jsqlparser ---
[INFO] Will search files to update from root /home/perham/Study/Experiments/2015-10-23-ICST/LittleDarwin/Cases/JSqlParser-jsqlparser-0.9.4/src/main/java
[INFO]  - adding license header on file /home/perham/Study/Experiments/2015-10-23-ICST/LittleDarwin/Cases/JSqlParser-jsqlparser-0.9.4/src/main/java/net/sf/jsqlparser/expression/operators/relational/OldOracleJoinBinaryExpression.java
[INFO] Scan 164 files header done in 220.108ms.
[INFO] 
 * uptodate header on 163 files.
 * add header on 1 file.
[INFO] 
[INFO] --- maven-resources-plugin:2.6:resources (default-resources) @ jsqlparser ---
[INFO] Using 'UTF-8' encoding to copy filtered resources.
[INFO] skip non existing resourceDirectory /home/perham/Study/Experiments/2015-10-23-ICST/LittleDarwin/Cases/JSqlParser-jsqlparser-0.9.4/src/main/resources
[INFO] 
[INFO] --- maven-compiler-plugin:3.3:compile (default-compile) @ jsqlparser ---
[INFO] Changes detected - recompiling the module!
[INFO] Compiling 177 source files to /home/perham/Study/Experiments/2015-10-23-ICST/LittleDarwin/Cases/JSqlParser-jsqlparser-0.9.4/target/classes
[WARNING] bootstrap class path not set in conjunction with -source 1.6
[INFO] /home/perham/Study/Experiments/2015-10-23-ICST/LittleDarwin/Cases/JSqlParser-jsqlparser-0.9.4/target/generated-sources/javacc/net/sf/jsqlparser/parser/CCJSqlParser.java: /home/perham/Study/Experiments/2015-10-23-ICST/LittleDarwin/Cases/JSqlParser-jsqlparser-0.9.4/target/generated-sources/javacc/net/sf/jsqlparser/parser/CCJSqlParser.java uses unchecked or unsafe operations.
[INFO] /home/perham/Study/Experiments/2015-10-23-ICST/LittleDarwin/Cases/JSqlParser-jsqlparser-0.9.4/target/generated-sources/javacc/net/sf/jsqlparser/parser/CCJSqlParser.java: Recompile with -Xlint:unchecked for details.
[INFO] 
[INFO] --- maven-resources-plugin:2.6:testResources (default-testResources) @ jsqlparser ---
[INFO] Using 'UTF-8' encoding to copy filtered resources.
[INFO] Copying 280 resources
[INFO] 
[INFO] --- maven-compiler-plugin:3.3:testCompile (default-testCompile) @ jsqlparser ---
[INFO] Nothing to compile - all classes are up to date
[INFO] 
[INFO] --- maven-surefire-plugin:2.10:test (default-test) @ jsqlparser ---
[INFO] Surefire report directory: /home/perham/Study/Experiments/2015-10-23-ICST/LittleDarwin/Cases/JSqlParser-jsqlparser-0.9.4/target/surefire-reports

-------------------------------------------------------
 T E S T S
-------------------------------------------------------
Running net.sf.jsqlparser.test.alter.AlterTest
Tests run: 3, Failures: 0, Errors: 0, Skipped: 0, Time elapsed: 0.053 sec
Running net.sf.jsqlparser.test.create.CreateTableTest
Tests run: 27, Failures: 1, Errors: 0, Skipped: 0, Time elapsed: 0.139 sec <<< FAILURE!
Running net.sf.jsqlparser.test.create.CreateIndexTest
Tests run: 6, Failures: 0, Errors: 0, Skipped: 0, Time elapsed: 0.001 sec
Running net.sf.jsqlparser.test.create.CreateViewTest
Tests run: 8, Failures: 1, Errors: 0, Skipped: 0, Time elapsed: 0.005 sec <<< FAILURE!
Running net.sf.jsqlparser.test.delete.DeleteTest
Tests run: 2, Failures: 2, Errors: 0, Skipped: 0, Time elapsed: 0.004 sec <<< FAILURE!
Running net.sf.jsqlparser.test.simpleparsing.CCJSqlParserManagerTest
Tests run: 1, Failures: 0, Errors: 0, Skipped: 0, Time elapsed: 0.18 sec
Running net.sf.jsqlparser.test.drop.DropTest
Tests run: 2, Failures: 0, Errors: 0, Skipped: 0, Time elapsed: 0.001 sec
Running net.sf.jsqlparser.test.insert.InsertTest
Tests run: 15, Failures: 0, Errors: 0, Skipped: 0, Time elapsed: 0.041 sec
Running net.sf.jsqlparser.test.TestUtils
Tests run: 1, Failures: 0, Errors: 0, Skipped: 0, Time elapsed: 0 sec
Running net.sf.jsqlparser.test.update.UpdateTest
Tests run: 7, Failures: 3, Errors: 0, Skipped: 0, Time elapsed: 0.006 sec <<< FAILURE!
Running net.sf.jsqlparser.test.replace.ReplaceTest
Tests run: 4, Failures: 0, Errors: 0, Skipped: 0, Time elapsed: 0.004 sec
Running net.sf.jsqlparser.test.select.SelectASTTest
*Statement
* Column
* Column
* Table
* Column
* Column
Tests run: 2, Failures: 0, Errors: 0, Skipped: 0, Time elapsed: 0.003 sec
Running net.sf.jsqlparser.test.select.SpecialOracleTest
Oct 06, 2015 7:01:44 AM net.sf.jsqlparser.test.select.SpecialOracleTest testAllSqlsParseDeparse
INFO: testing string01.sql
Oct 06, 2015 7:01:44 AM net.sf.jsqlparser.test.select.SpecialOracleTest testAllSqlsParseDeparse
INFO:    -> PROBLEM net.sf.jsqlparser.JSQLParserException
Oct 06, 2015 7:01:44 AM net.sf.jsqlparser.test.select.SpecialOracleTest testAllSqlsParseDeparse
INFO: testing returning01.sql
Oct 06, 2015 7:01:44 AM net.sf.jsqlparser.test.select.SpecialOracleTest testAllSqlsParseDeparse
INFO:    -> PROBLEM net.sf.jsqlparser.JSQLParserException
Oct 06, 2015 7:01:44 AM net.sf.jsqlparser.test.select.SpecialOracleTest testAllSqlsParseDeparse
INFO: testing keywordasidentifier05.sql
Oct 06, 2015 7:01:44 AM net.sf.jsqlparser.test.select.SpecialOracleTest testAllSqlsParseDeparse
INFO:    -> SUCCESS
Oct 06, 2015 7:01:44 AM net.sf.jsqlparser.test.select.SpecialOracleTest testAllSqlsParseDeparse
INFO: testing function07.sql
Oct 06, 2015 7:01:44 AM net.sf.jsqlparser.test.select.SpecialOracleTest testAllSqlsParseDeparse
INFO:    -> PROBLEM net.sf.jsqlparser.JSQLParserException
Oct 06, 2015 7:01:44 AM net.sf.jsqlparser.test.select.SpecialOracleTest testAllSqlsParseDeparse
INFO: testing cast_multiset15.sql
Oct 06, 2015 7:01:44 AM net.sf.jsqlparser.test.select.SpecialOracleTest testAllSqlsParseDeparse
INFO:    -> PROBLEM net.sf.jsqlparser.JSQLParserException
Oct 06, 2015 7:01:44 AM net.sf.jsqlparser.test.select.SpecialOracleTest testAllSqlsParseDeparse
INFO: testing interval01.sql
Oct 06, 2015 7:01:44 AM net.sf.jsqlparser.test.select.SpecialOracleTest testAllSqlsParseDeparse
INFO:    -> PROBLEM net.sf.jsqlparser.JSQLParserException
Oct 06, 2015 7:01:44 AM net.sf.jsqlparser.test.select.SpecialOracleTest testAllSqlsParseDeparse
INFO: testing analytic_query04.sql
Oct 06, 2015 7:01:44 AM net.sf.jsqlparser.test.select.SpecialOracleTest testAllSqlsParseDeparse
INFO:    -> PROBLEM net.sf.jsqlparser.JSQLParserException
Oct 06, 2015 7:01:44 AM net.sf.jsqlparser.test.select.SpecialOracleTest testAllSqlsParseDeparse
INFO: testing join10.sql
Oct 06, 2015 7:01:44 AM net.sf.jsqlparser.test.select.SpecialOracleTest testAllSqlsParseDeparse
INFO:    -> SUCCESS
Oct 06, 2015 7:01:44 AM net.sf.jsqlparser.test.select.SpecialOracleTest testAllSqlsParseDeparse
INFO: testing pivot04.sql
Oct 06, 2015 7:01:44 AM net.sf.jsqlparser.test.select.SpecialOracleTest testAllSqlsParseDeparse
INFO:    -> PROBLEM net.sf.jsqlparser.JSQLParserException
Oct 06, 2015 7:01:44 AM net.sf.jsqlparser.test.select.SpecialOracleTest testAllSqlsParseDeparse
INFO: testing condition08.sql
Oct 06, 2015 7:01:44 AM net.sf.jsqlparser.test.select.SpecialOracleTest testAllSqlsParseDeparse
INFO:    -> PROBLEM net.sf.jsqlparser.JSQLParserException
Oct 06, 2015 7:01:44 AM net.sf.jsqlparser.test.select.SpecialOracleTest testAllSqlsParseDeparse
INFO: testing function03.sql
Oct 06, 2015 7:01:44 AM net.sf.jsqlparser.test.select.SpecialOracleTest testAllSqlsParseDeparse
INFO:    -> PROBLEM net.sf.jsqlparser.JSQLParserException
Oct 06, 2015 7:01:44 AM net.sf.jsqlparser.test.select.SpecialOracleTest testAllSqlsParseDeparse
INFO: testing merge03.sql
Oct 06, 2015 7:01:44 AM net.sf.jsqlparser.test.select.SpecialOracleTest testAllSqlsParseDeparse
INFO:    -> PROBLEM net.sf.jsqlparser.JSQLParserException
Oct 06, 2015 7:01:44 AM net.sf.jsqlparser.test.select.SpecialOracleTest testAllSqlsParseDeparse
INFO: testing insert02.sql
Oct 06, 2015 7:01:44 AM net.sf.jsqlparser.test.select.SpecialOracleTest testAllSqlsParseDeparse
INFO:    -> PROBLEM net.sf.jsqlparser.JSQLParserException
Oct 06, 2015 7:01:44 AM net.sf.jsqlparser.test.select.SpecialOracleTest testAllSqlsParseDeparse
INFO: testing insert11.sql
Oct 06, 2015 7:01:44 AM net.sf.jsqlparser.test.select.SpecialOracleTest testAllSqlsParseDeparse
INFO:    -> PROBLEM net.sf.jsqlparser.JSQLParserException
Oct 06, 2015 7:01:44 AM net.sf.jsqlparser.test.select.SpecialOracleTest testAllSqlsParseDeparse
INFO: testing interval02.sql
Oct 06, 2015 7:01:44 AM net.sf.jsqlparser.test.select.SpecialOracleTest testAllSqlsParseDeparse
INFO:    -> SUCCESS
Oct 06, 2015 7:01:44 AM net.sf.jsqlparser.test.select.SpecialOracleTest testAllSqlsParseDeparse
INFO: testing cast_multiset18.sql
Oct 06, 2015 7:01:44 AM net.sf.jsqlparser.test.select.SpecialOracleTest testAllSqlsParseDeparse
INFO:    -> PROBLEM net.sf.jsqlparser.JSQLParserException
Oct 06, 2015 7:01:44 AM net.sf.jsqlparser.test.select.SpecialOracleTest testAllSqlsParseDeparse
INFO: testing query_factoring08.sql
Oct 06, 2015 7:01:44 AM net.sf.jsqlparser.test.select.SpecialOracleTest testAllSqlsOnlyParse
INFO: testing comment02.sql
Oct 06, 2015 7:01:44 AM net.sf.jsqlparser.test.select.SpecialOracleTest testAllSqlsOnlyParse
INFO:    -> SUCCESS
Oct 06, 2015 7:01:44 AM net.sf.jsqlparser.test.select.SpecialOracleTest testAllSqlsOnlyParse
INFO: testing numbers02.sql
Oct 06, 2015 7:01:44 AM net.sf.jsqlparser.test.select.SpecialOracleTest testAllSqlsOnlyParse
INFO:    -> SUCCESS
Oct 06, 2015 7:01:44 AM net.sf.jsqlparser.test.select.SpecialOracleTest testAllSqlsOnlyParse
INFO: testing comment01.sql
Oct 06, 2015 7:01:44 AM net.sf.jsqlparser.test.select.SpecialOracleTest testAllSqlsOnlyParse
INFO:    -> SUCCESS
Tests run: 2, Failures: 1, Errors: 0, Skipped: 0, Time elapsed: 0.376 sec <<< FAILURE!
Running net.sf.jsqlparser.test.select.SelectTest
Tests run: 228, Failures: 66, Errors: 0, Skipped: 0, Time elapsed: 0.287 sec <<< FAILURE!
Running net.sf.jsqlparser.test.select.SpeedTest
42500 statements parsed in 7776 milliseconds
 (5465 statements per second,  0.000183 seconds per statement )
38500 select scans for table name executed in 128 milliseconds
 (300781 select scans for table name per second,  0.0000033 seconds per select scans for table name)
Tests run: 1, Failures: 0, Errors: 0, Skipped: 0, Time elapsed: 7.902 sec
Running net.sf.jsqlparser.test.truncate.TruncateTest
Tests run: 1, Failures: 0, Errors: 0, Skipped: 0, Time elapsed: 0.001 sec
Running net.sf.jsqlparser.util.TablesNamesFinderTest
Tests run: 19, Failures: 0, Errors: 0, Skipped: 0, Time elapsed: 0.013 sec
Running net.sf.jsqlparser.util.ConnectExpressionsVisitorTest
Tests run: 2, Failures: 0, Errors: 0, Skipped: 0, Time elapsed: 0.001 sec
Running net.sf.jsqlparser.util.AddAliasesVisitorTest
Tests run: 4, Failures: 0, Errors: 0, Skipped: 0, Time elapsed: 0.001 sec
Running net.sf.jsqlparser.util.SelectUtilsTest
Tests run: 6, Failures: 1, Errors: 0, Skipped: 0, Time elapsed: 0.002 sec <<< FAILURE!
Running net.sf.jsqlparser.expression.ExpressionVisitorAdapterTest
Tests run: 2, Failures: 0, Errors: 0, Skipped: 0, Time elapsed: 0.001 sec
Running net.sf.jsqlparser.expression.SignedExpressionTest
Tests run: 1, Failures: 0, Errors: 0, Skipped: 0, Time elapsed: 0 sec
Running net.sf.jsqlparser.schema.ServerTest
Tests run: 2, Failures: 0, Errors: 0, Skipped: 0, Time elapsed: 0.001 sec
Running net.sf.jsqlparser.parser.CCJSqlParserUtilTest
Tests run: 3, Failures: 1, Errors: 0, Skipped: 0, Time elapsed: 0.001 sec <<< FAILURE!
Running net.sf.jsqlparser.statement.SetStatementTest
Tests run: 1, Failures: 0, Errors: 0, Skipped: 0, Time elapsed: 0.004 sec
Running net.sf.jsqlparser.statement.AdaptersTest
Tests run: 1, Failures: 0, Errors: 0, Skipped: 0, Time elapsed: 0.002 sec
Running net.sf.jsqlparser.statement.StatementsTest
Tests run: 1, Failures: 0, Errors: 0, Skipped: 0, Time elapsed: 0.001 sec
Running net.sf.jsqlparser.statement.execute.ExecuteTest
Tests run: 1, Failures: 0, Errors: 0, Skipped: 0, Time elapsed: 0.001 sec

Results :

Failed tests:   testCreateTableAsSelect2(net.sf.jsqlparser.test.create.CreateTableTest): expected:<... JOIN a ON b.col1 = []a.col1> but was:<... JOIN a ON b.col1 = [PRIOR ]a.col1>
  testCreateView4(net.sf.jsqlparser.test.create.CreateViewTest): expected:<...2 ON testtab.col1 = []testtab2.col2> but was:<...2 ON testtab.col1 = [PRIOR ]testtab2.col2>
  testDelete(net.sf.jsqlparser.test.delete.DeleteTest): expected:<...WHERE mytable.col = []9> but was:<...WHERE mytable.col = [PRIOR ]9>
  testDeleteWhereProblem1(net.sf.jsqlparser.test.delete.DeleteTest): expected:<...tablename WHERE a = [1 AND b =] 1> but was:<...tablename WHERE a = [PRIOR 1 AND b = PRIOR] 1>
  testUpdateWithFrom(net.sf.jsqlparser.test.update.UpdateTest): expected:<...IN table2 ON col1 = []col2> but was:<...IN table2 ON col1 = [PRIOR ]col2>
  testUpdateMultiTable(net.sf.jsqlparser.test.update.UpdateTest): expected:<...ATED' WHERE T1.C1 = [T2.C1 AND T1.C2 <] 10> but was:<...ATED' WHERE T1.C1 = [PRIOR T2.C1 AND T1.C2 < PRIOR] 10>
  testUpdateWithDeparser(net.sf.jsqlparser.test.update.UpdateTest): expected:<...WHERE A.cod_table = []'YYY'> but was:<...WHERE A.cod_table = [PRIOR ]'YYY'>
  testAllSqlsParseDeparse(net.sf.jsqlparser.test.select.SpecialOracleTest): expected:<...t2 join t3 on(t2.a2=[t3.a3))select*from x1 join x2 on(x1.a1=x2.a2)join t4 on(x1.a1=]t4.a4)> but was:<...t2 join t3 on(t2.a2=[prior t3.a3))select*from x1 join x2 on(x1.a1=prior x2.a2)join t4 on(x1.a1=prior ]t4.a4)>
  testAllConditionSubSelect(net.sf.jsqlparser.test.select.SelectTest): expected:<...p e1 WHERE e1.sal > [ALL (SELECT e2.sal FROM emp e2 WHERE e2.deptno =] 10)> but was:<...p e1 WHERE e1.sal > [PRIOR ALL (SELECT e2.sal FROM emp e2 WHERE e2.deptno = PRIOR] 10)>
  testSelectForUpdateOfTable(net.sf.jsqlparser.test.select.SelectTest): expected:<... bar WHERE foo.id = []bar.foo_id FOR UPDAT...> but was:<... bar WHERE foo.id = [PRIOR ]bar.foo_id FOR UPDAT...>
  testOracleJoin2(net.sf.jsqlparser.test.select.SelectTest): expected:<...ERE tabelle1.a(+) = []tabelle2.b> but was:<...ERE tabelle1.a(+) = [PRIOR ]tabelle2.b>
  testOracleJoin3(net.sf.jsqlparser.test.select.SelectTest): expected:<...ERE tabelle1.a(+) > []tabelle2.b> but was:<...ERE tabelle1.a(+) > [PRIOR ]tabelle2.b>
  testOracleJoin4(net.sf.jsqlparser.test.select.SelectTest): expected:<...ERE tabelle1.a(+) = []tabelle2.b AND tabel...> but was:<...ERE tabelle1.a(+) = [PRIOR ]tabelle2.b AND tabel...>
  testOrderBy(net.sf.jsqlparser.test.select.SelectTest): expected:<...FROM tab1 WHERE a > []34 GROUP BY tab1.b O...> but was:<...FROM tab1 WHERE a > [PRIOR ]34 GROUP BY tab1.b O...>
  testSelectJoinWithComma(net.sf.jsqlparser.test.select.SelectTest): expected:<...s WHERE es.nombre = ["Tamaulipas" AND cb.the_geom =] es.geom> but was:<...s WHERE es.nombre = [PRIOR "Tamaulipas" AND cb.the_geom = PRIOR] es.geom>
  testTop(net.sf.jsqlparser.test.select.SelectTest): expected:<...WHERE mytable.col = []9> but was:<...WHERE mytable.col = [PRIOR ]9>
  testMysqlQuote(net.sf.jsqlparser.test.select.SelectTest): expected:<...b WHERE b.BUYERID = [a.OWNERID AND b.ITEM =] 'Chair'> but was:<...b WHERE b.BUYERID = [PRIOR a.OWNERID AND b.ITEM = PRIOR] 'Chair'>
  testLimit(net.sf.jsqlparser.test.select.SelectTest): expected:<...WHERE mytable.col = []9 LIMIT ? OFFSET 3> but was:<...WHERE mytable.col = [PRIOR ]9 LIMIT ? OFFSET 3>
  testUnion(net.sf.jsqlparser.test.select.SelectTest): expected:<...WHERE mytable.col = [9) UNION (SELECT * FROM mytable3 WHERE mytable3.col =] ?) UNION (SELECT * ...> but was:<...WHERE mytable.col = [PRIOR 9) UNION (SELECT * FROM mytable3 WHERE mytable3.col = PRIOR] ?) UNION (SELECT * ...>
  testWhere(net.sf.jsqlparser.test.select.SelectTest): expected:<...(a / b * (a + b)) > []?> but was:<...(a / b * (a + b)) > [PRIOR ]?>
  testCase(net.sf.jsqlparser.test.select.SelectTest): expected:<... a, (CASE WHEN (a > []2) THEN 3 END) AS b ...> but was:<... a, (CASE WHEN (a > [PRIOR ]2) THEN 3 END) AS b ...>
  testFrom(net.sf.jsqlparser.test.select.SelectTest): expected:<...WHERE mytable.col = []9> but was:<...WHERE mytable.col = [PRIOR ]9>
  testJoin(net.sf.jsqlparser.test.select.SelectTest): expected:<...N tab2 ON tab1.id = []tab2.id> but was:<...N tab2 ON tab1.id = [PRIOR ]tab2.id>
  testTime(net.sf.jsqlparser.test.select.SelectTest): expected:<...FROM tab1 WHERE a > []{t '04:05:34'}> but was:<...FROM tab1 WHERE a > [PRIOR ]{t '04:05:34'}>
  testWith(net.sf.jsqlparser.test.select.SelectTest): expected:<...HERE THIS_EMP.JOB = ['SALESREP' AND THIS_EMP.WORKDEPT =] DINFO.DEPTNO> but was:<...HERE THIS_EMP.JOB = [PRIOR 'SALESREP' AND THIS_EMP.WORKDEPT = PRIOR] DINFO.DEPTNO>
  testProblemSqlAnalytic8Complex(net.sf.jsqlparser.test.select.SelectTest): expected:<...OM STAFF WHERE ID < []60 ORDER BY ID> but was:<...OM STAFF WHERE ID < [PRIOR ]60 ORDER BY ID>
  testOracleJoin2_1(net.sf.jsqlparser.test.select.SelectTest): expected:<...where tabelle1.a(+)=[]tabelle2.b> but was:<...where tabelle1.a(+)=[prior ]tabelle2.b>
  testOracleJoin2_2(net.sf.jsqlparser.test.select.SelectTest): expected:<...e2 where tabelle1.a=[]tabelle2.b(+)> but was:<...e2 where tabelle1.a=[prior ]tabelle2.b(+)>
  testOracleJoin3_1(net.sf.jsqlparser.test.select.SelectTest): expected:<... WHERE tabelle1.a > []tabelle2.b(+)> but was:<... WHERE tabelle1.a > [PRIOR ]tabelle2.b(+)>
  testAnyConditionSubSelect(net.sf.jsqlparser.test.select.SelectTest): expected:<...p e1 WHERE e1.sal > [ANY (SELECT e2.sal FROM emp e2 WHERE e2.deptno =] 10)> but was:<...p e1 WHERE e1.sal > [PRIOR ANY (SELECT e2.sal FROM emp e2 WHERE e2.deptno = PRIOR] 10)>
  testMultiTableJoin(net.sf.jsqlparser.test.select.SelectTest): expected:<...IN tabb ON taba.a = [tabb.a, tabc LEFT JOIN tabd ON tabc.c =] tabd.c> but was:<...IN tabb ON taba.a = [PRIOR tabb.a, tabc LEFT JOIN tabd ON tabc.c = PRIOR] tabd.c>
  testIssue160_signedParameter2(net.sf.jsqlparser.test.select.SelectTest): expected:<... mytable WHERE -? = []5> but was:<... mytable WHERE -? = [PRIOR ]5>
  testLateral1(net.sf.jsqlparser.test.select.SelectTest): expected:<...ERE LINES.ORDERID = []O.ORDERID) AS OL> but was:<...ERE LINES.ORDERID = [PRIOR ]O.ORDERID) AS OL>
  testSelectNumericBind(net.sf.jsqlparser.test.select.SelectTest): expected:<... a FROM b WHERE c = []:1> but was:<... a FROM b WHERE c = [PRIOR ]:1>
  testLateralComplex1(net.sf.jsqlparser.test.select.SelectTest): expected:<...ERE LINES.ORDERID = [O.ORDERID) AS OL, LATERAL(SELECT SUM(CHGAMT) AS ORDCHGTOTAL FROM ORDERCHARGES CHARGES WHERE LINES.ORDERID = O.ORDERID) AS OC, LATERAL(SELECT SUM(TAXAMT) AS TAXTOTAL FROM ORDERTAXES TAXES WHERE TAXES.ORDERID =] O.ORDERID) AS OT> but was:<...ERE LINES.ORDERID = [PRIOR O.ORDERID) AS OL, LATERAL(SELECT SUM(CHGAMT) AS ORDCHGTOTAL FROM ORDERCHARGES CHARGES WHERE LINES.ORDERID = PRIOR O.ORDERID) AS OC, LATERAL(SELECT SUM(TAXAMT) AS TAXTOTAL FROM ORDERTAXES TAXES WHERE TAXES.ORDERID = PRIOR] O.ORDERID) AS OT>
  testSelectItems(net.sf.jsqlparser.test.select.SelectTest): expected:<...WHERE mytable.col = []9> but was:<...WHERE mytable.col = [PRIOR ]9>
  testSelectJoin2(net.sf.jsqlparser.test.select.SelectTest): expected:<..._attribute.attnum = []ANY(pg_constraint.co...> but was:<..._attribute.attnum = [PRIOR ]ANY(pg_constraint.co...>
  testWithRecursive(net.sf.jsqlparser.test.select.SelectTest): expected:<... 1 FROM t WHERE n < []100)) SELECT sum(n) ...> but was:<... 1 FROM t WHERE n < [PRIOR ]100)) SELECT sum(n) ...>
  testWithUnionProblem3(net.sf.jsqlparser.test.select.SelectTest): expected:<... ON tablea.mslink = [tableb.mslink AND tableb.deleted = 0 WHERE tablea.fname IS NULL AND 1 =] 0) UNION ALL (SELEC...> but was:<... ON tablea.mslink = [PRIOR tableb.mslink AND tableb.deleted = PRIOR 0 WHERE tablea.fname IS NULL AND 1 = PRIOR] 0) UNION ALL (SELEC...>
  testWithUnionProblem4(net.sf.jsqlparser.test.select.SelectTest): expected:<...S ba ON gl.mslink = [ba.gl_mslink INNER JOIN tablec AS ae ON gl.mslink = ae.mslink AND ae.deleted = 0 WHERE gl.parent IS NULL AND gl.mslink <> 0) UNION ALL (SELECT gl.mslink, ba.gl_name AS txt, ba.gl_nummer AS nr, hist.level + 1 AS level, CAST(hist.path + '.' + CAST(gl.mslink AS VARCHAR) AS VARCHAR) AS path, ae.feature FROM tablea AS gl INNER JOIN tableb AS ba ON gl.mslink = ba.gl_mslink INNER JOIN tablec AS ae ON gl.mslink = ae.mslink AND ae.deleted = 0 INNER JOIN hist ON gl.parent = hist.mslink WHERE gl.mslink <> 0)) SELECT mslink, space(level * 4) + txt AS txt, nr, feature, path FROM hist WHERE EXISTS (SELECT feature FROM tablec WHERE mslink = 0 AND ((feature IN (1, 2) AND hist.feature = 3) OR (feature IN (4) AND hist.feature =] 2)))> but was:<...S ba ON gl.mslink = [PRIOR ba.gl_mslink INNER JOIN tablec AS ae ON gl.mslink = PRIOR ae.mslink AND ae.deleted = PRIOR 0 WHERE gl.parent IS NULL AND gl.mslink <> PRIOR 0) UNION ALL (SELECT gl.mslink, ba.gl_name AS txt, ba.gl_nummer AS nr, hist.level + 1 AS level, CAST(hist.path + '.' + CAST(gl.mslink AS VARCHAR) AS VARCHAR) AS path, ae.feature FROM tablea AS gl INNER JOIN tableb AS ba ON gl.mslink = PRIOR ba.gl_mslink INNER JOIN tablec AS ae ON gl.mslink = PRIOR ae.mslink AND ae.deleted = PRIOR 0 INNER JOIN hist ON gl.parent = PRIOR hist.mslink WHERE gl.mslink <> PRIOR 0)) SELECT mslink, space(level * 4) + txt AS txt, nr, feature, path FROM hist WHERE EXISTS (SELECT feature FROM tablec WHERE mslink = PRIOR 0 AND ((feature IN (1, 2) AND hist.feature = PRIOR 3) OR (feature IN (4) AND hist.feature = PRIOR] 2)))>
  testWithUnionProblem5(net.sf.jsqlparser.test.select.SelectTest): expected:<...S ba ON gl.mslink = [ba.gl_mslink INNER JOIN tablec AS ae ON gl.mslink = ae.mslink AND ae.deleted = 0 WHERE gl.parent IS NULL AND gl.mslink <> 0) UNION ALL (SELECT gl.mslink, ba.gl_name AS txt, ba.gl_nummer AS nr, hist.level + 1 AS level, CAST(hist.path + '.' + CAST(gl.mslink AS VARCHAR) AS VARCHAR) AS path, 5 AS feature FROM tablea AS gl INNER JOIN tableb AS ba ON gl.mslink = ba.gl_mslink INNER JOIN tablec AS ae ON gl.mslink = ae.mslink AND ae.deleted = 0 INNER JOIN hist ON gl.parent = hist.mslink WHERE gl.mslink <>] 0)) SELECT * FROM h...> but was:<...S ba ON gl.mslink = [PRIOR ba.gl_mslink INNER JOIN tablec AS ae ON gl.mslink = PRIOR ae.mslink AND ae.deleted = PRIOR 0 WHERE gl.parent IS NULL AND gl.mslink <> PRIOR 0) UNION ALL (SELECT gl.mslink, ba.gl_name AS txt, ba.gl_nummer AS nr, hist.level + 1 AS level, CAST(hist.path + '.' + CAST(gl.mslink AS VARCHAR) AS VARCHAR) AS path, 5 AS feature FROM tablea AS gl INNER JOIN tableb AS ba ON gl.mslink = PRIOR ba.gl_mslink INNER JOIN tablec AS ae ON gl.mslink = PRIOR ae.mslink AND ae.deleted = PRIOR 0 INNER JOIN hist ON gl.parent = PRIOR hist.mslink WHERE gl.mslink <> PRIOR] 0)) SELECT * FROM h...>
  testGroupBy(net.sf.jsqlparser.test.select.SelectTest): expected:<...FROM tab1 WHERE a > []34 GROUP BY tab1.b> but was:<...FROM tab1 WHERE a > [PRIOR ]34 GROUP BY tab1.b>
  testLimitSqlServer1(net.sf.jsqlparser.test.select.SelectTest): expected:<...WHERE mytable.col = []9 ORDER BY mytable.i...> but was:<...WHERE mytable.col = [PRIOR ]9 ORDER BY mytable.i...>
  testLimitSqlServer2(net.sf.jsqlparser.test.select.SelectTest): expected:<...WHERE mytable.col = []9 ORDER BY mytable.i...> but was:<...WHERE mytable.col = [PRIOR ]9 ORDER BY mytable.i...>
  testLimitSqlServer3(net.sf.jsqlparser.test.select.SelectTest): expected:<...WHERE mytable.col = []9 ORDER BY mytable.i...> but was:<...WHERE mytable.col = [PRIOR ]9 ORDER BY mytable.i...>
  testLimitSqlServer4(net.sf.jsqlparser.test.select.SelectTest): expected:<...WHERE mytable.col = []9 ORDER BY mytable.i...> but was:<...WHERE mytable.col = [PRIOR ]9 ORDER BY mytable.i...>
  testNotEqualsTo(net.sf.jsqlparser.test.select.SelectTest): expected:<...FROM foo WHERE a != []b> but was:<...FROM foo WHERE a != [PRIOR ]b>
  testMatches(net.sf.jsqlparser.test.select.SelectTest): expected:<...am.search_column @@ []to_tsquery('new & yo...> but was:<...am.search_column @@ [PRIOR ]to_tsquery('new & yo...>
  testFunctions(net.sf.jsqlparser.test.select.SelectTest): expected:<...WHERE mytable.col = []9> but was:<...WHERE mytable.col = [PRIOR ]9>
  testSelectOrderHaving(net.sf.jsqlparser.test.select.SelectTest): expected:<...VING count(units) > []1 ORDER BY num> but was:<...VING count(units) > [PRIOR ]1 ORDER BY num>
  testIssue154_2(net.sf.jsqlparser.test.select.SelectTest): expected:<...ERE r.merchant_id = []? AND r.deleted_time...> but was:<...ERE r.merchant_id = [PRIOR ]? AND r.deleted_time...>
  testTimestamp(net.sf.jsqlparser.test.select.SelectTest): expected:<...FROM tab1 WHERE a > []{ts '2004-04-30 04:0...> but was:<...FROM tab1 WHERE a > [PRIOR ]{ts '2004-04-30 04:0...>
  testComplexUnion1(net.sf.jsqlparser.test.select.SelectTest): expected:<...b WHERE mytab.del = [0) UNION (SELECT 'cde-' || coalesce(mytab2.a::varchar, '') AS a, mytab2.b, mytab2.bezeichnung AS c, 0 AS d, 0 AS e FROM mytab2 WHERE mytab2.del =] 0)> but was:<...b WHERE mytab.del = [PRIOR 0) UNION (SELECT 'cde-' || coalesce(mytab2.a::varchar, '') AS a, mytab2.b, mytab2.bezeichnung AS c, 0 AS d, 0 AS e FROM mytab2 WHERE mytab2.del = PRIOR] 0)>
  testDistinct(net.sf.jsqlparser.test.select.SelectTest): expected:<...WHERE mytable.col = []9> but was:<...WHERE mytable.col = [PRIOR ]9>
  testIssue160_signedParameter(net.sf.jsqlparser.test.select.SelectTest): expected:<... WHERE start_date > []DATEADD(HH, -?, GETD...> but was:<... WHERE start_date > [PRIOR ]DATEADD(HH, -?, GETD...>
  testDouble(net.sf.jsqlparser.test.select.SelectTest): expected:<...WHERE mytable.col = []9> but was:<...WHERE mytable.col = [PRIOR ]9>
  testHaving(net.sf.jsqlparser.test.select.SelectTest): expected:<...FROM tab1 WHERE a > [34 GROUP BY tab1.b HAVING MAX(tab1.b) >] 56> but was:<...FROM tab1 WHERE a > [PRIOR 34 GROUP BY tab1.b HAVING MAX(tab1.b) > PRIOR] 56>
  testIssue154(net.sf.jsqlparser.test.select.SelectTest): expected:<...tegory dc ON d.id = [dc.discount_id WHERE merchant_id = ? AND deleted = ? AND dc.discount_id IS NULL AND modified_time < ? AND modified_time >=] ? ORDER BY modified...> but was:<...tegory dc ON d.id = [PRIOR dc.discount_id WHERE merchant_id = PRIOR ? AND deleted = PRIOR ? AND dc.discount_id IS NULL AND modified_time < PRIOR ? AND modified_time >= PRIOR] ? ORDER BY modified...>
  testDistinctTop(net.sf.jsqlparser.test.select.SelectTest): expected:<...WHERE mytable.col = []9> but was:<...WHERE mytable.col = [PRIOR ]9>
  testSelectOracleColl(net.sf.jsqlparser.test.select.SelectTest): expected:<... tt WHERE TT.COL1 = []lines(idx).COL1> but was:<... tt WHERE TT.COL1 = [PRIOR ]lines(idx).COL1>
  testOracleJoin(net.sf.jsqlparser.test.select.SelectTest): expected:<... WHERE tabelle1.a = []tabelle2.b(+)> but was:<... WHERE tabelle1.a = [PRIOR ]tabelle2.b(+)>
  testRowConstructor1(net.sf.jsqlparser.test.select.SelectTest): expected:<...HERE (col1, col2) = [(SELECT col3, col4 FROM t2 WHERE id =] 10)> but was:<...HERE (col1, col2) = [PRIOR (SELECT col3, col4 FROM t2 WHERE id = PRIOR] 10)>
  testRowConstructor2(net.sf.jsqlparser.test.select.SelectTest): expected:<...E ROW(col1, col2) = [(SELECT col3, col4 FROM t2 WHERE id =] 10)> but was:<...E ROW(col1, col2) = [PRIOR (SELECT col3, col4 FROM t2 WHERE id = PRIOR] 10)>
  testLimit2(net.sf.jsqlparser.test.select.SelectTest): expected:<...WHERE mytable.col = []9 LIMIT ? OFFSET 3> but was:<...WHERE mytable.col = [PRIOR ]9 LIMIT ? OFFSET 3>
  testOracleHierarchicalQuery(net.sf.jsqlparser.test.select.SelectTest): expected:<...CT BY employee_id = []manager_id ORDER BY ...> but was:<...CT BY employee_id = [PRIOR ]manager_id ORDER BY ...>
  testDeparser(net.sf.jsqlparser.test.select.SelectTest): expected:<...b WHERE b.BUYERID = [a.OWNERID AND b.ITEM =] 'Chair'> but was:<...b WHERE b.BUYERID = [PRIOR a.OWNERID AND b.ITEM = PRIOR] 'Chair'>
  testOracleHierarchicalQuery2(net.sf.jsqlparser.test.select.SelectTest): expected:<...PRIOR employee_id = []manager_id> but was:<...PRIOR employee_id = [PRIOR ]manager_id>
  testOracleHierarchicalQuery3(net.sf.jsqlparser.test.select.SelectTest): expected:<... WITH employee_id = [100 CONNECT BY PRIOR employee_id =] manager_id ORDER SI...> but was:<... WITH employee_id = [PRIOR 100 CONNECT BY PRIOR employee_id = PRIOR] manager_id ORDER SI...>
  testOracleHierarchicalQuery4(net.sf.jsqlparser.test.select.SelectTest): expected:<...PRIOR employee_id = [manager_id START WITH employee_id =] 100 ORDER SIBLINGS ...> but was:<...PRIOR employee_id = [PRIOR manager_id START WITH employee_id = PRIOR] 100 ORDER SIBLINGS ...>
  testLimitSqlServerJdbcParameters(net.sf.jsqlparser.test.select.SelectTest): expected:<...WHERE mytable.col = []9 ORDER BY mytable.i...> but was:<...WHERE mytable.col = [PRIOR ]9 ORDER BY mytable.i...>
  testSelectJoin(net.sf.jsqlparser.test.select.SelectTest): expected:<...s ON pg_class.oid = [pg_constraint.conrelid JOIN pg_attribute ON pg_attribute.attrelid = pg_constraint.conrelid WHERE pg_constraint.contype = 'u' AND (pg_attribute.attnum =] ANY(pg_constraint.c...> but was:<...s ON pg_class.oid = [PRIOR pg_constraint.conrelid JOIN pg_attribute ON pg_attribute.attrelid = PRIOR pg_constraint.conrelid WHERE pg_constraint.contype = PRIOR 'u' AND (pg_attribute.attnum = PRIOR] ANY(pg_constraint.c...>
  testCaseElseAddition(net.sf.jsqlparser.test.select.SelectTest): expected:<...T CASE WHEN 1 + 3 > []20 THEN 0 ELSE 1000 ...> but was:<...T CASE WHEN 1 + 3 > [PRIOR ]20 THEN 0 ELSE 1000 ...>
  testNamedParameter2(net.sf.jsqlparser.test.select.SelectTest): expected:<...M mytable WHERE a = [:param OR a = :param2 AND b =] :param3> but was:<...M mytable WHERE a = [PRIOR :param OR a = PRIOR :param2 AND b = PRIOR] :param3>
  testNamedParameter(net.sf.jsqlparser.test.select.SelectTest): expected:<...M mytable WHERE b = []:param> but was:<...M mytable WHERE b = [PRIOR ]:param>
  testAddJoin(net.sf.jsqlparser.util.SelectUtilsTest): expected:<...OIN mytable2 ON a = []b> but was:<...OIN mytable2 ON a = [PRIOR ]b>
  testParseCondExpression(net.sf.jsqlparser.parser.CCJSqlParserUtilTest): expected:<a + b > [5 AND c <] 3> but was:<a + b > [PRIOR 5 AND c < PRIOR] 3>

Tests run: 353, Failures: 76, Errors: 0, Skipped: 0

[INFO] ------------------------------------------------------------------------
[INFO] BUILD FAILURE
[INFO] ------------------------------------------------------------------------
[INFO] Total time: 15.753s
[INFO] Finished at: Tue Oct 06 07:01:53 CEST 2015
[INFO] Final Memory: 23M/346M
[INFO] ------------------------------------------------------------------------
[ERROR] Failed to execute goal org.apache.maven.plugins:maven-surefire-plugin:2.10:test (default-test) on project jsqlparser: There are test failures.
[ERROR] 
[ERROR] Please refer to /home/perham/Study/Experiments/2015-10-23-ICST/LittleDarwin/Cases/JSqlParser-jsqlparser-0.9.4/target/surefire-reports for the individual test results.
[ERROR] -> [Help 1]
[ERROR] 
[ERROR] To see the full stack trace of the errors, re-run Maven with the -e switch.
[ERROR] Re-run Maven using the -X switch to enable full debug logging.
[ERROR] 
[ERROR] For more information about the errors and possible solutions, please read the following articles:
[ERROR] [Help 1] http://cwiki.apache.org/confluence/display/MAVEN/MojoFailureException
