[INFO] Scanning for projects...
[INFO]                                                                         
[INFO] ------------------------------------------------------------------------
[INFO] Building JSQLParser library 0.9.4
[INFO] ------------------------------------------------------------------------
[INFO] 
[INFO] --- javacc-maven-plugin:2.6:jjtree-javacc (javacc) @ jsqlparser ---
[INFO] Skipping - all parsers are up to date
[INFO] 
[INFO] --- license-maven-plugin:1.6:update-file-header (first) @ jsqlparser ---
[INFO] Will search files to update from root /home/perham/Study/Experiments/2015-10-23-ICST/LittleDarwin/Cases/JSqlParser-jsqlparser-0.9.4/src/main/java
[INFO]  - adding license header on file /home/perham/Study/Experiments/2015-10-23-ICST/LittleDarwin/Cases/JSqlParser-jsqlparser-0.9.4/src/main/java/net/sf/jsqlparser/expression/operators/relational/OldOracleJoinBinaryExpression.java
[INFO] Scan 164 files header done in 216.232ms.
[INFO] 
 * uptodate header on 163 files.
 * add header on 1 file.
[INFO] 
[INFO] --- maven-resources-plugin:2.6:resources (default-resources) @ jsqlparser ---
[INFO] Using 'UTF-8' encoding to copy filtered resources.
[INFO] skip non existing resourceDirectory /home/perham/Study/Experiments/2015-10-23-ICST/LittleDarwin/Cases/JSqlParser-jsqlparser-0.9.4/src/main/resources
[INFO] 
[INFO] --- maven-compiler-plugin:3.3:compile (default-compile) @ jsqlparser ---
[INFO] Changes detected - recompiling the module!
[INFO] Compiling 177 source files to /home/perham/Study/Experiments/2015-10-23-ICST/LittleDarwin/Cases/JSqlParser-jsqlparser-0.9.4/target/classes
[WARNING] bootstrap class path not set in conjunction with -source 1.6
[INFO] /home/perham/Study/Experiments/2015-10-23-ICST/LittleDarwin/Cases/JSqlParser-jsqlparser-0.9.4/target/generated-sources/javacc/net/sf/jsqlparser/parser/CCJSqlParser.java: /home/perham/Study/Experiments/2015-10-23-ICST/LittleDarwin/Cases/JSqlParser-jsqlparser-0.9.4/target/generated-sources/javacc/net/sf/jsqlparser/parser/CCJSqlParser.java uses unchecked or unsafe operations.
[INFO] /home/perham/Study/Experiments/2015-10-23-ICST/LittleDarwin/Cases/JSqlParser-jsqlparser-0.9.4/target/generated-sources/javacc/net/sf/jsqlparser/parser/CCJSqlParser.java: Recompile with -Xlint:unchecked for details.
[INFO] 
[INFO] --- maven-resources-plugin:2.6:testResources (default-testResources) @ jsqlparser ---
[INFO] Using 'UTF-8' encoding to copy filtered resources.
[INFO] Copying 280 resources
[INFO] 
[INFO] --- maven-compiler-plugin:3.3:testCompile (default-testCompile) @ jsqlparser ---
[INFO] Nothing to compile - all classes are up to date
[INFO] 
[INFO] --- maven-surefire-plugin:2.10:test (default-test) @ jsqlparser ---
[INFO] Surefire report directory: /home/perham/Study/Experiments/2015-10-23-ICST/LittleDarwin/Cases/JSqlParser-jsqlparser-0.9.4/target/surefire-reports

-------------------------------------------------------
 T E S T S
-------------------------------------------------------
Running net.sf.jsqlparser.test.alter.AlterTest
Tests run: 3, Failures: 0, Errors: 0, Skipped: 0, Time elapsed: 0.056 sec
Running net.sf.jsqlparser.test.create.CreateTableTest
Tests run: 27, Failures: 1, Errors: 0, Skipped: 0, Time elapsed: 0.132 sec <<< FAILURE!
Running net.sf.jsqlparser.test.create.CreateIndexTest
Tests run: 6, Failures: 0, Errors: 0, Skipped: 0, Time elapsed: 0 sec
Running net.sf.jsqlparser.test.create.CreateViewTest
Tests run: 8, Failures: 1, Errors: 0, Skipped: 0, Time elapsed: 0.005 sec <<< FAILURE!
Running net.sf.jsqlparser.test.delete.DeleteTest
Tests run: 2, Failures: 2, Errors: 0, Skipped: 0, Time elapsed: 0.005 sec <<< FAILURE!
Running net.sf.jsqlparser.test.simpleparsing.CCJSqlParserManagerTest
Tests run: 1, Failures: 0, Errors: 0, Skipped: 0, Time elapsed: 0.182 sec
Running net.sf.jsqlparser.test.drop.DropTest
Tests run: 2, Failures: 0, Errors: 0, Skipped: 0, Time elapsed: 0.001 sec
Running net.sf.jsqlparser.test.insert.InsertTest
Tests run: 15, Failures: 0, Errors: 0, Skipped: 0, Time elapsed: 0.043 sec
Running net.sf.jsqlparser.test.TestUtils
Tests run: 1, Failures: 0, Errors: 0, Skipped: 0, Time elapsed: 0.001 sec
Running net.sf.jsqlparser.test.update.UpdateTest
Tests run: 7, Failures: 3, Errors: 0, Skipped: 0, Time elapsed: 0.007 sec <<< FAILURE!
Running net.sf.jsqlparser.test.replace.ReplaceTest
Tests run: 4, Failures: 0, Errors: 0, Skipped: 0, Time elapsed: 0.001 sec
Running net.sf.jsqlparser.test.select.SelectASTTest
*Statement
* Column
* Column
* Table
* Column
* Column
Tests run: 2, Failures: 0, Errors: 0, Skipped: 0, Time elapsed: 0.001 sec
Running net.sf.jsqlparser.test.select.SpecialOracleTest
Oct 06, 2015 7:02:18 AM net.sf.jsqlparser.test.select.SpecialOracleTest testAllSqlsParseDeparse
INFO: testing string01.sql
Oct 06, 2015 7:02:19 AM net.sf.jsqlparser.test.select.SpecialOracleTest testAllSqlsParseDeparse
INFO:    -> PROBLEM net.sf.jsqlparser.JSQLParserException
Oct 06, 2015 7:02:19 AM net.sf.jsqlparser.test.select.SpecialOracleTest testAllSqlsParseDeparse
INFO: testing returning01.sql
Oct 06, 2015 7:02:19 AM net.sf.jsqlparser.test.select.SpecialOracleTest testAllSqlsParseDeparse
INFO:    -> PROBLEM net.sf.jsqlparser.JSQLParserException
Oct 06, 2015 7:02:19 AM net.sf.jsqlparser.test.select.SpecialOracleTest testAllSqlsParseDeparse
INFO: testing keywordasidentifier05.sql
Oct 06, 2015 7:02:19 AM net.sf.jsqlparser.test.select.SpecialOracleTest testAllSqlsParseDeparse
INFO:    -> SUCCESS
Oct 06, 2015 7:02:19 AM net.sf.jsqlparser.test.select.SpecialOracleTest testAllSqlsParseDeparse
INFO: testing function07.sql
Oct 06, 2015 7:02:19 AM net.sf.jsqlparser.test.select.SpecialOracleTest testAllSqlsParseDeparse
INFO:    -> PROBLEM net.sf.jsqlparser.JSQLParserException
Oct 06, 2015 7:02:19 AM net.sf.jsqlparser.test.select.SpecialOracleTest testAllSqlsParseDeparse
INFO: testing cast_multiset15.sql
Oct 06, 2015 7:02:19 AM net.sf.jsqlparser.test.select.SpecialOracleTest testAllSqlsParseDeparse
INFO:    -> PROBLEM net.sf.jsqlparser.JSQLParserException
Oct 06, 2015 7:02:19 AM net.sf.jsqlparser.test.select.SpecialOracleTest testAllSqlsParseDeparse
INFO: testing interval01.sql
Oct 06, 2015 7:02:19 AM net.sf.jsqlparser.test.select.SpecialOracleTest testAllSqlsParseDeparse
INFO:    -> PROBLEM net.sf.jsqlparser.JSQLParserException
Oct 06, 2015 7:02:19 AM net.sf.jsqlparser.test.select.SpecialOracleTest testAllSqlsParseDeparse
INFO: testing analytic_query04.sql
Oct 06, 2015 7:02:19 AM net.sf.jsqlparser.test.select.SpecialOracleTest testAllSqlsParseDeparse
INFO:    -> PROBLEM net.sf.jsqlparser.JSQLParserException
Oct 06, 2015 7:02:19 AM net.sf.jsqlparser.test.select.SpecialOracleTest testAllSqlsParseDeparse
INFO: testing join10.sql
Oct 06, 2015 7:02:19 AM net.sf.jsqlparser.test.select.SpecialOracleTest testAllSqlsParseDeparse
INFO:    -> SUCCESS
Oct 06, 2015 7:02:19 AM net.sf.jsqlparser.test.select.SpecialOracleTest testAllSqlsParseDeparse
INFO: testing pivot04.sql
Oct 06, 2015 7:02:19 AM net.sf.jsqlparser.test.select.SpecialOracleTest testAllSqlsParseDeparse
INFO:    -> PROBLEM net.sf.jsqlparser.JSQLParserException
Oct 06, 2015 7:02:19 AM net.sf.jsqlparser.test.select.SpecialOracleTest testAllSqlsParseDeparse
INFO: testing condition08.sql
Oct 06, 2015 7:02:19 AM net.sf.jsqlparser.test.select.SpecialOracleTest testAllSqlsParseDeparse
INFO:    -> PROBLEM net.sf.jsqlparser.JSQLParserException
Oct 06, 2015 7:02:19 AM net.sf.jsqlparser.test.select.SpecialOracleTest testAllSqlsParseDeparse
INFO: testing function03.sql
Oct 06, 2015 7:02:19 AM net.sf.jsqlparser.test.select.SpecialOracleTest testAllSqlsParseDeparse
INFO:    -> PROBLEM net.sf.jsqlparser.JSQLParserException
Oct 06, 2015 7:02:19 AM net.sf.jsqlparser.test.select.SpecialOracleTest testAllSqlsParseDeparse
INFO: testing merge03.sql
Oct 06, 2015 7:02:19 AM net.sf.jsqlparser.test.select.SpecialOracleTest testAllSqlsParseDeparse
INFO:    -> PROBLEM net.sf.jsqlparser.JSQLParserException
Oct 06, 2015 7:02:19 AM net.sf.jsqlparser.test.select.SpecialOracleTest testAllSqlsParseDeparse
INFO: testing insert02.sql
Oct 06, 2015 7:02:19 AM net.sf.jsqlparser.test.select.SpecialOracleTest testAllSqlsParseDeparse
INFO:    -> PROBLEM net.sf.jsqlparser.JSQLParserException
Oct 06, 2015 7:02:19 AM net.sf.jsqlparser.test.select.SpecialOracleTest testAllSqlsParseDeparse
INFO: testing insert11.sql
Oct 06, 2015 7:02:19 AM net.sf.jsqlparser.test.select.SpecialOracleTest testAllSqlsParseDeparse
INFO:    -> PROBLEM net.sf.jsqlparser.JSQLParserException
Oct 06, 2015 7:02:19 AM net.sf.jsqlparser.test.select.SpecialOracleTest testAllSqlsParseDeparse
INFO: testing interval02.sql
Oct 06, 2015 7:02:19 AM net.sf.jsqlparser.test.select.SpecialOracleTest testAllSqlsParseDeparse
INFO:    -> SUCCESS
Oct 06, 2015 7:02:19 AM net.sf.jsqlparser.test.select.SpecialOracleTest testAllSqlsParseDeparse
INFO: testing cast_multiset18.sql
Oct 06, 2015 7:02:19 AM net.sf.jsqlparser.test.select.SpecialOracleTest testAllSqlsParseDeparse
INFO:    -> PROBLEM net.sf.jsqlparser.JSQLParserException
Oct 06, 2015 7:02:19 AM net.sf.jsqlparser.test.select.SpecialOracleTest testAllSqlsParseDeparse
INFO: testing query_factoring08.sql
Oct 06, 2015 7:02:19 AM net.sf.jsqlparser.test.select.SpecialOracleTest testAllSqlsOnlyParse
INFO: testing comment02.sql
Oct 06, 2015 7:02:19 AM net.sf.jsqlparser.test.select.SpecialOracleTest testAllSqlsOnlyParse
INFO:    -> SUCCESS
Oct 06, 2015 7:02:19 AM net.sf.jsqlparser.test.select.SpecialOracleTest testAllSqlsOnlyParse
INFO: testing numbers02.sql
Oct 06, 2015 7:02:19 AM net.sf.jsqlparser.test.select.SpecialOracleTest testAllSqlsOnlyParse
INFO:    -> SUCCESS
Oct 06, 2015 7:02:19 AM net.sf.jsqlparser.test.select.SpecialOracleTest testAllSqlsOnlyParse
INFO: testing comment01.sql
Oct 06, 2015 7:02:19 AM net.sf.jsqlparser.test.select.SpecialOracleTest testAllSqlsOnlyParse
INFO:    -> SUCCESS
Tests run: 2, Failures: 1, Errors: 0, Skipped: 0, Time elapsed: 0.374 sec <<< FAILURE!
Running net.sf.jsqlparser.test.select.SelectTest
Tests run: 228, Failures: 66, Errors: 0, Skipped: 0, Time elapsed: 0.297 sec <<< FAILURE!
Running net.sf.jsqlparser.test.select.SpeedTest
42500 statements parsed in 7727 milliseconds
 (5500 statements per second,  0.0001818 seconds per statement )
38500 select scans for table name executed in 132 milliseconds
 (291666 select scans for table name per second,  0.0000034 seconds per select scans for table name)
Tests run: 1, Failures: 0, Errors: 0, Skipped: 0, Time elapsed: 7.857 sec
Running net.sf.jsqlparser.test.truncate.TruncateTest
Tests run: 1, Failures: 0, Errors: 0, Skipped: 0, Time elapsed: 0.001 sec
Running net.sf.jsqlparser.util.TablesNamesFinderTest
Tests run: 19, Failures: 0, Errors: 0, Skipped: 0, Time elapsed: 0.011 sec
Running net.sf.jsqlparser.util.ConnectExpressionsVisitorTest
Tests run: 2, Failures: 0, Errors: 0, Skipped: 0, Time elapsed: 0.004 sec
Running net.sf.jsqlparser.util.AddAliasesVisitorTest
Tests run: 4, Failures: 0, Errors: 0, Skipped: 0, Time elapsed: 0.002 sec
Running net.sf.jsqlparser.util.SelectUtilsTest
Tests run: 6, Failures: 1, Errors: 0, Skipped: 0, Time elapsed: 0.005 sec <<< FAILURE!
Running net.sf.jsqlparser.expression.ExpressionVisitorAdapterTest
Tests run: 2, Failures: 0, Errors: 0, Skipped: 0, Time elapsed: 0.003 sec
Running net.sf.jsqlparser.expression.SignedExpressionTest
Tests run: 1, Failures: 0, Errors: 0, Skipped: 0, Time elapsed: 0.001 sec
Running net.sf.jsqlparser.schema.ServerTest
Tests run: 2, Failures: 0, Errors: 0, Skipped: 0, Time elapsed: 0.001 sec
Running net.sf.jsqlparser.parser.CCJSqlParserUtilTest
Tests run: 3, Failures: 1, Errors: 0, Skipped: 0, Time elapsed: 0.001 sec <<< FAILURE!
Running net.sf.jsqlparser.statement.SetStatementTest
Tests run: 1, Failures: 0, Errors: 0, Skipped: 0, Time elapsed: 0.002 sec
Running net.sf.jsqlparser.statement.AdaptersTest
Tests run: 1, Failures: 0, Errors: 0, Skipped: 0, Time elapsed: 0.001 sec
Running net.sf.jsqlparser.statement.StatementsTest
Tests run: 1, Failures: 0, Errors: 0, Skipped: 0, Time elapsed: 0.001 sec
Running net.sf.jsqlparser.statement.execute.ExecuteTest
Tests run: 1, Failures: 0, Errors: 0, Skipped: 0, Time elapsed: 0.001 sec

Results :

Failed tests:   testCreateTableAsSelect2(net.sf.jsqlparser.test.create.CreateTableTest): expected:<...M b INNER JOIN a ON []b.col1 = a.col1> but was:<...M b INNER JOIN a ON [PRIOR ]b.col1 = a.col1>
  testCreateView4(net.sf.jsqlparser.test.create.CreateViewTest): expected:<...ER JOIN testtab2 ON []testtab.col1 = testt...> but was:<...ER JOIN testtab2 ON [PRIOR ]testtab.col1 = testt...>
  testDelete(net.sf.jsqlparser.test.delete.DeleteTest): expected:<... FROM mytable WHERE []mytable.col = 9> but was:<... FROM mytable WHERE [PRIOR ]mytable.col = 9>
  testDeleteWhereProblem1(net.sf.jsqlparser.test.delete.DeleteTest): expected:<...ROM tablename WHERE [a = 1 AND] b = 1> but was:<...ROM tablename WHERE [PRIOR a = 1 AND PRIOR] b = 1>
  testUpdateWithFrom(net.sf.jsqlparser.test.update.UpdateTest): expected:<...LEFT JOIN table2 ON []col1 = col2> but was:<...LEFT JOIN table2 ON [PRIOR ]col1 = col2>
  testUpdateMultiTable(net.sf.jsqlparser.test.update.UpdateTest): expected:<...3 = 'UPDATED' WHERE [T1.C1 = T2.C1 AND] T1.C2 < 10> but was:<...3 = 'UPDATED' WHERE [PRIOR T1.C1 = T2.C1 AND PRIOR] T1.C2 < 10>
  testUpdateWithDeparser(net.sf.jsqlparser.test.update.UpdateTest): expected:<...lumna = 'XXX' WHERE []A.cod_table = 'YYY'> but was:<...lumna = 'XXX' WHERE [PRIOR ]A.cod_table = 'YYY'>
  testAllSqlsParseDeparse(net.sf.jsqlparser.test.select.SpecialOracleTest): expected:<...*from t2 join t3 on([t2.a2=t3.a3))select*from x1 join x2 on(x1.a1=x2.a2)join t4 on(]x1.a1=t4.a4)> but was:<...*from t2 join t3 on([prior t2.a2=t3.a3))select*from x1 join x2 on(prior x1.a1=x2.a2)join t4 on(prior ]x1.a1=t4.a4)>
  testAllConditionSubSelect(net.sf.jsqlparser.test.select.SelectTest): expected:<...l FROM emp e1 WHERE [e1.sal > ALL (SELECT e2.sal FROM emp e2 WHERE] e2.deptno = 10)> but was:<...l FROM emp e1 WHERE [PRIOR e1.sal > ALL (SELECT e2.sal FROM emp e2 WHERE PRIOR] e2.deptno = 10)>
  testSelectForUpdateOfTable(net.sf.jsqlparser.test.select.SelectTest): expected:<...FROM foo, bar WHERE []foo.id = bar.foo_id ...> but was:<...FROM foo, bar WHERE [PRIOR ]foo.id = bar.foo_id ...>
  testOracleJoin2(net.sf.jsqlparser.test.select.SelectTest): expected:<...le1, tabelle2 WHERE []tabelle1.a(+) = tabe...> but was:<...le1, tabelle2 WHERE [PRIOR ]tabelle1.a(+) = tabe...>
  testOracleJoin3(net.sf.jsqlparser.test.select.SelectTest): expected:<...le1, tabelle2 WHERE []tabelle1.a(+) > tabe...> but was:<...le1, tabelle2 WHERE [PRIOR ]tabelle1.a(+) > tabe...>
  testOracleJoin4(net.sf.jsqlparser.test.select.SelectTest): expected:<...le1, tabelle2 WHERE []tabelle1.a(+) = tabe...> but was:<...le1, tabelle2 WHERE [PRIOR ]tabelle1.a(+) = tabe...>
  testOrderBy(net.sf.jsqlparser.test.select.SelectTest): expected:<...T * FROM tab1 WHERE []a > 34 GROUP BY tab1...> but was:<...T * FROM tab1 WHERE [PRIOR ]a > 34 GROUP BY tab1...>
  testSelectJoinWithComma(net.sf.jsqlparser.test.select.SelectTest): expected:<...estados AS es WHERE [es.nombre = "Tamaulipas" AND] cb.the_geom = es.ge...> but was:<...estados AS es WHERE [PRIOR es.nombre = "Tamaulipas" AND PRIOR] cb.the_geom = es.ge...>
  testTop(net.sf.jsqlparser.test.select.SelectTest): expected:<... FROM mytable WHERE []mytable.col = 9> but was:<... FROM mytable WHERE [PRIOR ]mytable.col = 9>
  testMysqlQuote(net.sf.jsqlparser.test.select.SelectTest): expected:<...ANTIQUES AS b WHERE [b.BUYERID = a.OWNERID AND] b.ITEM = 'Chair'> but was:<...ANTIQUES AS b WHERE [PRIOR b.BUYERID = a.OWNERID AND PRIOR] b.ITEM = 'Chair'>
  testLimit(net.sf.jsqlparser.test.select.SelectTest): expected:<... FROM mytable WHERE []mytable.col = 9 LIMI...> but was:<... FROM mytable WHERE [PRIOR ]mytable.col = 9 LIMI...>
  testUnion(net.sf.jsqlparser.test.select.SelectTest): expected:<... FROM mytable WHERE [mytable.col = 9) UNION (SELECT * FROM mytable3 WHERE] mytable3.col = ?) U...> but was:<... FROM mytable WHERE [PRIOR mytable.col = 9) UNION (SELECT * FROM mytable3 WHERE PRIOR] mytable3.col = ?) U...>
  testWhere(net.sf.jsqlparser.test.select.SelectTest): expected:<...T * FROM tab1 WHERE [](a + b + c / d + e *...> but was:<...T * FROM tab1 WHERE [PRIOR ](a + b + c / d + e *...>
  testCase(net.sf.jsqlparser.test.select.SelectTest): expected:<...LECT a, (CASE WHEN ([]a > 2) THEN 3 END) A...> but was:<...LECT a, (CASE WHEN ([PRIOR ]a > 2) THEN 3 END) A...>
  testFrom(net.sf.jsqlparser.test.select.SelectTest): expected:<...) AS mytable4 WHERE []mytable.col = 9> but was:<...) AS mytable4 WHERE [PRIOR ]mytable.col = 9>
  testJoin(net.sf.jsqlparser.test.select.SelectTest): expected:<... OUTER JOIN tab2 ON []tab1.id = tab2.id> but was:<... OUTER JOIN tab2 ON [PRIOR ]tab1.id = tab2.id>
  testTime(net.sf.jsqlparser.test.select.SelectTest): expected:<...T * FROM tab1 WHERE []a > {t '04:05:34'}> but was:<...T * FROM tab1 WHERE [PRIOR ]a > {t '04:05:34'}>
  testWith(net.sf.jsqlparser.test.select.SelectTest): expected:<...JOIN DINFOMAX WHERE [THIS_EMP.JOB = 'SALESREP' AND] THIS_EMP.WORKDEPT =...> but was:<...JOIN DINFOMAX WHERE [PRIOR THIS_EMP.JOB = 'SALESREP' AND PRIOR] THIS_EMP.WORKDEPT =...>
  testProblemSqlAnalytic8Complex(net.sf.jsqlparser.test.select.SelectTest): expected:<...S2 FROM STAFF WHERE []ID < 60 ORDER BY ID> but was:<...S2 FROM STAFF WHERE [PRIOR ]ID < 60 ORDER BY ID>
  testOracleJoin2_1(net.sf.jsqlparser.test.select.SelectTest): expected:<...lle1,tabelle2 where []tabelle1.a(+)=tabell...> but was:<...lle1,tabelle2 where [prior ]tabelle1.a(+)=tabell...>
  testOracleJoin2_2(net.sf.jsqlparser.test.select.SelectTest): expected:<...lle1,tabelle2 where []tabelle1.a=tabelle2....> but was:<...lle1,tabelle2 where [prior ]tabelle1.a=tabelle2....>
  testOracleJoin3_1(net.sf.jsqlparser.test.select.SelectTest): expected:<...le1, tabelle2 WHERE []tabelle1.a > tabelle...> but was:<...le1, tabelle2 WHERE [PRIOR ]tabelle1.a > tabelle...>
  testAnyConditionSubSelect(net.sf.jsqlparser.test.select.SelectTest): expected:<...l FROM emp e1 WHERE [e1.sal > ANY (SELECT e2.sal FROM emp e2 WHERE] e2.deptno = 10)> but was:<...l FROM emp e1 WHERE [PRIOR e1.sal > ANY (SELECT e2.sal FROM emp e2 WHERE PRIOR] e2.deptno = 10)>
  testMultiTableJoin(net.sf.jsqlparser.test.select.SelectTest): expected:<... INNER JOIN tabb ON [taba.a = tabb.a, tabc LEFT JOIN tabd ON] tabc.c = tabd.c> but was:<... INNER JOIN tabb ON [PRIOR taba.a = tabb.a, tabc LEFT JOIN tabd ON PRIOR] tabc.c = tabd.c>
  testIssue160_signedParameter2(net.sf.jsqlparser.test.select.SelectTest): expected:<... FROM mytable WHERE []-? = 5> but was:<... FROM mytable WHERE [PRIOR ]-? = 5>
  testLateral1(net.sf.jsqlparser.test.select.SelectTest): expected:<...INES AS LINES WHERE []LINES.ORDERID = O.OR...> but was:<...INES AS LINES WHERE [PRIOR ]LINES.ORDERID = O.OR...>
  testSelectNumericBind(net.sf.jsqlparser.test.select.SelectTest): expected:<...LECT a FROM b WHERE []c = :1> but was:<...LECT a FROM b WHERE [PRIOR ]c = :1>
  testLateralComplex1(net.sf.jsqlparser.test.select.SelectTest): expected:<...ERLINES LINES WHERE [LINES.ORDERID = O.ORDERID) AS OL, LATERAL(SELECT SUM(CHGAMT) AS ORDCHGTOTAL FROM ORDERCHARGES CHARGES WHERE LINES.ORDERID = O.ORDERID) AS OC, LATERAL(SELECT SUM(TAXAMT) AS TAXTOTAL FROM ORDERTAXES TAXES WHERE] TAXES.ORDERID = O.O...> but was:<...ERLINES LINES WHERE [PRIOR LINES.ORDERID = O.ORDERID) AS OL, LATERAL(SELECT SUM(CHGAMT) AS ORDCHGTOTAL FROM ORDERCHARGES CHARGES WHERE PRIOR LINES.ORDERID = O.ORDERID) AS OC, LATERAL(SELECT SUM(TAXAMT) AS TAXTOTAL FROM ORDERTAXES TAXES WHERE PRIOR] TAXES.ORDERID = O.O...>
  testSelectItems(net.sf.jsqlparser.test.select.SelectTest): expected:<... FROM mytable WHERE []mytable.col = 9> but was:<... FROM mytable WHERE [PRIOR ]mytable.col = 9>
  testSelectJoin2(net.sf.jsqlparser.test.select.SelectTest): expected:<...pg_constraint WHERE []pg_attribute.attnum ...> but was:<...pg_constraint WHERE [PRIOR ]pg_attribute.attnum ...>
  testWithRecursive(net.sf.jsqlparser.test.select.SelectTest): expected:<... n + 1 FROM t WHERE []n < 100)) SELECT sum...> but was:<... n + 1 FROM t WHERE [PRIOR ]n < 100)) SELECT sum...>
  testWithUnionProblem3(net.sf.jsqlparser.test.select.SelectTest): expected:<...NNER JOIN tableb ON [tablea.mslink = tableb.mslink AND tableb.deleted = 0 WHERE tablea.fname IS NULL AND] 1 = 0) UNION ALL (S...> but was:<...NNER JOIN tableb ON [PRIOR tablea.mslink = tableb.mslink AND PRIOR tableb.deleted = 0 WHERE tablea.fname IS NULL AND PRIOR] 1 = 0) UNION ALL (S...>
  testWithUnionProblem4(net.sf.jsqlparser.test.select.SelectTest): expected:<...OIN tableb AS ba ON [gl.mslink = ba.gl_mslink INNER JOIN tablec AS ae ON gl.mslink = ae.mslink AND ae.deleted = 0 WHERE gl.parent IS NULL AND gl.mslink <> 0) UNION ALL (SELECT gl.mslink, ba.gl_name AS txt, ba.gl_nummer AS nr, hist.level + 1 AS level, CAST(hist.path + '.' + CAST(gl.mslink AS VARCHAR) AS VARCHAR) AS path, ae.feature FROM tablea AS gl INNER JOIN tableb AS ba ON gl.mslink = ba.gl_mslink INNER JOIN tablec AS ae ON gl.mslink = ae.mslink AND ae.deleted = 0 INNER JOIN hist ON gl.parent = hist.mslink WHERE gl.mslink <> 0)) SELECT mslink, space(level * 4) + txt AS txt, nr, feature, path FROM hist WHERE EXISTS (SELECT feature FROM tablec WHERE mslink = 0 AND ((feature IN (1, 2) AND hist.feature = 3) OR (feature IN (4) AND] hist.feature = 2)))> but was:<...OIN tableb AS ba ON [PRIOR gl.mslink = ba.gl_mslink INNER JOIN tablec AS ae ON PRIOR gl.mslink = ae.mslink AND PRIOR ae.deleted = 0 WHERE gl.parent IS NULL AND PRIOR gl.mslink <> 0) UNION ALL (SELECT gl.mslink, ba.gl_name AS txt, ba.gl_nummer AS nr, hist.level + 1 AS level, CAST(hist.path + '.' + CAST(gl.mslink AS VARCHAR) AS VARCHAR) AS path, ae.feature FROM tablea AS gl INNER JOIN tableb AS ba ON PRIOR gl.mslink = ba.gl_mslink INNER JOIN tablec AS ae ON PRIOR gl.mslink = ae.mslink AND PRIOR ae.deleted = 0 INNER JOIN hist ON PRIOR gl.parent = hist.mslink WHERE PRIOR gl.mslink <> 0)) SELECT mslink, space(level * 4) + txt AS txt, nr, feature, path FROM hist WHERE EXISTS (SELECT feature FROM tablec WHERE PRIOR mslink = 0 AND ((feature IN (1, 2) AND PRIOR hist.feature = 3) OR (feature IN (4) AND PRIOR] hist.feature = 2)))>
  testWithUnionProblem5(net.sf.jsqlparser.test.select.SelectTest): expected:<...OIN tableb AS ba ON [gl.mslink = ba.gl_mslink INNER JOIN tablec AS ae ON gl.mslink = ae.mslink AND ae.deleted = 0 WHERE gl.parent IS NULL AND gl.mslink <> 0) UNION ALL (SELECT gl.mslink, ba.gl_name AS txt, ba.gl_nummer AS nr, hist.level + 1 AS level, CAST(hist.path + '.' + CAST(gl.mslink AS VARCHAR) AS VARCHAR) AS path, 5 AS feature FROM tablea AS gl INNER JOIN tableb AS ba ON gl.mslink = ba.gl_mslink INNER JOIN tablec AS ae ON gl.mslink = ae.mslink AND ae.deleted = 0 INNER JOIN hist ON gl.parent = hist.mslink WHERE] gl.mslink <> 0)) SE...> but was:<...OIN tableb AS ba ON [PRIOR gl.mslink = ba.gl_mslink INNER JOIN tablec AS ae ON PRIOR gl.mslink = ae.mslink AND PRIOR ae.deleted = 0 WHERE gl.parent IS NULL AND PRIOR gl.mslink <> 0) UNION ALL (SELECT gl.mslink, ba.gl_name AS txt, ba.gl_nummer AS nr, hist.level + 1 AS level, CAST(hist.path + '.' + CAST(gl.mslink AS VARCHAR) AS VARCHAR) AS path, 5 AS feature FROM tablea AS gl INNER JOIN tableb AS ba ON PRIOR gl.mslink = ba.gl_mslink INNER JOIN tablec AS ae ON PRIOR gl.mslink = ae.mslink AND PRIOR ae.deleted = 0 INNER JOIN hist ON PRIOR gl.parent = hist.mslink WHERE PRIOR] gl.mslink <> 0)) SE...>
  testGroupBy(net.sf.jsqlparser.test.select.SelectTest): expected:<...T * FROM tab1 WHERE []a > 34 GROUP BY tab1...> but was:<...T * FROM tab1 WHERE [PRIOR ]a > 34 GROUP BY tab1...>
  testLimitSqlServer1(net.sf.jsqlparser.test.select.SelectTest): expected:<... FROM mytable WHERE []mytable.col = 9 ORDE...> but was:<... FROM mytable WHERE [PRIOR ]mytable.col = 9 ORDE...>
  testLimitSqlServer2(net.sf.jsqlparser.test.select.SelectTest): expected:<... FROM mytable WHERE []mytable.col = 9 ORDE...> but was:<... FROM mytable WHERE [PRIOR ]mytable.col = 9 ORDE...>
  testLimitSqlServer3(net.sf.jsqlparser.test.select.SelectTest): expected:<... FROM mytable WHERE []mytable.col = 9 ORDE...> but was:<... FROM mytable WHERE [PRIOR ]mytable.col = 9 ORDE...>
  testLimitSqlServer4(net.sf.jsqlparser.test.select.SelectTest): expected:<... FROM mytable WHERE []mytable.col = 9 ORDE...> but was:<... FROM mytable WHERE [PRIOR ]mytable.col = 9 ORDE...>
  testNotEqualsTo(net.sf.jsqlparser.test.select.SelectTest): expected:<...CT * FROM foo WHERE []a != b> but was:<...CT * FROM foo WHERE [PRIOR ]a != b>
  testMatches(net.sf.jsqlparser.test.select.SelectTest): expected:<...T * FROM team WHERE []team.search_column @...> but was:<...T * FROM team WHERE [PRIOR ]team.search_column @...>
  testFunctions(net.sf.jsqlparser.test.select.SelectTest): expected:<... FROM mytable WHERE []mytable.col = 9> but was:<... FROM mytable WHERE [PRIOR ]mytable.col = 9>
  testSelectOrderHaving(net.sf.jsqlparser.test.select.SelectTest): expected:<...OUP BY units HAVING []count(units) > 1 ORD...> but was:<...OUP BY units HAVING [PRIOR ]count(units) > 1 ORD...>
  testIssue154_2(net.sf.jsqlparser.test.select.SelectTest): expected:<...e FROM role r WHERE []r.merchant_id = ? AN...> but was:<...e FROM role r WHERE [PRIOR ]r.merchant_id = ? AN...>
  testTimestamp(net.sf.jsqlparser.test.select.SelectTest): expected:<...T * FROM tab1 WHERE []a > {ts '2004-04-30 ...> but was:<...T * FROM tab1 WHERE [PRIOR ]a > {ts '2004-04-30 ...>
  testComplexUnion1(net.sf.jsqlparser.test.select.SelectTest): expected:<....e FROM mytab WHERE [mytab.del = 0) UNION (SELECT 'cde-' || coalesce(mytab2.a::varchar, '') AS a, mytab2.b, mytab2.bezeichnung AS c, 0 AS d, 0 AS e FROM mytab2 WHERE] mytab2.del = 0)> but was:<....e FROM mytab WHERE [PRIOR mytab.del = 0) UNION (SELECT 'cde-' || coalesce(mytab2.a::varchar, '') AS a, mytab2.b, mytab2.bezeichnung AS c, 0 AS d, 0 AS e FROM mytab2 WHERE PRIOR] mytab2.del = 0)>
  testDistinct(net.sf.jsqlparser.test.select.SelectTest): expected:<... FROM mytable WHERE []mytable.col = 9> but was:<... FROM mytable WHERE [PRIOR ]mytable.col = 9>
  testIssue160_signedParameter(net.sf.jsqlparser.test.select.SelectTest): expected:<...CT start_date WHERE []start_date > DATEADD...> but was:<...CT start_date WHERE [PRIOR ]start_date > DATEADD...>
  testDouble(net.sf.jsqlparser.test.select.SelectTest): expected:<... FROM mytable WHERE []mytable.col = 9> but was:<... FROM mytable WHERE [PRIOR ]mytable.col = 9>
  testHaving(net.sf.jsqlparser.test.select.SelectTest): expected:<....b) FROM tab1 WHERE [a > 34 GROUP BY tab1.b HAVING] MAX(tab1.b) > 56> but was:<....b) FROM tab1 WHERE [PRIOR a > 34 GROUP BY tab1.b HAVING PRIOR] MAX(tab1.b) > 56>
  testIssue154(net.sf.jsqlparser.test.select.SelectTest): expected:<...ount_category dc ON [d.id = dc.discount_id WHERE merchant_id = ? AND deleted = ? AND dc.discount_id IS NULL AND modified_time < ? AND] modified_time >= ? ...> but was:<...ount_category dc ON [PRIOR d.id = dc.discount_id WHERE PRIOR merchant_id = ? AND PRIOR deleted = ? AND dc.discount_id IS NULL AND PRIOR modified_time < ? AND PRIOR] modified_time >= ? ...>
  testDistinctTop(net.sf.jsqlparser.test.select.SelectTest): expected:<... FROM mytable WHERE []mytable.col = 9> but was:<... FROM mytable WHERE [PRIOR ]mytable.col = 9>
  testSelectOracleColl(net.sf.jsqlparser.test.select.SelectTest): expected:<... the_table tt WHERE []TT.COL1 = lines(idx)...> but was:<... the_table tt WHERE [PRIOR ]TT.COL1 = lines(idx)...>
  testOracleJoin(net.sf.jsqlparser.test.select.SelectTest): expected:<...le1, tabelle2 WHERE []tabelle1.a = tabelle...> but was:<...le1, tabelle2 WHERE [PRIOR ]tabelle1.a = tabelle...>
  testRowConstructor1(net.sf.jsqlparser.test.select.SelectTest): expected:<...ECT * FROM t1 WHERE [(col1, col2) = (SELECT col3, col4 FROM t2 WHERE] id = 10)> but was:<...ECT * FROM t1 WHERE [PRIOR (col1, col2) = (SELECT col3, col4 FROM t2 WHERE PRIOR] id = 10)>
  testRowConstructor2(net.sf.jsqlparser.test.select.SelectTest): expected:<...ECT * FROM t1 WHERE [ROW(col1, col2) = (SELECT col3, col4 FROM t2 WHERE] id = 10)> but was:<...ECT * FROM t1 WHERE [PRIOR ROW(col1, col2) = (SELECT col3, col4 FROM t2 WHERE PRIOR] id = 10)>
  testLimit2(net.sf.jsqlparser.test.select.SelectTest): expected:<... FROM mytable WHERE []mytable.col = 9 LIMI...> but was:<... FROM mytable WHERE [PRIOR ]mytable.col = 9 LIMI...>
  testOracleHierarchicalQuery(net.sf.jsqlparser.test.select.SelectTest): expected:<...mployees CONNECT BY []employee_id = manage...> but was:<...mployees CONNECT BY [PRIOR ]employee_id = manage...>
  testDeparser(net.sf.jsqlparser.test.select.SelectTest): expected:<...ANTIQUES AS b WHERE [b.BUYERID = a.OWNERID AND] b.ITEM = 'Chair'> but was:<...ANTIQUES AS b WHERE [PRIOR b.BUYERID = a.OWNERID AND PRIOR] b.ITEM = 'Chair'>
  testOracleHierarchicalQuery2(net.sf.jsqlparser.test.select.SelectTest): expected:<...mployees CONNECT BY [PRIOR ]employee_id = manage...> but was:<...mployees CONNECT BY []employee_id = manage...>
  testOracleHierarchicalQuery3(net.sf.jsqlparser.test.select.SelectTest): expected:<...mployees START WITH [employee_id = 100 CONNECT BY PRIOR] employee_id = manag...> but was:<...mployees START WITH [PRIOR employee_id = 100 CONNECT BY] employee_id = manag...>
  testOracleHierarchicalQuery4(net.sf.jsqlparser.test.select.SelectTest): expected:<...mployees CONNECT BY [PRIOR employee_id = manager_id START WITH] employee_id = 100 O...> but was:<...mployees CONNECT BY [employee_id = manager_id START WITH PRIOR] employee_id = 100 O...>
  testLimitSqlServerJdbcParameters(net.sf.jsqlparser.test.select.SelectTest): expected:<... FROM mytable WHERE []mytable.col = 9 ORDE...> but was:<... FROM mytable WHERE [PRIOR ]mytable.col = 9 ORDE...>
  testSelectJoin(net.sf.jsqlparser.test.select.SelectTest): expected:<...nt JOIN pg_class ON [pg_class.oid = pg_constraint.conrelid JOIN pg_attribute ON pg_attribute.attrelid = pg_constraint.conrelid WHERE pg_constraint.contype = 'u' AND (]pg_attribute.attnum ...> but was:<...nt JOIN pg_class ON [PRIOR pg_class.oid = pg_constraint.conrelid JOIN pg_attribute ON PRIOR pg_attribute.attrelid = pg_constraint.conrelid WHERE PRIOR pg_constraint.contype = 'u' AND (PRIOR ]pg_attribute.attnum ...>
  testCaseElseAddition(net.sf.jsqlparser.test.select.SelectTest): expected:<SELECT CASE WHEN []1 + 3 > 20 THEN 0 EL...> but was:<SELECT CASE WHEN [PRIOR ]1 + 3 > 20 THEN 0 EL...>
  testNamedParameter2(net.sf.jsqlparser.test.select.SelectTest): expected:<... FROM mytable WHERE [a = :param OR a = :param2 AND] b = :param3> but was:<... FROM mytable WHERE [PRIOR a = :param OR PRIOR a = :param2 AND PRIOR] b = :param3>
  testNamedParameter(net.sf.jsqlparser.test.select.SelectTest): expected:<... FROM mytable WHERE []b = :param> but was:<... FROM mytable WHERE [PRIOR ]b = :param>
  testAddJoin(net.sf.jsqlparser.util.SelectUtilsTest): expected:<...FT JOIN mytable2 ON []a = b> but was:<...FT JOIN mytable2 ON [PRIOR ]a = b>
  testParseCondExpression(net.sf.jsqlparser.parser.CCJSqlParserUtilTest): expected:<[a + b > 5 AND] c < 3> but was:<[PRIOR a + b > 5 AND PRIOR] c < 3>

Tests run: 353, Failures: 76, Errors: 0, Skipped: 0

[INFO] ------------------------------------------------------------------------
[INFO] BUILD FAILURE
[INFO] ------------------------------------------------------------------------
[INFO] Total time: 15.521s
[INFO] Finished at: Tue Oct 06 07:02:27 CEST 2015
[INFO] Final Memory: 23M/346M
[INFO] ------------------------------------------------------------------------
[ERROR] Failed to execute goal org.apache.maven.plugins:maven-surefire-plugin:2.10:test (default-test) on project jsqlparser: There are test failures.
[ERROR] 
[ERROR] Please refer to /home/perham/Study/Experiments/2015-10-23-ICST/LittleDarwin/Cases/JSqlParser-jsqlparser-0.9.4/target/surefire-reports for the individual test results.
[ERROR] -> [Help 1]
[ERROR] 
[ERROR] To see the full stack trace of the errors, re-run Maven with the -e switch.
[ERROR] Re-run Maven using the -X switch to enable full debug logging.
[ERROR] 
[ERROR] For more information about the errors and possible solutions, please read the following articles:
[ERROR] [Help 1] http://cwiki.apache.org/confluence/display/MAVEN/MojoFailureException
