[INFO] Scanning for projects...
[INFO]                                                                         
[INFO] ------------------------------------------------------------------------
[INFO] Building JSQLParser library 0.9.4
[INFO] ------------------------------------------------------------------------
[INFO] 
[INFO] --- javacc-maven-plugin:2.6:jjtree-javacc (javacc) @ jsqlparser ---
[INFO] Skipping - all parsers are up to date
[INFO] 
[INFO] --- license-maven-plugin:1.6:update-file-header (first) @ jsqlparser ---
[INFO] Will search files to update from root /home/perham/Study/Experiments/2015-10-23-ICST/LittleDarwin/Cases/JSqlParser-jsqlparser-0.9.4/src/main/java
[INFO]  - adding license header on file /home/perham/Study/Experiments/2015-10-23-ICST/LittleDarwin/Cases/JSqlParser-jsqlparser-0.9.4/src/main/java/net/sf/jsqlparser/expression/LongValue.java
[INFO] Scan 164 files header done in 225.018ms.
[INFO] 
 * uptodate header on 163 files.
 * add header on 1 file.
[INFO] 
[INFO] --- maven-resources-plugin:2.6:resources (default-resources) @ jsqlparser ---
[INFO] Using 'UTF-8' encoding to copy filtered resources.
[INFO] skip non existing resourceDirectory /home/perham/Study/Experiments/2015-10-23-ICST/LittleDarwin/Cases/JSqlParser-jsqlparser-0.9.4/src/main/resources
[INFO] 
[INFO] --- maven-compiler-plugin:3.3:compile (default-compile) @ jsqlparser ---
[INFO] Changes detected - recompiling the module!
[INFO] Compiling 177 source files to /home/perham/Study/Experiments/2015-10-23-ICST/LittleDarwin/Cases/JSqlParser-jsqlparser-0.9.4/target/classes
[WARNING] bootstrap class path not set in conjunction with -source 1.6
[INFO] /home/perham/Study/Experiments/2015-10-23-ICST/LittleDarwin/Cases/JSqlParser-jsqlparser-0.9.4/target/generated-sources/javacc/net/sf/jsqlparser/parser/CCJSqlParser.java: /home/perham/Study/Experiments/2015-10-23-ICST/LittleDarwin/Cases/JSqlParser-jsqlparser-0.9.4/target/generated-sources/javacc/net/sf/jsqlparser/parser/CCJSqlParser.java uses unchecked or unsafe operations.
[INFO] /home/perham/Study/Experiments/2015-10-23-ICST/LittleDarwin/Cases/JSqlParser-jsqlparser-0.9.4/target/generated-sources/javacc/net/sf/jsqlparser/parser/CCJSqlParser.java: Recompile with -Xlint:unchecked for details.
[INFO] 
[INFO] --- maven-resources-plugin:2.6:testResources (default-testResources) @ jsqlparser ---
[INFO] Using 'UTF-8' encoding to copy filtered resources.
[INFO] Copying 280 resources
[INFO] 
[INFO] --- maven-compiler-plugin:3.3:testCompile (default-testCompile) @ jsqlparser ---
[INFO] Nothing to compile - all classes are up to date
[INFO] 
[INFO] --- maven-surefire-plugin:2.10:test (default-test) @ jsqlparser ---
[INFO] Surefire report directory: /home/perham/Study/Experiments/2015-10-23-ICST/LittleDarwin/Cases/JSqlParser-jsqlparser-0.9.4/target/surefire-reports

-------------------------------------------------------
 T E S T S
-------------------------------------------------------
Running net.sf.jsqlparser.test.alter.AlterTest
Tests run: 3, Failures: 0, Errors: 0, Skipped: 0, Time elapsed: 0.053 sec
Running net.sf.jsqlparser.test.create.CreateTableTest
Tests run: 27, Failures: 0, Errors: 0, Skipped: 0, Time elapsed: 0.13 sec
Running net.sf.jsqlparser.test.create.CreateIndexTest
Tests run: 6, Failures: 0, Errors: 0, Skipped: 0, Time elapsed: 0.002 sec
Running net.sf.jsqlparser.test.create.CreateViewTest
Tests run: 8, Failures: 0, Errors: 0, Skipped: 0, Time elapsed: 0.011 sec
Running net.sf.jsqlparser.test.delete.DeleteTest
Tests run: 2, Failures: 0, Errors: 2, Skipped: 0, Time elapsed: 0.013 sec <<< FAILURE!
Running net.sf.jsqlparser.test.simpleparsing.CCJSqlParserManagerTest
Tests run: 1, Failures: 0, Errors: 1, Skipped: 0, Time elapsed: 0.003 sec <<< FAILURE!
Running net.sf.jsqlparser.test.drop.DropTest
Tests run: 2, Failures: 0, Errors: 0, Skipped: 0, Time elapsed: 0 sec
Running net.sf.jsqlparser.test.insert.InsertTest
Tests run: 15, Failures: 1, Errors: 1, Skipped: 0, Time elapsed: 0.044 sec <<< FAILURE!
Running net.sf.jsqlparser.test.TestUtils
Tests run: 1, Failures: 0, Errors: 0, Skipped: 0, Time elapsed: 0.001 sec
Running net.sf.jsqlparser.test.update.UpdateTest
Tests run: 7, Failures: 1, Errors: 2, Skipped: 0, Time elapsed: 0.006 sec <<< FAILURE!
Running net.sf.jsqlparser.test.replace.ReplaceTest
Tests run: 4, Failures: 2, Errors: 0, Skipped: 0, Time elapsed: 0.003 sec <<< FAILURE!
Running net.sf.jsqlparser.test.select.SelectASTTest
*Statement
* Column
* Column
* Table
* Column
* Column
Tests run: 2, Failures: 0, Errors: 0, Skipped: 0, Time elapsed: 0.004 sec
Running net.sf.jsqlparser.test.select.SpecialOracleTest
Oct 06, 2015 6:41:57 AM net.sf.jsqlparser.test.select.SpecialOracleTest testAllSqlsParseDeparse
INFO: testing string01.sql
Oct 06, 2015 6:41:57 AM net.sf.jsqlparser.test.select.SpecialOracleTest testAllSqlsParseDeparse
INFO:    -> PROBLEM net.sf.jsqlparser.JSQLParserException
Oct 06, 2015 6:41:57 AM net.sf.jsqlparser.test.select.SpecialOracleTest testAllSqlsParseDeparse
INFO: testing returning01.sql
Oct 06, 2015 6:41:57 AM net.sf.jsqlparser.test.select.SpecialOracleTest testAllSqlsParseDeparse
INFO:    -> PROBLEM net.sf.jsqlparser.JSQLParserException
Oct 06, 2015 6:41:57 AM net.sf.jsqlparser.test.select.SpecialOracleTest testAllSqlsParseDeparse
INFO: testing keywordasidentifier05.sql
Oct 06, 2015 6:41:57 AM net.sf.jsqlparser.test.select.SpecialOracleTest testAllSqlsParseDeparse
INFO:    -> SUCCESS
Oct 06, 2015 6:41:57 AM net.sf.jsqlparser.test.select.SpecialOracleTest testAllSqlsParseDeparse
INFO: testing function07.sql
Oct 06, 2015 6:41:57 AM net.sf.jsqlparser.test.select.SpecialOracleTest testAllSqlsParseDeparse
INFO:    -> PROBLEM net.sf.jsqlparser.JSQLParserException
Oct 06, 2015 6:41:57 AM net.sf.jsqlparser.test.select.SpecialOracleTest testAllSqlsParseDeparse
INFO: testing cast_multiset15.sql
Oct 06, 2015 6:41:57 AM net.sf.jsqlparser.test.select.SpecialOracleTest testAllSqlsParseDeparse
INFO:    -> PROBLEM net.sf.jsqlparser.JSQLParserException
Oct 06, 2015 6:41:57 AM net.sf.jsqlparser.test.select.SpecialOracleTest testAllSqlsParseDeparse
INFO: testing interval01.sql
Oct 06, 2015 6:41:57 AM net.sf.jsqlparser.test.select.SpecialOracleTest testAllSqlsParseDeparse
INFO:    -> PROBLEM net.sf.jsqlparser.JSQLParserException
Oct 06, 2015 6:41:57 AM net.sf.jsqlparser.test.select.SpecialOracleTest testAllSqlsParseDeparse
INFO: testing analytic_query04.sql
Oct 06, 2015 6:41:57 AM net.sf.jsqlparser.test.select.SpecialOracleTest testAllSqlsParseDeparse
INFO:    -> PROBLEM net.sf.jsqlparser.JSQLParserException
Oct 06, 2015 6:41:57 AM net.sf.jsqlparser.test.select.SpecialOracleTest testAllSqlsParseDeparse
INFO: testing join10.sql
Oct 06, 2015 6:41:57 AM net.sf.jsqlparser.test.select.SpecialOracleTest testAllSqlsParseDeparse
INFO:    -> SUCCESS
Oct 06, 2015 6:41:57 AM net.sf.jsqlparser.test.select.SpecialOracleTest testAllSqlsParseDeparse
INFO: testing pivot04.sql
Oct 06, 2015 6:41:57 AM net.sf.jsqlparser.test.select.SpecialOracleTest testAllSqlsParseDeparse
INFO:    -> PROBLEM net.sf.jsqlparser.JSQLParserException
Oct 06, 2015 6:41:57 AM net.sf.jsqlparser.test.select.SpecialOracleTest testAllSqlsParseDeparse
INFO: testing condition08.sql
Oct 06, 2015 6:41:57 AM net.sf.jsqlparser.test.select.SpecialOracleTest testAllSqlsParseDeparse
INFO:    -> PROBLEM net.sf.jsqlparser.JSQLParserException
Oct 06, 2015 6:41:57 AM net.sf.jsqlparser.test.select.SpecialOracleTest testAllSqlsParseDeparse
INFO: testing function03.sql
Oct 06, 2015 6:41:57 AM net.sf.jsqlparser.test.select.SpecialOracleTest testAllSqlsParseDeparse
INFO:    -> PROBLEM net.sf.jsqlparser.JSQLParserException
Oct 06, 2015 6:41:57 AM net.sf.jsqlparser.test.select.SpecialOracleTest testAllSqlsParseDeparse
INFO: testing merge03.sql
Oct 06, 2015 6:41:57 AM net.sf.jsqlparser.test.select.SpecialOracleTest testAllSqlsParseDeparse
INFO:    -> PROBLEM net.sf.jsqlparser.JSQLParserException
Oct 06, 2015 6:41:57 AM net.sf.jsqlparser.test.select.SpecialOracleTest testAllSqlsParseDeparse
INFO: testing insert02.sql
Oct 06, 2015 6:41:57 AM net.sf.jsqlparser.test.select.SpecialOracleTest testAllSqlsParseDeparse
INFO:    -> PROBLEM net.sf.jsqlparser.JSQLParserException
Oct 06, 2015 6:41:57 AM net.sf.jsqlparser.test.select.SpecialOracleTest testAllSqlsParseDeparse
INFO: testing insert11.sql
Oct 06, 2015 6:41:57 AM net.sf.jsqlparser.test.select.SpecialOracleTest testAllSqlsParseDeparse
INFO:    -> PROBLEM net.sf.jsqlparser.JSQLParserException
Oct 06, 2015 6:41:57 AM net.sf.jsqlparser.test.select.SpecialOracleTest testAllSqlsParseDeparse
INFO: testing interval02.sql
Oct 06, 2015 6:41:57 AM net.sf.jsqlparser.test.select.SpecialOracleTest testAllSqlsParseDeparse
INFO:    -> SUCCESS
Oct 06, 2015 6:41:57 AM net.sf.jsqlparser.test.select.SpecialOracleTest testAllSqlsParseDeparse
INFO: testing cast_multiset18.sql
Oct 06, 2015 6:41:57 AM net.sf.jsqlparser.test.select.SpecialOracleTest testAllSqlsParseDeparse
INFO:    -> PROBLEM net.sf.jsqlparser.JSQLParserException
Oct 06, 2015 6:41:57 AM net.sf.jsqlparser.test.select.SpecialOracleTest testAllSqlsParseDeparse
INFO: testing query_factoring08.sql
Oct 06, 2015 6:41:57 AM net.sf.jsqlparser.test.select.SpecialOracleTest testAllSqlsParseDeparse
INFO:    -> SUCCESS
Oct 06, 2015 6:41:57 AM net.sf.jsqlparser.test.select.SpecialOracleTest testAllSqlsParseDeparse
INFO: testing condition04.sql
Oct 06, 2015 6:42:04 AM net.sf.jsqlparser.test.select.SpecialOracleTest testAllSqlsOnlyParse
INFO: testing comment02.sql
Oct 06, 2015 6:42:04 AM net.sf.jsqlparser.test.select.SpecialOracleTest testAllSqlsOnlyParse
INFO:    -> SUCCESS
Oct 06, 2015 6:42:04 AM net.sf.jsqlparser.test.select.SpecialOracleTest testAllSqlsOnlyParse
INFO: testing numbers02.sql
Oct 06, 2015 6:42:04 AM net.sf.jsqlparser.test.select.SpecialOracleTest testAllSqlsOnlyParse
INFO:    -> SUCCESS
Oct 06, 2015 6:42:04 AM net.sf.jsqlparser.test.select.SpecialOracleTest testAllSqlsOnlyParse
INFO: testing comment01.sql
Oct 06, 2015 6:42:04 AM net.sf.jsqlparser.test.select.SpecialOracleTest testAllSqlsOnlyParse
INFO:    -> SUCCESS
Tests run: 2, Failures: 1, Errors: 0, Skipped: 0, Time elapsed: 7.042 sec <<< FAILURE!
Running net.sf.jsqlparser.test.select.SelectTest
Tests run: 228, Failures: 18, Errors: 58, Skipped: 0, Time elapsed: 0.269 sec <<< FAILURE!
Running net.sf.jsqlparser.test.select.SpeedTest
Tests run: 1, Failures: 0, Errors: 1, Skipped: 0, Time elapsed: 0.001 sec <<< FAILURE!
Running net.sf.jsqlparser.test.truncate.TruncateTest
Tests run: 1, Failures: 0, Errors: 0, Skipped: 0, Time elapsed: 0 sec
Running net.sf.jsqlparser.util.TablesNamesFinderTest
Tests run: 19, Failures: 0, Errors: 8, Skipped: 0, Time elapsed: 0.025 sec <<< FAILURE!
Running net.sf.jsqlparser.util.ConnectExpressionsVisitorTest
Tests run: 2, Failures: 0, Errors: 0, Skipped: 0, Time elapsed: 0.001 sec
Running net.sf.jsqlparser.util.AddAliasesVisitorTest
Tests run: 4, Failures: 0, Errors: 2, Skipped: 0, Time elapsed: 0.003 sec <<< FAILURE!
Running net.sf.jsqlparser.util.SelectUtilsTest
Tests run: 6, Failures: 0, Errors: 0, Skipped: 0, Time elapsed: 0.003 sec
Running net.sf.jsqlparser.expression.ExpressionVisitorAdapterTest
Tests run: 2, Failures: 0, Errors: 0, Skipped: 0, Time elapsed: 0.003 sec
Running net.sf.jsqlparser.expression.SignedExpressionTest
Tests run: 1, Failures: 0, Errors: 0, Skipped: 0, Time elapsed: 0.001 sec
Running net.sf.jsqlparser.schema.ServerTest
Tests run: 2, Failures: 0, Errors: 0, Skipped: 0, Time elapsed: 0.001 sec
Running net.sf.jsqlparser.parser.CCJSqlParserUtilTest
Tests run: 3, Failures: 0, Errors: 2, Skipped: 0, Time elapsed: 0.001 sec <<< FAILURE!
Running net.sf.jsqlparser.statement.SetStatementTest
Tests run: 1, Failures: 0, Errors: 1, Skipped: 0, Time elapsed: 0.001 sec <<< FAILURE!
Running net.sf.jsqlparser.statement.AdaptersTest
Tests run: 1, Failures: 0, Errors: 0, Skipped: 0, Time elapsed: 0 sec
Running net.sf.jsqlparser.statement.StatementsTest
Tests run: 1, Failures: 0, Errors: 0, Skipped: 0, Time elapsed: 0 sec
Running net.sf.jsqlparser.statement.execute.ExecuteTest
Tests run: 1, Failures: 0, Errors: 1, Skipped: 0, Time elapsed: 0.001 sec <<< FAILURE!

Results :

Failed tests:   testRegularInsert(net.sf.jsqlparser.test.insert.InsertTest): expected:<234> but was:<34>
  testUpdateMultiTable(net.sf.jsqlparser.test.update.UpdateTest): expected:<...= T2.C1 AND T1.C2 < [1]0> but was:<...= T2.C1 AND T1.C2 < []0>
  testReplaceSyntax1(net.sf.jsqlparser.test.replace.ReplaceTest): expected:<565> but was:<65>
  testReplaceSyntax2(net.sf.jsqlparser.test.replace.ReplaceTest): expected:<565> but was:<65>
  testAllSqlsParseDeparse(net.sf.jsqlparser.test.select.SpecialOracleTest): expected:<...type='3'))and(t.cde<[2]0))and(t.se='xxx'))a...> but was:<...type='3'))and(t.cde<[]0))and(t.se='xxx'))a...>
  testAllConditionSubSelect(net.sf.jsqlparser.test.select.SelectTest): expected:<...2 WHERE e2.deptno = [1]0)> but was:<...2 WHERE e2.deptno = []0)>
  testOrderBy(net.sf.jsqlparser.test.select.SelectTest): expected:<...FROM tab1 WHERE a > [3]4 GROUP BY tab1.b OR...> but was:<...FROM tab1 WHERE a > []4 GROUP BY tab1.b OR...>
  testProblemSqlAnalytic8Complex(net.sf.jsqlparser.test.select.SelectTest): expected:<...OM STAFF WHERE ID < [6]0 ORDER BY ID> but was:<...OM STAFF WHERE ID < []0 ORDER BY ID>
  testAnyConditionSubSelect(net.sf.jsqlparser.test.select.SelectTest): expected:<...2 WHERE e2.deptno = [1]0)> but was:<...2 WHERE e2.deptno = []0)>
  testConcatProblem2(net.sf.jsqlparser.test.select.SelectTest): expected:<...RCHAR)) || TO_CHAR(([1]0000 - SPA.VERSCHIJN...> but was:<...RCHAR)) || TO_CHAR(([]0000 - SPA.VERSCHIJN...>
  testBitwise(net.sf.jsqlparser.test.select.SelectTest): expected:<SELECT col1 & [3]2, col2 ^ col1, col1...> but was:<SELECT col1 & []2, col2 ^ col1, col1...>
  testGroupBy(net.sf.jsqlparser.test.select.SelectTest): expected:<...FROM tab1 WHERE a > [3]4 GROUP BY tab1.b> but was:<...FROM tab1 WHERE a > []4 GROUP BY tab1.b>
  testConcatProblem2_3(net.sf.jsqlparser.test.select.SelectTest): expected:<SELECT TO_CHAR(([1]0000 - SPA.VERSCHIJN...> but was:<SELECT TO_CHAR(([]0000 - SPA.VERSCHIJN...>
  testHaving(net.sf.jsqlparser.test.select.SelectTest): expected:<...FROM tab1 WHERE a > [34 GROUP BY tab1.b HAVING MAX(tab1.b) > 5]6> but was:<...FROM tab1 WHERE a > [4 GROUP BY tab1.b HAVING MAX(tab1.b) > ]6>
  testRowConstructor1(net.sf.jsqlparser.test.select.SelectTest): expected:<... FROM t2 WHERE id = [1]0)> but was:<... FROM t2 WHERE id = []0)>
  testRowConstructor2(net.sf.jsqlparser.test.select.SelectTest): expected:<... FROM t2 WHERE id = [1]0)> but was:<... FROM t2 WHERE id = []0)>
  testPivot2(net.sf.jsqlparser.test.select.SelectTest): expected:<...(count(a) FOR b IN ([10, 20, 3]0))> but was:<...(count(a) FOR b IN ([0, 0, ]0))>
  testPivot3(net.sf.jsqlparser.test.select.SelectTest): expected:<...) AS vals FOR b IN ([10 AS d1, 20, 3]0 AS d3))> but was:<...) AS vals FOR b IN ([0 AS d1, 0, ]0 AS d3))>
  testPivot4(net.sf.jsqlparser.test.select.SelectTest): expected:<...), sum(b) FOR b IN ([10, 20, 3]0))> but was:<...), sum(b) FOR b IN ([0, 0, ]0))>
  testPivot5(net.sf.jsqlparser.test.select.SelectTest): expected:<...(a) FOR (b, c) IN (([10, 'a'), (20, 'b'), (3]0, 'c')))> but was:<...(a) FOR (b, c) IN (([0, 'a'), (0, 'b'), (]0, 'c')))>
  testOracleHierarchicalQuery3(net.sf.jsqlparser.test.select.SelectTest): expected:<... WITH employee_id = [1]00 CONNECT BY PRIOR ...> but was:<... WITH employee_id = []00 CONNECT BY PRIOR ...>
  testOracleHierarchicalQuery4(net.sf.jsqlparser.test.select.SelectTest): expected:<... WITH employee_id = [1]00 ORDER SIBLINGS BY...> but was:<... WITH employee_id = []00 ORDER SIBLINGS BY...>
  testProblemSqlServer_Modulo(net.sf.jsqlparser.test.select.SelectTest): expected:<...ECT convert(varchar([255), DATEDIFF(month, year1, abc_datum) / 12) + ' year, ' + convert(varchar(255), DATEDIFF(month, year2, abc_datum) % 1]2) + ' month' FROM t...> but was:<...ECT convert(varchar([55), DATEDIFF(month, year1, abc_datum) / 2) + ' year, ' + convert(varchar(55), DATEDIFF(month, year2, abc_datum) % ]2) + ' month' FROM t...>

Tests in error: 
  testDelete(net.sf.jsqlparser.test.delete.DeleteTest)
  testDeleteWhereProblem1(net.sf.jsqlparser.test.delete.DeleteTest)
  testParse(net.sf.jsqlparser.test.simpleparsing.CCJSqlParserManagerTest): impossible to parse statement:   	 select k, * from K as skldjfl where i=0
  testSimpleInsert(net.sf.jsqlparser.test.insert.InsertTest)
  testUpdateWithFrom(net.sf.jsqlparser.test.update.UpdateTest)
  testUpdate(net.sf.jsqlparser.test.update.UpdateTest)
  testSimpleSigns(net.sf.jsqlparser.test.select.SelectTest)
  testSelectBrackets2(net.sf.jsqlparser.test.select.SelectTest)
  testSelectBrackets3(net.sf.jsqlparser.test.select.SelectTest)
  testSelectBrackets4(net.sf.jsqlparser.test.select.SelectTest)
  testSimpleAdditionsAndSubtractionsWithSigns(net.sf.jsqlparser.test.select.SelectTest)
  testCastTypeProblem4(net.sf.jsqlparser.test.select.SelectTest)
  testTop(net.sf.jsqlparser.test.select.SelectTest)
  testLimit(net.sf.jsqlparser.test.select.SelectTest)
  testSigns(net.sf.jsqlparser.test.select.SelectTest)
  testUnion(net.sf.jsqlparser.test.select.SelectTest)
  testWhere(net.sf.jsqlparser.test.select.SelectTest)
  testRegexpLike2(net.sf.jsqlparser.test.select.SelectTest)
  testCase(net.sf.jsqlparser.test.select.SelectTest)
  testFrom(net.sf.jsqlparser.test.select.SelectTest)
  testJoin(net.sf.jsqlparser.test.select.SelectTest)
  testWeirdSelect(net.sf.jsqlparser.test.select.SelectTest)
  testSelectWithBrackets2(net.sf.jsqlparser.test.select.SelectTest)
  testProblemSqlServer_Modulo_mod(net.sf.jsqlparser.test.select.SelectTest)
  testIssue160_signedParameter2(net.sf.jsqlparser.test.select.SelectTest)
  testSelectItems(net.sf.jsqlparser.test.select.SelectTest)
  testProblemSqlServer_Modulo_Proz(net.sf.jsqlparser.test.select.SelectTest)
  testWithRecursive(net.sf.jsqlparser.test.select.SelectTest)
  testFunctionRight(net.sf.jsqlparser.test.select.SelectTest)
  testWithUnionProblem3(net.sf.jsqlparser.test.select.SelectTest)
  testWithUnionProblem4(net.sf.jsqlparser.test.select.SelectTest)
  testWithUnionProblem5(net.sf.jsqlparser.test.select.SelectTest)
  testValues2(net.sf.jsqlparser.test.select.SelectTest)
  testValues3(net.sf.jsqlparser.test.select.SelectTest)
  testValues4(net.sf.jsqlparser.test.select.SelectTest)
  testValues5(net.sf.jsqlparser.test.select.SelectTest)
  testOperationsWithSigns(net.sf.jsqlparser.test.select.SelectTest)
  testLimitSqlServer1(net.sf.jsqlparser.test.select.SelectTest)
  testLimitSqlServer2(net.sf.jsqlparser.test.select.SelectTest)
  testLimitSqlServer3(net.sf.jsqlparser.test.select.SelectTest)
  testLimitSqlServer4(net.sf.jsqlparser.test.select.SelectTest)
  testProblemSqlAnalytic10Lag(net.sf.jsqlparser.test.select.SelectTest)
  testProblemSqlAnalytic11Lag(net.sf.jsqlparser.test.select.SelectTest)
  testFunctions(net.sf.jsqlparser.test.select.SelectTest)
  testSelectOrderHaving(net.sf.jsqlparser.test.select.SelectTest)
  testAnalyticFunction17(net.sf.jsqlparser.test.select.SelectTest)
  testFunctionLeft(net.sf.jsqlparser.test.select.SelectTest)
  testComplexUnion1(net.sf.jsqlparser.test.select.SelectTest)
  testProblemSqlAnalytic6AggregateColumnValue(net.sf.jsqlparser.test.select.SelectTest)
  testDistinct(net.sf.jsqlparser.test.select.SelectTest)
  testSelectFunction(net.sf.jsqlparser.test.select.SelectTest)
  testInterval1(net.sf.jsqlparser.test.select.SelectTest)
  testInterval3(net.sf.jsqlparser.test.select.SelectTest)
  testConcat(net.sf.jsqlparser.test.select.SelectTest)
  testDouble(net.sf.jsqlparser.test.select.SelectTest)
  testDistinctTop(net.sf.jsqlparser.test.select.SelectTest)
  testLimit2(net.sf.jsqlparser.test.select.SelectTest)
  testSelectWithBrackets(net.sf.jsqlparser.test.select.SelectTest)
  testDeparser(net.sf.jsqlparser.test.select.SelectTest)
  testExtractFrom3(net.sf.jsqlparser.test.select.SelectTest)
  testValues(net.sf.jsqlparser.test.select.SelectTest)
  testValues6BothVariants(net.sf.jsqlparser.test.select.SelectTest)
  testLimitSqlServerJdbcParameters(net.sf.jsqlparser.test.select.SelectTest)
  testCaseElseAddition(net.sf.jsqlparser.test.select.SelectTest)
  testSpeed(net.sf.jsqlparser.test.select.SpeedTest): impossible to parse statement:   	 select k, * from K as skldjfl where i=0
  testGetTableListFromInsertValues(net.sf.jsqlparser.util.TablesNamesFinderTest)
  testCmplxSelectProblem(net.sf.jsqlparser.util.TablesNamesFinderTest)
  testRUBiSTableList(net.sf.jsqlparser.util.TablesNamesFinderTest): error at stm num: 38
  testGetTableListFromUpdate2(net.sf.jsqlparser.util.TablesNamesFinderTest)
  testGetTableListFromUpdate3(net.sf.jsqlparser.util.TablesNamesFinderTest)
  testGetTableListFromInsert(net.sf.jsqlparser.util.TablesNamesFinderTest)
  testGetTableListFromUpdate(net.sf.jsqlparser.util.TablesNamesFinderTest)
  testGetTableListFromReplace(net.sf.jsqlparser.util.TablesNamesFinderTest)
  testVisit_SetOperationList(net.sf.jsqlparser.util.AddAliasesVisitorTest)
  testVisit_PlainSelect_expression(net.sf.jsqlparser.util.AddAliasesVisitorTest)
  testParseExpression2(net.sf.jsqlparser.parser.CCJSqlParserUtilTest)
  testParseCondExpression(net.sf.jsqlparser.parser.CCJSqlParserUtilTest)
  testSimpleSet(net.sf.jsqlparser.statement.SetStatementTest)
  testAccept(net.sf.jsqlparser.statement.execute.ExecuteTest)

Tests run: 353, Failures: 23, Errors: 79, Skipped: 0

[INFO] ------------------------------------------------------------------------
[INFO] BUILD FAILURE
[INFO] ------------------------------------------------------------------------
[INFO] Total time: 14.387s
[INFO] Finished at: Tue Oct 06 06:42:04 CEST 2015
[INFO] Final Memory: 24M/346M
[INFO] ------------------------------------------------------------------------
[ERROR] Failed to execute goal org.apache.maven.plugins:maven-surefire-plugin:2.10:test (default-test) on project jsqlparser: There are test failures.
[ERROR] 
[ERROR] Please refer to /home/perham/Study/Experiments/2015-10-23-ICST/LittleDarwin/Cases/JSqlParser-jsqlparser-0.9.4/target/surefire-reports for the individual test results.
[ERROR] -> [Help 1]
[ERROR] 
[ERROR] To see the full stack trace of the errors, re-run Maven with the -e switch.
[ERROR] Re-run Maven using the -X switch to enable full debug logging.
[ERROR] 
[ERROR] For more information about the errors and possible solutions, please read the following articles:
[ERROR] [Help 1] http://cwiki.apache.org/confluence/display/MAVEN/MojoFailureException
