[INFO] Scanning for projects...
[INFO]                                                                         
[INFO] ------------------------------------------------------------------------
[INFO] Building JSQLParser library 0.9.4
[INFO] ------------------------------------------------------------------------
[INFO] 
[INFO] --- javacc-maven-plugin:2.6:jjtree-javacc (javacc) @ jsqlparser ---
[INFO] Skipping - all parsers are up to date
[INFO] 
[INFO] --- license-maven-plugin:1.6:update-file-header (first) @ jsqlparser ---
[INFO] Will search files to update from root /home/perham/Study/Experiments/2015-10-23-ICST/LittleDarwin/Cases/JSqlParser-jsqlparser-0.9.4/src/main/java
[INFO]  - adding license header on file /home/perham/Study/Experiments/2015-10-23-ICST/LittleDarwin/Cases/JSqlParser-jsqlparser-0.9.4/src/main/java/net/sf/jsqlparser/expression/Function.java
[INFO] Scan 164 files header done in 229.602ms.
[INFO] 
 * uptodate header on 163 files.
 * add header on 1 file.
[INFO] 
[INFO] --- maven-resources-plugin:2.6:resources (default-resources) @ jsqlparser ---
[INFO] Using 'UTF-8' encoding to copy filtered resources.
[INFO] skip non existing resourceDirectory /home/perham/Study/Experiments/2015-10-23-ICST/LittleDarwin/Cases/JSqlParser-jsqlparser-0.9.4/src/main/resources
[INFO] 
[INFO] --- maven-compiler-plugin:3.3:compile (default-compile) @ jsqlparser ---
[INFO] Changes detected - recompiling the module!
[INFO] Compiling 177 source files to /home/perham/Study/Experiments/2015-10-23-ICST/LittleDarwin/Cases/JSqlParser-jsqlparser-0.9.4/target/classes
[WARNING] bootstrap class path not set in conjunction with -source 1.6
[INFO] /home/perham/Study/Experiments/2015-10-23-ICST/LittleDarwin/Cases/JSqlParser-jsqlparser-0.9.4/target/generated-sources/javacc/net/sf/jsqlparser/parser/CCJSqlParser.java: /home/perham/Study/Experiments/2015-10-23-ICST/LittleDarwin/Cases/JSqlParser-jsqlparser-0.9.4/target/generated-sources/javacc/net/sf/jsqlparser/parser/CCJSqlParser.java uses unchecked or unsafe operations.
[INFO] /home/perham/Study/Experiments/2015-10-23-ICST/LittleDarwin/Cases/JSqlParser-jsqlparser-0.9.4/target/generated-sources/javacc/net/sf/jsqlparser/parser/CCJSqlParser.java: Recompile with -Xlint:unchecked for details.
[INFO] 
[INFO] --- maven-resources-plugin:2.6:testResources (default-testResources) @ jsqlparser ---
[INFO] Using 'UTF-8' encoding to copy filtered resources.
[INFO] Copying 280 resources
[INFO] 
[INFO] --- maven-compiler-plugin:3.3:testCompile (default-testCompile) @ jsqlparser ---
[INFO] Nothing to compile - all classes are up to date
[INFO] 
[INFO] --- maven-surefire-plugin:2.10:test (default-test) @ jsqlparser ---
[INFO] Surefire report directory: /home/perham/Study/Experiments/2015-10-23-ICST/LittleDarwin/Cases/JSqlParser-jsqlparser-0.9.4/target/surefire-reports

-------------------------------------------------------
 T E S T S
-------------------------------------------------------
Running net.sf.jsqlparser.test.alter.AlterTest
Tests run: 3, Failures: 0, Errors: 0, Skipped: 0, Time elapsed: 0.058 sec
Running net.sf.jsqlparser.test.create.CreateTableTest
Tests run: 27, Failures: 0, Errors: 0, Skipped: 0, Time elapsed: 0.138 sec
Running net.sf.jsqlparser.test.create.CreateIndexTest
Tests run: 6, Failures: 0, Errors: 0, Skipped: 0, Time elapsed: 0.001 sec
Running net.sf.jsqlparser.test.create.CreateViewTest
Tests run: 8, Failures: 0, Errors: 0, Skipped: 0, Time elapsed: 0.011 sec
Running net.sf.jsqlparser.test.delete.DeleteTest
Tests run: 2, Failures: 0, Errors: 0, Skipped: 0, Time elapsed: 0.006 sec
Running net.sf.jsqlparser.test.simpleparsing.CCJSqlParserManagerTest
Tests run: 1, Failures: 0, Errors: 0, Skipped: 0, Time elapsed: 0.18 sec
Running net.sf.jsqlparser.test.drop.DropTest
Tests run: 2, Failures: 0, Errors: 0, Skipped: 0, Time elapsed: 0.001 sec
Running net.sf.jsqlparser.test.insert.InsertTest
Tests run: 15, Failures: 0, Errors: 0, Skipped: 0, Time elapsed: 0.042 sec
Running net.sf.jsqlparser.test.TestUtils
Tests run: 1, Failures: 0, Errors: 0, Skipped: 0, Time elapsed: 0.001 sec
Running net.sf.jsqlparser.test.update.UpdateTest
Tests run: 7, Failures: 0, Errors: 0, Skipped: 0, Time elapsed: 0.006 sec
Running net.sf.jsqlparser.test.replace.ReplaceTest
Tests run: 4, Failures: 0, Errors: 0, Skipped: 0, Time elapsed: 0.005 sec
Running net.sf.jsqlparser.test.select.SelectASTTest
*Statement
* Column
* Column
* Table
* Column
* Column
Tests run: 2, Failures: 0, Errors: 0, Skipped: 0, Time elapsed: 0.007 sec
Running net.sf.jsqlparser.test.select.SpecialOracleTest
Oct 06, 2015 6:37:32 AM net.sf.jsqlparser.test.select.SpecialOracleTest testAllSqlsParseDeparse
INFO: testing string01.sql
Oct 06, 2015 6:37:32 AM net.sf.jsqlparser.test.select.SpecialOracleTest testAllSqlsParseDeparse
INFO:    -> PROBLEM net.sf.jsqlparser.JSQLParserException
Oct 06, 2015 6:37:32 AM net.sf.jsqlparser.test.select.SpecialOracleTest testAllSqlsParseDeparse
INFO: testing returning01.sql
Oct 06, 2015 6:37:32 AM net.sf.jsqlparser.test.select.SpecialOracleTest testAllSqlsParseDeparse
INFO:    -> PROBLEM net.sf.jsqlparser.JSQLParserException
Oct 06, 2015 6:37:32 AM net.sf.jsqlparser.test.select.SpecialOracleTest testAllSqlsParseDeparse
INFO: testing keywordasidentifier05.sql
Oct 06, 2015 6:37:32 AM net.sf.jsqlparser.test.select.SpecialOracleTest testAllSqlsParseDeparse
INFO:    -> SUCCESS
Oct 06, 2015 6:37:32 AM net.sf.jsqlparser.test.select.SpecialOracleTest testAllSqlsParseDeparse
INFO: testing function07.sql
Oct 06, 2015 6:37:32 AM net.sf.jsqlparser.test.select.SpecialOracleTest testAllSqlsParseDeparse
INFO:    -> PROBLEM net.sf.jsqlparser.JSQLParserException
Oct 06, 2015 6:37:32 AM net.sf.jsqlparser.test.select.SpecialOracleTest testAllSqlsParseDeparse
INFO: testing cast_multiset15.sql
Oct 06, 2015 6:37:32 AM net.sf.jsqlparser.test.select.SpecialOracleTest testAllSqlsParseDeparse
INFO:    -> PROBLEM net.sf.jsqlparser.JSQLParserException
Oct 06, 2015 6:37:32 AM net.sf.jsqlparser.test.select.SpecialOracleTest testAllSqlsParseDeparse
INFO: testing interval01.sql
Oct 06, 2015 6:37:32 AM net.sf.jsqlparser.test.select.SpecialOracleTest testAllSqlsParseDeparse
INFO:    -> PROBLEM net.sf.jsqlparser.JSQLParserException
Oct 06, 2015 6:37:32 AM net.sf.jsqlparser.test.select.SpecialOracleTest testAllSqlsParseDeparse
INFO: testing analytic_query04.sql
Oct 06, 2015 6:37:32 AM net.sf.jsqlparser.test.select.SpecialOracleTest testAllSqlsParseDeparse
INFO:    -> PROBLEM net.sf.jsqlparser.JSQLParserException
Oct 06, 2015 6:37:32 AM net.sf.jsqlparser.test.select.SpecialOracleTest testAllSqlsParseDeparse
INFO: testing join10.sql
Oct 06, 2015 6:37:32 AM net.sf.jsqlparser.test.select.SpecialOracleTest testAllSqlsParseDeparse
INFO:    -> SUCCESS
Oct 06, 2015 6:37:32 AM net.sf.jsqlparser.test.select.SpecialOracleTest testAllSqlsParseDeparse
INFO: testing pivot04.sql
Oct 06, 2015 6:37:32 AM net.sf.jsqlparser.test.select.SpecialOracleTest testAllSqlsParseDeparse
INFO:    -> PROBLEM net.sf.jsqlparser.JSQLParserException
Oct 06, 2015 6:37:32 AM net.sf.jsqlparser.test.select.SpecialOracleTest testAllSqlsParseDeparse
INFO: testing condition08.sql
Oct 06, 2015 6:37:32 AM net.sf.jsqlparser.test.select.SpecialOracleTest testAllSqlsParseDeparse
INFO:    -> PROBLEM net.sf.jsqlparser.JSQLParserException
Oct 06, 2015 6:37:32 AM net.sf.jsqlparser.test.select.SpecialOracleTest testAllSqlsParseDeparse
INFO: testing function03.sql
Oct 06, 2015 6:37:32 AM net.sf.jsqlparser.test.select.SpecialOracleTest testAllSqlsParseDeparse
INFO:    -> PROBLEM net.sf.jsqlparser.JSQLParserException
Oct 06, 2015 6:37:32 AM net.sf.jsqlparser.test.select.SpecialOracleTest testAllSqlsParseDeparse
INFO: testing merge03.sql
Oct 06, 2015 6:37:32 AM net.sf.jsqlparser.test.select.SpecialOracleTest testAllSqlsParseDeparse
INFO:    -> PROBLEM net.sf.jsqlparser.JSQLParserException
Oct 06, 2015 6:37:32 AM net.sf.jsqlparser.test.select.SpecialOracleTest testAllSqlsParseDeparse
INFO: testing insert02.sql
Oct 06, 2015 6:37:32 AM net.sf.jsqlparser.test.select.SpecialOracleTest testAllSqlsParseDeparse
INFO:    -> PROBLEM net.sf.jsqlparser.JSQLParserException
Oct 06, 2015 6:37:32 AM net.sf.jsqlparser.test.select.SpecialOracleTest testAllSqlsParseDeparse
INFO: testing insert11.sql
Oct 06, 2015 6:37:32 AM net.sf.jsqlparser.test.select.SpecialOracleTest testAllSqlsParseDeparse
INFO:    -> PROBLEM net.sf.jsqlparser.JSQLParserException
Oct 06, 2015 6:37:32 AM net.sf.jsqlparser.test.select.SpecialOracleTest testAllSqlsParseDeparse
INFO: testing interval02.sql
Oct 06, 2015 6:37:32 AM net.sf.jsqlparser.test.select.SpecialOracleTest testAllSqlsParseDeparse
INFO:    -> SUCCESS
Oct 06, 2015 6:37:32 AM net.sf.jsqlparser.test.select.SpecialOracleTest testAllSqlsParseDeparse
INFO: testing cast_multiset18.sql
Oct 06, 2015 6:37:32 AM net.sf.jsqlparser.test.select.SpecialOracleTest testAllSqlsParseDeparse
INFO:    -> PROBLEM net.sf.jsqlparser.JSQLParserException
Oct 06, 2015 6:37:32 AM net.sf.jsqlparser.test.select.SpecialOracleTest testAllSqlsParseDeparse
INFO: testing query_factoring08.sql
Oct 06, 2015 6:37:32 AM net.sf.jsqlparser.test.select.SpecialOracleTest testAllSqlsParseDeparse
INFO:    -> SUCCESS
Oct 06, 2015 6:37:32 AM net.sf.jsqlparser.test.select.SpecialOracleTest testAllSqlsParseDeparse
INFO: testing condition04.sql
Oct 06, 2015 6:37:39 AM net.sf.jsqlparser.test.select.SpecialOracleTest testAllSqlsParseDeparse
INFO:    -> SUCCESS
Oct 06, 2015 6:37:39 AM net.sf.jsqlparser.test.select.SpecialOracleTest testAllSqlsParseDeparse
INFO: testing xmltable02.sql
Oct 06, 2015 6:37:39 AM net.sf.jsqlparser.test.select.SpecialOracleTest testAllSqlsParseDeparse
INFO:    -> PROBLEM net.sf.jsqlparser.JSQLParserException
Oct 06, 2015 6:37:39 AM net.sf.jsqlparser.test.select.SpecialOracleTest testAllSqlsParseDeparse
INFO: testing for_update08.sql
Oct 06, 2015 6:37:39 AM net.sf.jsqlparser.test.select.SpecialOracleTest testAllSqlsParseDeparse
INFO:    -> PROBLEM net.sf.jsqlparser.JSQLParserException
Oct 06, 2015 6:37:39 AM net.sf.jsqlparser.test.select.SpecialOracleTest testAllSqlsParseDeparse
INFO: testing for_update03.sql
Oct 06, 2015 6:37:39 AM net.sf.jsqlparser.test.select.SpecialOracleTest testAllSqlsParseDeparse
INFO:    -> SUCCESS
Oct 06, 2015 6:37:39 AM net.sf.jsqlparser.test.select.SpecialOracleTest testAllSqlsParseDeparse
INFO: testing condition06.sql
Oct 06, 2015 6:37:39 AM net.sf.jsqlparser.test.select.SpecialOracleTest testAllSqlsParseDeparse
INFO:    -> PROBLEM net.sf.jsqlparser.JSQLParserException
Oct 06, 2015 6:37:39 AM net.sf.jsqlparser.test.select.SpecialOracleTest testAllSqlsParseDeparse
INFO: testing cast_multiset29.sql
Oct 06, 2015 6:37:39 AM net.sf.jsqlparser.test.select.SpecialOracleTest testAllSqlsOnlyParse
INFO: testing comment02.sql
Oct 06, 2015 6:37:39 AM net.sf.jsqlparser.test.select.SpecialOracleTest testAllSqlsOnlyParse
INFO:    -> SUCCESS
Oct 06, 2015 6:37:39 AM net.sf.jsqlparser.test.select.SpecialOracleTest testAllSqlsOnlyParse
INFO: testing numbers02.sql
Oct 06, 2015 6:37:39 AM net.sf.jsqlparser.test.select.SpecialOracleTest testAllSqlsOnlyParse
INFO:    -> SUCCESS
Oct 06, 2015 6:37:39 AM net.sf.jsqlparser.test.select.SpecialOracleTest testAllSqlsOnlyParse
INFO: testing comment01.sql
Oct 06, 2015 6:37:39 AM net.sf.jsqlparser.test.select.SpecialOracleTest testAllSqlsOnlyParse
INFO:    -> SUCCESS
Tests run: 2, Failures: 1, Errors: 0, Skipped: 0, Time elapsed: 6.93 sec <<< FAILURE!
Running net.sf.jsqlparser.test.select.SelectTest
Tests run: 228, Failures: 56, Errors: 0, Skipped: 0, Time elapsed: 0.233 sec <<< FAILURE!
Running net.sf.jsqlparser.test.select.SpeedTest
42500 statements parsed in 8367 milliseconds
 (5079 statements per second,  0.0001969 seconds per statement )
38500 select scans for table name executed in 137 milliseconds
 (281021 select scans for table name per second,  0.0000036 seconds per select scans for table name)
Tests run: 1, Failures: 0, Errors: 0, Skipped: 0, Time elapsed: 8.501 sec
Running net.sf.jsqlparser.test.truncate.TruncateTest
Tests run: 1, Failures: 0, Errors: 0, Skipped: 0, Time elapsed: 0.001 sec
Running net.sf.jsqlparser.util.TablesNamesFinderTest
Tests run: 19, Failures: 0, Errors: 0, Skipped: 0, Time elapsed: 0.016 sec
Running net.sf.jsqlparser.util.ConnectExpressionsVisitorTest
Tests run: 2, Failures: 0, Errors: 0, Skipped: 0, Time elapsed: 0.003 sec
Running net.sf.jsqlparser.util.AddAliasesVisitorTest
Tests run: 4, Failures: 0, Errors: 0, Skipped: 0, Time elapsed: 0.002 sec
Running net.sf.jsqlparser.util.SelectUtilsTest
Tests run: 6, Failures: 0, Errors: 0, Skipped: 0, Time elapsed: 0.003 sec
Running net.sf.jsqlparser.expression.ExpressionVisitorAdapterTest
Tests run: 2, Failures: 0, Errors: 0, Skipped: 0, Time elapsed: 0.002 sec
Running net.sf.jsqlparser.expression.SignedExpressionTest
Tests run: 1, Failures: 0, Errors: 0, Skipped: 0, Time elapsed: 0.001 sec
Running net.sf.jsqlparser.schema.ServerTest
Tests run: 2, Failures: 0, Errors: 0, Skipped: 0, Time elapsed: 0 sec
Running net.sf.jsqlparser.parser.CCJSqlParserUtilTest
Tests run: 3, Failures: 0, Errors: 0, Skipped: 0, Time elapsed: 0.001 sec
Running net.sf.jsqlparser.statement.SetStatementTest
Tests run: 1, Failures: 0, Errors: 0, Skipped: 0, Time elapsed: 0.002 sec
Running net.sf.jsqlparser.statement.AdaptersTest
Tests run: 1, Failures: 0, Errors: 0, Skipped: 0, Time elapsed: 0.002 sec
Running net.sf.jsqlparser.statement.StatementsTest
Tests run: 1, Failures: 0, Errors: 0, Skipped: 0, Time elapsed: 0.003 sec
Running net.sf.jsqlparser.statement.execute.ExecuteTest
Tests run: 1, Failures: 0, Errors: 0, Skipped: 0, Time elapsed: 0.001 sec

Results :

Failed tests:   testAllSqlsParseDeparse(net.sf.jsqlparser.test.select.SpecialOracleTest): expected:<...empsal_ot(ename,sal)[)]as empsal_ntt)as emp...> but was:<...empsal_ot(ename,sal)[.null).null ]as empsal_ntt)as emp...>
  testMultiValueIn2(net.sf.jsqlparser.test.select.SelectTest): expected:<...table WHERE (trim(a)[, trim(b)]) IN (SELECT a, b FR...> but was:<...table WHERE (trim(a)[.null, trim(b).null]) IN (SELECT a, b FR...>
  testSelectBrackets2(net.sf.jsqlparser.test.select.SelectTest): expected:<...och FROM age(d1, d2)[]) / 2)::numeric> but was:<...och FROM age(d1, d2)[.null]) / 2)::numeric>
  testSelectBrackets3(net.sf.jsqlparser.test.select.SelectTest): expected:<...och FROM age(d1, d2)[) / 2)::numeric)]> but was:<...och FROM age(d1, d2)[.null) / 2)::numeric).null]>
  testRegexpLike1(net.sf.jsqlparser.test.select.SelectTest): expected:<...me, '^Ste(v|ph)en$')[]> but was:<...me, '^Ste(v|ph)en$')[.null]>
  testRegexpLike2(net.sf.jsqlparser.test.select.SelectTest): expected:<...me, '^Ste(v|ph)en$')[] THEN 1 ELSE 2 END F...> but was:<...me, '^Ste(v|ph)en$')[.null] THEN 1 ELSE 2 END F...>
  testWith(net.sf.jsqlparser.test.select.SelectTest): expected:<..., AVG(OTHERS.SALARY)[, COUNT(*) FROM EMPLOYEE AS OTHERS GROUP BY OTHERS.WORKDEPT), DINFOMAX AS (SELECT MAX(AVGSALARY)] AS AVGMAX FROM DINF...> but was:<..., AVG(OTHERS.SALARY)[.null, COUNT(*).null FROM EMPLOYEE AS OTHERS GROUP BY OTHERS.WORKDEPT), DINFOMAX AS (SELECT MAX(AVGSALARY).null] AS AVGMAX FROM DINF...>
  testPivotXml1(net.sf.jsqlparser.test.select.SelectTest): expected:<... PIVOT XML (count(a)[] FOR b IN ('val1'))> but was:<... PIVOT XML (count(a)[.null] FOR b IN ('val1'))>
  testPivotXml2(net.sf.jsqlparser.test.select.SelectTest): expected:<... PIVOT XML (count(a)[] FOR b IN (SELECT va...> but was:<... PIVOT XML (count(a)[.null] FOR b IN (SELECT va...>
  testPivotXml3(net.sf.jsqlparser.test.select.SelectTest): expected:<... PIVOT XML (count(a)[] FOR b IN (ANY))> but was:<... PIVOT XML (count(a)[.null] FOR b IN (ANY))>
  testProblemSqlServer_Modulo_mod(net.sf.jsqlparser.test.select.SelectTest): expected:<SELECT mod(5, 2)[] FROM A> but was:<SELECT mod(5, 2)[.null] FROM A>
  testLateral1(net.sf.jsqlparser.test.select.SelectTest): expected:<...L(SELECT SUM(NETAMT)[] AS LINETOTAL FROM O...> but was:<...L(SELECT SUM(NETAMT)[.null] AS LINETOTAL FROM O...>
  testLateralComplex1(net.sf.jsqlparser.test.select.SelectTest): expected:<...L(SELECT SUM(NETAMT)[ AS LINETOTAL FROM ORDERLINES LINES WHERE LINES.ORDERID = O.ORDERID) AS OL, LATERAL(SELECT SUM(CHGAMT) AS ORDCHGTOTAL FROM ORDERCHARGES CHARGES WHERE LINES.ORDERID = O.ORDERID) AS OC, LATERAL(SELECT SUM(TAXAMT)] AS TAXTOTAL FROM OR...> but was:<...L(SELECT SUM(NETAMT)[.null AS LINETOTAL FROM ORDERLINES LINES WHERE LINES.ORDERID = O.ORDERID) AS OL, LATERAL(SELECT SUM(CHGAMT).null AS ORDCHGTOTAL FROM ORDERCHARGES CHARGES WHERE LINES.ORDERID = O.ORDERID) AS OC, LATERAL(SELECT SUM(TAXAMT).null] AS TAXTOTAL FROM OR...>
  testProblemFunction(net.sf.jsqlparser.test.select.SelectTest): expected:<SELECT test()[] FROM testtable> but was:<SELECT test()[.null] FROM testtable>
  testConcatProblem2(net.sf.jsqlparser.test.select.SelectTest): expected:<...AANLEVERPERIODEJAAR)[)::VARCHAR (4)) || TO_CHAR(SPA.AANLEVERPERIODEVOLGNR, 'FM09'::VARCHAR)) || TO_CHAR((10000 - SPA.VERSCHIJNINGSVOLGNR), 'FM0999'::VARCHAR)) || (SPA.GESLACHT)::VARCHAR (1)))] AS GESLACHT_TMP FRO...> but was:<...AANLEVERPERIODEJAAR)[.null)::VARCHAR (4)) || TO_CHAR(SPA.AANLEVERPERIODEVOLGNR, 'FM09'::VARCHAR).null) || TO_CHAR((10000 - SPA.VERSCHIJNINGSVOLGNR), 'FM0999'::VARCHAR).null) || (SPA.GESLACHT)::VARCHAR (1))).null] AS GESLACHT_TMP FRO...>
  testSelectItems(net.sf.jsqlparser.test.select.SelectTest): expected:<...YID, (SELECT MAX(ID)[] AS myid2 FROM mytab...> but was:<...YID, (SELECT MAX(ID)[.null] AS myid2 FROM mytab...>
  testSelectJoin2(net.sf.jsqlparser.test.select.SelectTest): expected:<...g_constraint.conkey)[]> but was:<...g_constraint.conkey)[.null]>
  testWithRecursive(net.sf.jsqlparser.test.select.SelectTest): expected:<... 100)) SELECT sum(n)[] FROM t> but was:<... 100)) SELECT sum(n)[.null] FROM t>
  testFunctionRight(net.sf.jsqlparser.test.select.SelectTest): expected:<...ight(table1.col1, 4)[] FROM table1> but was:<...ight(table1.col1, 4)[.null] FROM table1>
  testSelectBrackets(net.sf.jsqlparser.test.select.SelectTest): expected:<...((123.250)::numeric)[]> but was:<...((123.250)::numeric)[.null]>
  testWithUnionProblem4(net.sf.jsqlparser.test.select.SelectTest): expected:<...nk, space(level * 4)[] + txt AS txt, nr, f...> but was:<...nk, space(level * 4)[.null] + txt AS txt, nr, f...>
  testPivotFunction(net.sf.jsqlparser.test.select.SelectTest): expected:<...T (count(state_code)[ FOR state_code IN ('NY', 'CT', 'NJ', 'FL', 'MO')) ORDER BY times_purchased))] FROM DUAL> but was:<...T (count(state_code)[.null FOR state_code IN ('NY', 'CT', 'NJ', 'FL', 'MO')) ORDER BY times_purchased)).null] FROM DUAL>
  testConcatProblem2_1(net.sf.jsqlparser.test.select.SelectTest): expected:<...NR, 'FM09'::VARCHAR)[] FROM testtable> but was:<...NR, 'FM09'::VARCHAR)[.null] FROM testtable>
  testConcatProblem2_2(net.sf.jsqlparser.test.select.SelectTest): expected:<...AANLEVERPERIODEJAAR)[)::VARCHAR (4))] AS GESLACHT_TMP FRO...> but was:<...AANLEVERPERIODEJAAR)[.null)::VARCHAR (4)).null] AS GESLACHT_TMP FRO...>
  testConcatProblem2_3(net.sf.jsqlparser.test.select.SelectTest): expected:<..., 'FM0999'::VARCHAR)[] FROM testtable> but was:<..., 'FM0999'::VARCHAR)[.null] FROM testtable>
  testConcatProblem2_5(net.sf.jsqlparser.test.select.SelectTest): expected:<...T max((a || b) || c)[] FROM testtable> but was:<...T max((a || b) || c)[.null] FROM testtable>
  testConcatProblem2_6(net.sf.jsqlparser.test.select.SelectTest): expected:<...ECT max(a || b || c)[] FROM testtable> but was:<...ECT max(a || b || c)[.null] FROM testtable>
  testReplaceAsFunction(net.sf.jsqlparser.test.select.SelectTest): expected:<...T REPLACE(a, 'b', c)[] FROM tab1> but was:<...T REPLACE(a, 'b', c)[.null] FROM tab1>
  testMatches(net.sf.jsqlparser.test.select.SelectTest): expected:<...w & york & yankees')[]> but was:<...w & york & yankees')[.null]>
  testAnalyticFunctionProblem1(net.sf.jsqlparser.test.select.SelectTest): expected:<...unc(s.date_id, 'mm')[] ORDER BY s.date_id)...> but was:<...unc(s.date_id, 'mm')[.null] ORDER BY s.date_id)...>
  testFunctions(net.sf.jsqlparser.test.select.SelectTest): expected:<SELECT MAX(id)[] AS max FROM mytable...> but was:<SELECT MAX(id)[.null] AS max FROM mytable...>
  testProblemFunction3(net.sf.jsqlparser.test.select.SelectTest): expected:<SELECT TRUNCATE(col)[] FROM testtable> but was:<SELECT TRUNCATE(col)[.null] FROM testtable>
  testSelectOrderHaving(net.sf.jsqlparser.test.select.SelectTest): expected:<... units, count(units)[ AS num FROM currency GROUP BY units HAVING count(units)] > 1 ORDER BY num> but was:<... units, count(units)[.null AS num FROM currency GROUP BY units HAVING count(units).null] > 1 ORDER BY num>
  testFunctionLeft(net.sf.jsqlparser.test.select.SelectTest): expected:<...left(table1.col1, 4)[] FROM table1> but was:<...left(table1.col1, 4)[.null] FROM table1>
  testComplexUnion1(net.sf.jsqlparser.test.select.SelectTest): expected:<...ytab.a::varchar, '')[ AS a, mytab.b, mytab.c AS st, mytab.d, mytab.e FROM mytab WHERE mytab.del = 0) UNION (SELECT 'cde-' || coalesce(mytab2.a::varchar, '')] AS a, mytab2.b, myt...> but was:<...ytab.a::varchar, '')[.null AS a, mytab.b, mytab.c AS st, mytab.d, mytab.e FROM mytab WHERE mytab.del = 0) UNION (SELECT 'cde-' || coalesce(mytab2.a::varchar, '').null] AS a, mytab2.b, myt...>
  testIssue160_signedParameter(net.sf.jsqlparser.test.select.SelectTest): expected:<...DD(HH, -?, GETDATE()[)]> but was:<...DD(HH, -?, GETDATE()[.null).null]>
  testInterval2(net.sf.jsqlparser.test.select.SelectTest): expected:<...estamp(to_char(now()[ - INTERVAL '45 MINUTE', 'YYYY-MM-DD-HH24:'))] AS START_TIME FROM ...> but was:<...estamp(to_char(now()[.null - INTERVAL '45 MINUTE', 'YYYY-MM-DD-HH24:').null).null] AS START_TIME FROM ...>
  testCount2(net.sf.jsqlparser.test.select.SelectTest): expected:<...unt(ALL col1 + col2)[] FROM mytable> but was:<...unt(ALL col1 + col2)[.null] FROM mytable>
  testGroupByExpression(net.sf.jsqlparser.test.select.SelectTest): expected:<...l1 + col2, sum(col8)[] FROM table1 GROUP B...> but was:<...l1 + col2, sum(col8)[.null] FROM table1 GROUP B...>
  testHaving(net.sf.jsqlparser.test.select.SelectTest): expected:<SELECT MAX(tab1.b)[ FROM tab1 WHERE a > 34 GROUP BY tab1.b HAVING MAX(tab1.b)] > 56> but was:<SELECT MAX(tab1.b)[.null FROM tab1 WHERE a > 34 GROUP BY tab1.b HAVING MAX(tab1.b).null] > 56>
  testSelectOracleColl(net.sf.jsqlparser.test.select.SelectTest): expected:<...TT.COL1 = lines(idx)[.COL1]> but was:<...TT.COL1 = lines(idx)[]>
  testRowConstructor2(net.sf.jsqlparser.test.select.SelectTest): expected:<...HERE ROW(col1, col2)[] = (SELECT col3, col...> but was:<...HERE ROW(col1, col2)[.null] = (SELECT col3, col...>
  testPivot1(net.sf.jsqlparser.test.select.SelectTest): expected:<...able PIVOT (count(a)[] FOR b IN ('val1'))> but was:<...able PIVOT (count(a)[.null] FOR b IN ('val1'))>
  testPivot2(net.sf.jsqlparser.test.select.SelectTest): expected:<...able PIVOT (count(a)[] FOR b IN (10, 20, 3...> but was:<...able PIVOT (count(a)[.null] FOR b IN (10, 20, 3...>
  testPivot3(net.sf.jsqlparser.test.select.SelectTest): expected:<...able PIVOT (count(a)[] AS vals FOR b IN (1...> but was:<...able PIVOT (count(a)[.null] AS vals FOR b IN (1...>
  testPivot4(net.sf.jsqlparser.test.select.SelectTest): expected:<...able PIVOT (count(a)[, sum(b)] FOR b IN (10, 20, 3...> but was:<...able PIVOT (count(a)[.null, sum(b).null] FOR b IN (10, 20, 3...>
  testPivot5(net.sf.jsqlparser.test.select.SelectTest): expected:<...able PIVOT (count(a)[] FOR (b, c) IN ((10,...> but was:<...able PIVOT (count(a)[.null] FOR (b, c) IN ((10,...>
  testAnalyticFunctionProblem1b(net.sf.jsqlparser.test.select.SelectTest): expected:<...unc(s.date_id, 'mm')[] ORDER BY s.date_id ...> but was:<...unc(s.date_id, 'mm')[.null] ORDER BY s.date_id ...>
  testDeparser(net.sf.jsqlparser.test.select.SelectTest): expected:<...ount(DISTINCT f + 4)[] FROM a> but was:<...ount(DISTINCT f + 4)[.null] FROM a>
  testPivotXmlSubquery1(net.sf.jsqlparser.test.select.SelectTest): expected:<...T (count(state_code)[] FOR state_code IN (...> but was:<...T (count(state_code)[.null] FOR state_code IN (...>
  testExtractFrom2(net.sf.jsqlparser.test.select.SelectTest): expected:<...RACT(year FROM now()[]) FROM testtable> but was:<...RACT(year FROM now()[.null]) FROM testtable>
  testExtractFrom3(net.sf.jsqlparser.test.select.SelectTest): expected:<...ACT(year FROM (now()[] - 2)) FROM testtabl...> but was:<...ACT(year FROM (now()[.null] - 2)) FROM testtabl...>
  testExtractFrom4(net.sf.jsqlparser.test.select.SelectTest): expected:<...T(minutes FROM now()[] - '01:22:00') FROM ...> but was:<...T(minutes FROM now()[.null] - '01:22:00') FROM ...>
  testProblemSqlServer_Modulo(net.sf.jsqlparser.test.select.SelectTest): expected:<...convert(varchar(255)[, DATEDIFF(month, year1, abc_datum) / 12) + ' year, ' + convert(varchar(255), DATEDIFF(month, year2, abc_datum) % 12)] + ' month' FROM tes...> but was:<...convert(varchar(255)[.null, DATEDIFF(month, year1, abc_datum).null / 12).null + ' year, ' + convert(varchar(255).null, DATEDIFF(month, year2, abc_datum).null % 12).null] + ' month' FROM tes...>
  testSelectJoin(net.sf.jsqlparser.test.select.SelectTest): expected:<...g_constraint.conkey)[]) ORDER BY pg_constr...> but was:<...g_constraint.conkey)[.null]) ORDER BY pg_constr...>
  testSelectKeep(net.sf.jsqlparser.test.select.SelectTest): expected:<...LECT col1, min(col2)[] KEEP (DENSE_RANK FI...> but was:<...LECT col1, min(col2)[.null] KEEP (DENSE_RANK FI...>
  testBooleanFunction1(net.sf.jsqlparser.test.select.SelectTest): expected:<...HERE test_func(col1)[]> but was:<...HERE test_func(col1)[.null]>

Tests run: 353, Failures: 57, Errors: 0, Skipped: 0

[INFO] ------------------------------------------------------------------------
[INFO] BUILD FAILURE
[INFO] ------------------------------------------------------------------------
[INFO] Total time: 23.311s
[INFO] Finished at: Tue Oct 06 06:37:48 CEST 2015
[INFO] Final Memory: 21M/346M
[INFO] ------------------------------------------------------------------------
[ERROR] Failed to execute goal org.apache.maven.plugins:maven-surefire-plugin:2.10:test (default-test) on project jsqlparser: There are test failures.
[ERROR] 
[ERROR] Please refer to /home/perham/Study/Experiments/2015-10-23-ICST/LittleDarwin/Cases/JSqlParser-jsqlparser-0.9.4/target/surefire-reports for the individual test results.
[ERROR] -> [Help 1]
[ERROR] 
[ERROR] To see the full stack trace of the errors, re-run Maven with the -e switch.
[ERROR] Re-run Maven using the -X switch to enable full debug logging.
[ERROR] 
[ERROR] For more information about the errors and possible solutions, please read the following articles:
[ERROR] [Help 1] http://cwiki.apache.org/confluence/display/MAVEN/MojoFailureException
