[INFO] Scanning for projects...
[INFO]                                                                         
[INFO] ------------------------------------------------------------------------
[INFO] Building JSQLParser library 0.9.4
[INFO] ------------------------------------------------------------------------
[INFO] 
[INFO] --- javacc-maven-plugin:2.6:jjtree-javacc (javacc) @ jsqlparser ---
[INFO] Skipping - all parsers are up to date
[INFO] 
[INFO] --- license-maven-plugin:1.6:update-file-header (first) @ jsqlparser ---
[INFO] Will search files to update from root /home/perham/Study/Experiments/2015-10-23-ICST/LittleDarwin/Cases/JSqlParser-jsqlparser-0.9.4/src/main/java
[INFO]  - adding license header on file /home/perham/Study/Experiments/2015-10-23-ICST/LittleDarwin/Cases/JSqlParser-jsqlparser-0.9.4/src/main/java/net/sf/jsqlparser/expression/AnalyticExpression.java
[INFO] Scan 164 files header done in 217.258ms.
[INFO] 
 * uptodate header on 163 files.
 * add header on 1 file.
[INFO] 
[INFO] --- maven-resources-plugin:2.6:resources (default-resources) @ jsqlparser ---
[INFO] Using 'UTF-8' encoding to copy filtered resources.
[INFO] skip non existing resourceDirectory /home/perham/Study/Experiments/2015-10-23-ICST/LittleDarwin/Cases/JSqlParser-jsqlparser-0.9.4/src/main/resources
[INFO] 
[INFO] --- maven-compiler-plugin:3.3:compile (default-compile) @ jsqlparser ---
[INFO] Changes detected - recompiling the module!
[INFO] Compiling 177 source files to /home/perham/Study/Experiments/2015-10-23-ICST/LittleDarwin/Cases/JSqlParser-jsqlparser-0.9.4/target/classes
[WARNING] bootstrap class path not set in conjunction with -source 1.6
[INFO] /home/perham/Study/Experiments/2015-10-23-ICST/LittleDarwin/Cases/JSqlParser-jsqlparser-0.9.4/target/generated-sources/javacc/net/sf/jsqlparser/parser/CCJSqlParser.java: /home/perham/Study/Experiments/2015-10-23-ICST/LittleDarwin/Cases/JSqlParser-jsqlparser-0.9.4/target/generated-sources/javacc/net/sf/jsqlparser/parser/CCJSqlParser.java uses unchecked or unsafe operations.
[INFO] /home/perham/Study/Experiments/2015-10-23-ICST/LittleDarwin/Cases/JSqlParser-jsqlparser-0.9.4/target/generated-sources/javacc/net/sf/jsqlparser/parser/CCJSqlParser.java: Recompile with -Xlint:unchecked for details.
[INFO] 
[INFO] --- maven-resources-plugin:2.6:testResources (default-testResources) @ jsqlparser ---
[INFO] Using 'UTF-8' encoding to copy filtered resources.
[INFO] Copying 280 resources
[INFO] 
[INFO] --- maven-compiler-plugin:3.3:testCompile (default-testCompile) @ jsqlparser ---
[INFO] Nothing to compile - all classes are up to date
[INFO] 
[INFO] --- maven-surefire-plugin:2.10:test (default-test) @ jsqlparser ---
[INFO] Surefire report directory: /home/perham/Study/Experiments/2015-10-23-ICST/LittleDarwin/Cases/JSqlParser-jsqlparser-0.9.4/target/surefire-reports

-------------------------------------------------------
 T E S T S
-------------------------------------------------------
Running net.sf.jsqlparser.test.alter.AlterTest
Tests run: 3, Failures: 0, Errors: 0, Skipped: 0, Time elapsed: 0.052 sec
Running net.sf.jsqlparser.test.create.CreateTableTest
Tests run: 27, Failures: 0, Errors: 0, Skipped: 0, Time elapsed: 0.126 sec
Running net.sf.jsqlparser.test.create.CreateIndexTest
Tests run: 6, Failures: 0, Errors: 0, Skipped: 0, Time elapsed: 0.001 sec
Running net.sf.jsqlparser.test.create.CreateViewTest
Tests run: 8, Failures: 0, Errors: 0, Skipped: 0, Time elapsed: 0.009 sec
Running net.sf.jsqlparser.test.delete.DeleteTest
Tests run: 2, Failures: 0, Errors: 0, Skipped: 0, Time elapsed: 0.003 sec
Running net.sf.jsqlparser.test.simpleparsing.CCJSqlParserManagerTest
Tests run: 1, Failures: 0, Errors: 0, Skipped: 0, Time elapsed: 0.179 sec
Running net.sf.jsqlparser.test.drop.DropTest
Tests run: 2, Failures: 0, Errors: 0, Skipped: 0, Time elapsed: 0.001 sec
Running net.sf.jsqlparser.test.insert.InsertTest
Tests run: 15, Failures: 0, Errors: 0, Skipped: 0, Time elapsed: 0.038 sec
Running net.sf.jsqlparser.test.TestUtils
Tests run: 1, Failures: 0, Errors: 0, Skipped: 0, Time elapsed: 0 sec
Running net.sf.jsqlparser.test.update.UpdateTest
Tests run: 7, Failures: 0, Errors: 0, Skipped: 0, Time elapsed: 0.005 sec
Running net.sf.jsqlparser.test.replace.ReplaceTest
Tests run: 4, Failures: 0, Errors: 0, Skipped: 0, Time elapsed: 0.002 sec
Running net.sf.jsqlparser.test.select.SelectASTTest
*Statement
* Column
* Column
* Table
* Column
* Column
Tests run: 2, Failures: 0, Errors: 0, Skipped: 0, Time elapsed: 0.004 sec
Running net.sf.jsqlparser.test.select.SpecialOracleTest
Oct 06, 2015 6:25:00 AM net.sf.jsqlparser.test.select.SpecialOracleTest testAllSqlsParseDeparse
INFO: testing string01.sql
Oct 06, 2015 6:25:00 AM net.sf.jsqlparser.test.select.SpecialOracleTest testAllSqlsParseDeparse
INFO:    -> PROBLEM net.sf.jsqlparser.JSQLParserException
Oct 06, 2015 6:25:00 AM net.sf.jsqlparser.test.select.SpecialOracleTest testAllSqlsParseDeparse
INFO: testing returning01.sql
Oct 06, 2015 6:25:00 AM net.sf.jsqlparser.test.select.SpecialOracleTest testAllSqlsParseDeparse
INFO:    -> PROBLEM net.sf.jsqlparser.JSQLParserException
Oct 06, 2015 6:25:00 AM net.sf.jsqlparser.test.select.SpecialOracleTest testAllSqlsParseDeparse
INFO: testing keywordasidentifier05.sql
Oct 06, 2015 6:25:00 AM net.sf.jsqlparser.test.select.SpecialOracleTest testAllSqlsParseDeparse
INFO:    -> SUCCESS
Oct 06, 2015 6:25:00 AM net.sf.jsqlparser.test.select.SpecialOracleTest testAllSqlsParseDeparse
INFO: testing function07.sql
Oct 06, 2015 6:25:00 AM net.sf.jsqlparser.test.select.SpecialOracleTest testAllSqlsParseDeparse
INFO:    -> PROBLEM net.sf.jsqlparser.JSQLParserException
Oct 06, 2015 6:25:00 AM net.sf.jsqlparser.test.select.SpecialOracleTest testAllSqlsParseDeparse
INFO: testing cast_multiset15.sql
Oct 06, 2015 6:25:00 AM net.sf.jsqlparser.test.select.SpecialOracleTest testAllSqlsParseDeparse
INFO:    -> PROBLEM net.sf.jsqlparser.JSQLParserException
Oct 06, 2015 6:25:00 AM net.sf.jsqlparser.test.select.SpecialOracleTest testAllSqlsParseDeparse
INFO: testing interval01.sql
Oct 06, 2015 6:25:00 AM net.sf.jsqlparser.test.select.SpecialOracleTest testAllSqlsParseDeparse
INFO:    -> PROBLEM net.sf.jsqlparser.JSQLParserException
Oct 06, 2015 6:25:00 AM net.sf.jsqlparser.test.select.SpecialOracleTest testAllSqlsParseDeparse
INFO: testing analytic_query04.sql
Oct 06, 2015 6:25:00 AM net.sf.jsqlparser.test.select.SpecialOracleTest testAllSqlsParseDeparse
INFO:    -> PROBLEM net.sf.jsqlparser.JSQLParserException
Oct 06, 2015 6:25:00 AM net.sf.jsqlparser.test.select.SpecialOracleTest testAllSqlsParseDeparse
INFO: testing join10.sql
Oct 06, 2015 6:25:00 AM net.sf.jsqlparser.test.select.SpecialOracleTest testAllSqlsParseDeparse
INFO:    -> SUCCESS
Oct 06, 2015 6:25:00 AM net.sf.jsqlparser.test.select.SpecialOracleTest testAllSqlsParseDeparse
INFO: testing pivot04.sql
Oct 06, 2015 6:25:00 AM net.sf.jsqlparser.test.select.SpecialOracleTest testAllSqlsParseDeparse
INFO:    -> PROBLEM net.sf.jsqlparser.JSQLParserException
Oct 06, 2015 6:25:00 AM net.sf.jsqlparser.test.select.SpecialOracleTest testAllSqlsParseDeparse
INFO: testing condition08.sql
Oct 06, 2015 6:25:01 AM net.sf.jsqlparser.test.select.SpecialOracleTest testAllSqlsParseDeparse
INFO:    -> PROBLEM net.sf.jsqlparser.JSQLParserException
Oct 06, 2015 6:25:01 AM net.sf.jsqlparser.test.select.SpecialOracleTest testAllSqlsParseDeparse
INFO: testing function03.sql
Oct 06, 2015 6:25:01 AM net.sf.jsqlparser.test.select.SpecialOracleTest testAllSqlsParseDeparse
INFO:    -> PROBLEM net.sf.jsqlparser.JSQLParserException
Oct 06, 2015 6:25:01 AM net.sf.jsqlparser.test.select.SpecialOracleTest testAllSqlsParseDeparse
INFO: testing merge03.sql
Oct 06, 2015 6:25:01 AM net.sf.jsqlparser.test.select.SpecialOracleTest testAllSqlsParseDeparse
INFO:    -> PROBLEM net.sf.jsqlparser.JSQLParserException
Oct 06, 2015 6:25:01 AM net.sf.jsqlparser.test.select.SpecialOracleTest testAllSqlsParseDeparse
INFO: testing insert02.sql
Oct 06, 2015 6:25:01 AM net.sf.jsqlparser.test.select.SpecialOracleTest testAllSqlsParseDeparse
INFO:    -> PROBLEM net.sf.jsqlparser.JSQLParserException
Oct 06, 2015 6:25:01 AM net.sf.jsqlparser.test.select.SpecialOracleTest testAllSqlsParseDeparse
INFO: testing insert11.sql
Oct 06, 2015 6:25:01 AM net.sf.jsqlparser.test.select.SpecialOracleTest testAllSqlsParseDeparse
INFO:    -> PROBLEM net.sf.jsqlparser.JSQLParserException
Oct 06, 2015 6:25:01 AM net.sf.jsqlparser.test.select.SpecialOracleTest testAllSqlsParseDeparse
INFO: testing interval02.sql
Oct 06, 2015 6:25:01 AM net.sf.jsqlparser.test.select.SpecialOracleTest testAllSqlsParseDeparse
INFO:    -> SUCCESS
Oct 06, 2015 6:25:01 AM net.sf.jsqlparser.test.select.SpecialOracleTest testAllSqlsParseDeparse
INFO: testing cast_multiset18.sql
Oct 06, 2015 6:25:01 AM net.sf.jsqlparser.test.select.SpecialOracleTest testAllSqlsParseDeparse
INFO:    -> PROBLEM net.sf.jsqlparser.JSQLParserException
Oct 06, 2015 6:25:01 AM net.sf.jsqlparser.test.select.SpecialOracleTest testAllSqlsParseDeparse
INFO: testing query_factoring08.sql
Oct 06, 2015 6:25:01 AM net.sf.jsqlparser.test.select.SpecialOracleTest testAllSqlsParseDeparse
INFO:    -> SUCCESS
Oct 06, 2015 6:25:01 AM net.sf.jsqlparser.test.select.SpecialOracleTest testAllSqlsParseDeparse
INFO: testing condition04.sql
Oct 06, 2015 6:25:07 AM net.sf.jsqlparser.test.select.SpecialOracleTest testAllSqlsParseDeparse
INFO:    -> SUCCESS
Oct 06, 2015 6:25:07 AM net.sf.jsqlparser.test.select.SpecialOracleTest testAllSqlsParseDeparse
INFO: testing xmltable02.sql
Oct 06, 2015 6:25:07 AM net.sf.jsqlparser.test.select.SpecialOracleTest testAllSqlsParseDeparse
INFO:    -> PROBLEM net.sf.jsqlparser.JSQLParserException
Oct 06, 2015 6:25:07 AM net.sf.jsqlparser.test.select.SpecialOracleTest testAllSqlsParseDeparse
INFO: testing for_update08.sql
Oct 06, 2015 6:25:07 AM net.sf.jsqlparser.test.select.SpecialOracleTest testAllSqlsParseDeparse
INFO:    -> PROBLEM net.sf.jsqlparser.JSQLParserException
Oct 06, 2015 6:25:07 AM net.sf.jsqlparser.test.select.SpecialOracleTest testAllSqlsParseDeparse
INFO: testing for_update03.sql
Oct 06, 2015 6:25:07 AM net.sf.jsqlparser.test.select.SpecialOracleTest testAllSqlsParseDeparse
INFO:    -> SUCCESS
Oct 06, 2015 6:25:07 AM net.sf.jsqlparser.test.select.SpecialOracleTest testAllSqlsParseDeparse
INFO: testing condition06.sql
Oct 06, 2015 6:25:07 AM net.sf.jsqlparser.test.select.SpecialOracleTest testAllSqlsParseDeparse
INFO:    -> PROBLEM net.sf.jsqlparser.JSQLParserException
Oct 06, 2015 6:25:07 AM net.sf.jsqlparser.test.select.SpecialOracleTest testAllSqlsParseDeparse
INFO: testing cast_multiset29.sql
Oct 06, 2015 6:25:07 AM net.sf.jsqlparser.test.select.SpecialOracleTest testAllSqlsParseDeparse
INFO:    -> SUCCESS
Oct 06, 2015 6:25:07 AM net.sf.jsqlparser.test.select.SpecialOracleTest testAllSqlsParseDeparse
INFO: testing cast_multiset38.sql
Oct 06, 2015 6:25:07 AM net.sf.jsqlparser.test.select.SpecialOracleTest testAllSqlsParseDeparse
INFO:    -> PROBLEM net.sf.jsqlparser.JSQLParserException
Oct 06, 2015 6:25:07 AM net.sf.jsqlparser.test.select.SpecialOracleTest testAllSqlsParseDeparse
INFO: testing query_factoring09.sql
Oct 06, 2015 6:25:07 AM net.sf.jsqlparser.test.select.SpecialOracleTest testAllSqlsParseDeparse
INFO:    -> SUCCESS
Oct 06, 2015 6:25:07 AM net.sf.jsqlparser.test.select.SpecialOracleTest testAllSqlsParseDeparse
INFO: testing condition19.sql
Oct 06, 2015 6:25:07 AM net.sf.jsqlparser.test.select.SpecialOracleTest testAllSqlsParseDeparse
INFO:    -> PROBLEM net.sf.jsqlparser.JSQLParserException
Oct 06, 2015 6:25:07 AM net.sf.jsqlparser.test.select.SpecialOracleTest testAllSqlsParseDeparse
INFO: testing union02.sql
Oct 06, 2015 6:25:07 AM net.sf.jsqlparser.test.select.SpecialOracleTest testAllSqlsParseDeparse
INFO:    -> SUCCESS
Oct 06, 2015 6:25:07 AM net.sf.jsqlparser.test.select.SpecialOracleTest testAllSqlsParseDeparse
INFO: testing groupby22.sql
Oct 06, 2015 6:25:07 AM net.sf.jsqlparser.test.select.SpecialOracleTest testAllSqlsParseDeparse
INFO:    -> SUCCESS
Oct 06, 2015 6:25:07 AM net.sf.jsqlparser.test.select.SpecialOracleTest testAllSqlsParseDeparse
INFO: testing set02.sql
Oct 06, 2015 6:25:07 AM net.sf.jsqlparser.test.select.SpecialOracleTest testAllSqlsParseDeparse
INFO:    -> PROBLEM net.sf.jsqlparser.JSQLParserException
Oct 06, 2015 6:25:07 AM net.sf.jsqlparser.test.select.SpecialOracleTest testAllSqlsParseDeparse
INFO: testing cast_multiset10.sql
Oct 06, 2015 6:25:07 AM net.sf.jsqlparser.test.select.SpecialOracleTest testAllSqlsParseDeparse
INFO:    -> SUCCESS
Oct 06, 2015 6:25:07 AM net.sf.jsqlparser.test.select.SpecialOracleTest testAllSqlsParseDeparse
INFO: testing simple06.sql
Oct 06, 2015 6:25:07 AM net.sf.jsqlparser.test.select.SpecialOracleTest testAllSqlsParseDeparse
INFO:    -> SUCCESS
Oct 06, 2015 6:25:07 AM net.sf.jsqlparser.test.select.SpecialOracleTest testAllSqlsParseDeparse
INFO: testing groupby12.sql
Oct 06, 2015 6:25:07 AM net.sf.jsqlparser.test.select.SpecialOracleTest testAllSqlsParseDeparse
INFO:    -> SUCCESS
Oct 06, 2015 6:25:07 AM net.sf.jsqlparser.test.select.SpecialOracleTest testAllSqlsParseDeparse
INFO: testing join07.sql
Oct 06, 2015 6:25:07 AM net.sf.jsqlparser.test.select.SpecialOracleTest testAllSqlsParseDeparse
INFO:    -> SUCCESS
Oct 06, 2015 6:25:07 AM net.sf.jsqlparser.test.select.SpecialOracleTest testAllSqlsParseDeparse
INFO: testing cast_multiset06.sql
Oct 06, 2015 6:25:07 AM net.sf.jsqlparser.test.select.SpecialOracleTest testAllSqlsParseDeparse
INFO:    -> SUCCESS
Oct 06, 2015 6:25:07 AM net.sf.jsqlparser.test.select.SpecialOracleTest testAllSqlsParseDeparse
INFO: testing bindvar04.sql
Oct 06, 2015 6:25:07 AM net.sf.jsqlparser.test.select.SpecialOracleTest testAllSqlsParseDeparse
INFO:    -> PROBLEM net.sf.jsqlparser.JSQLParserException
Oct 06, 2015 6:25:07 AM net.sf.jsqlparser.test.select.SpecialOracleTest testAllSqlsParseDeparse
INFO: testing cast_multiset26.sql
Oct 06, 2015 6:25:07 AM net.sf.jsqlparser.test.select.SpecialOracleTest testAllSqlsParseDeparse
INFO:    -> PROBLEM net.sf.jsqlparser.JSQLParserException
Oct 06, 2015 6:25:07 AM net.sf.jsqlparser.test.select.SpecialOracleTest testAllSqlsParseDeparse
INFO: testing join17.sql
Oct 06, 2015 6:25:07 AM net.sf.jsqlparser.test.select.SpecialOracleTest testAllSqlsParseDeparse
INFO:    -> PROBLEM net.sf.jsqlparser.JSQLParserException
Oct 06, 2015 6:25:07 AM net.sf.jsqlparser.test.select.SpecialOracleTest testAllSqlsParseDeparse
INFO: testing join13.sql
Oct 06, 2015 6:25:07 AM net.sf.jsqlparser.test.select.SpecialOracleTest testAllSqlsParseDeparse
INFO:    -> PROBLEM net.sf.jsqlparser.JSQLParserException
Oct 06, 2015 6:25:07 AM net.sf.jsqlparser.test.select.SpecialOracleTest testAllSqlsParseDeparse
INFO: testing for_update05.sql
Oct 06, 2015 6:25:07 AM net.sf.jsqlparser.test.select.SpecialOracleTest testAllSqlsParseDeparse
INFO:    -> PROBLEM net.sf.jsqlparser.JSQLParserException
Oct 06, 2015 6:25:07 AM net.sf.jsqlparser.test.select.SpecialOracleTest testAllSqlsParseDeparse
INFO: testing keywordasidentifier01.sql
Oct 06, 2015 6:25:07 AM net.sf.jsqlparser.test.select.SpecialOracleTest testAllSqlsParseDeparse
INFO:    -> SUCCESS
Oct 06, 2015 6:25:07 AM net.sf.jsqlparser.test.select.SpecialOracleTest testAllSqlsParseDeparse
INFO: testing pivot05.sql
Oct 06, 2015 6:25:07 AM net.sf.jsqlparser.test.select.SpecialOracleTest testAllSqlsParseDeparse
INFO:    -> SUCCESS
Oct 06, 2015 6:25:07 AM net.sf.jsqlparser.test.select.SpecialOracleTest testAllSqlsParseDeparse
INFO: testing loop02.sql
Oct 06, 2015 6:25:07 AM net.sf.jsqlparser.test.select.SpecialOracleTest testAllSqlsParseDeparse
INFO:    -> PROBLEM net.sf.jsqlparser.JSQLParserException
Oct 06, 2015 6:25:07 AM net.sf.jsqlparser.test.select.SpecialOracleTest testAllSqlsParseDeparse
INFO: testing interval05.sql
Oct 06, 2015 6:25:07 AM net.sf.jsqlparser.test.select.SpecialOracleTest testAllSqlsParseDeparse
INFO:    -> PROBLEM net.sf.jsqlparser.JSQLParserException
Oct 06, 2015 6:25:07 AM net.sf.jsqlparser.test.select.SpecialOracleTest testAllSqlsParseDeparse
INFO: testing cast_multiset03.sql
Oct 06, 2015 6:25:07 AM net.sf.jsqlparser.test.select.SpecialOracleTest testAllSqlsParseDeparse
INFO:    -> PROBLEM net.sf.jsqlparser.JSQLParserException
Oct 06, 2015 6:25:07 AM net.sf.jsqlparser.test.select.SpecialOracleTest testAllSqlsParseDeparse
INFO: testing model_clause10.sql
Oct 06, 2015 6:25:07 AM net.sf.jsqlparser.test.select.SpecialOracleTest testAllSqlsParseDeparse
INFO:    -> PROBLEM net.sf.jsqlparser.JSQLParserException
Oct 06, 2015 6:25:07 AM net.sf.jsqlparser.test.select.SpecialOracleTest testAllSqlsParseDeparse
INFO: testing join16.sql
Oct 06, 2015 6:25:07 AM net.sf.jsqlparser.test.select.SpecialOracleTest testAllSqlsParseDeparse
INFO:    -> SUCCESS
Oct 06, 2015 6:25:07 AM net.sf.jsqlparser.test.select.SpecialOracleTest testAllSqlsParseDeparse
INFO: testing join18.sql
Oct 06, 2015 6:25:07 AM net.sf.jsqlparser.test.select.SpecialOracleTest testAllSqlsParseDeparse
INFO:    -> SUCCESS
Oct 06, 2015 6:25:07 AM net.sf.jsqlparser.test.select.SpecialOracleTest testAllSqlsParseDeparse
INFO: testing query_factoring01.sql
Oct 06, 2015 6:25:07 AM net.sf.jsqlparser.test.select.SpecialOracleTest testAllSqlsParseDeparse
INFO:    -> SUCCESS
Oct 06, 2015 6:25:07 AM net.sf.jsqlparser.test.select.SpecialOracleTest testAllSqlsParseDeparse
INFO: testing groupby14.sql
Oct 06, 2015 6:25:07 AM net.sf.jsqlparser.test.select.SpecialOracleTest testAllSqlsParseDeparse
INFO:    -> SUCCESS
Oct 06, 2015 6:25:07 AM net.sf.jsqlparser.test.select.SpecialOracleTest testAllSqlsParseDeparse
INFO: testing model_clause16.sql
Oct 06, 2015 6:25:07 AM net.sf.jsqlparser.test.select.SpecialOracleTest testAllSqlsParseDeparse
INFO:    -> PROBLEM net.sf.jsqlparser.JSQLParserException
Oct 06, 2015 6:25:07 AM net.sf.jsqlparser.test.select.SpecialOracleTest testAllSqlsParseDeparse
INFO: testing join12.sql
Oct 06, 2015 6:25:07 AM net.sf.jsqlparser.test.select.SpecialOracleTest testAllSqlsParseDeparse
INFO:    -> SUCCESS
Oct 06, 2015 6:25:07 AM net.sf.jsqlparser.test.select.SpecialOracleTest testAllSqlsParseDeparse
INFO: testing analytic_query03.sql
Oct 06, 2015 6:25:07 AM net.sf.jsqlparser.test.select.SpecialOracleTest testAllSqlsParseDeparse
INFO:    -> PROBLEM net.sf.jsqlparser.JSQLParserException
Oct 06, 2015 6:25:07 AM net.sf.jsqlparser.test.select.SpecialOracleTest testAllSqlsParseDeparse
INFO: testing cast_multiset17.sql
Oct 06, 2015 6:25:07 AM net.sf.jsqlparser.test.select.SpecialOracleTest testAllSqlsParseDeparse
INFO:    -> SUCCESS
Oct 06, 2015 6:25:07 AM net.sf.jsqlparser.test.select.SpecialOracleTest testAllSqlsParseDeparse
INFO: testing simple11.sql
Oct 06, 2015 6:25:07 AM net.sf.jsqlparser.test.select.SpecialOracleTest testAllSqlsParseDeparse
INFO:    -> SUCCESS
Oct 06, 2015 6:25:07 AM net.sf.jsqlparser.test.select.SpecialOracleTest testAllSqlsParseDeparse
INFO: testing condition02.sql
Oct 06, 2015 6:25:07 AM net.sf.jsqlparser.test.select.SpecialOracleTest testAllSqlsParseDeparse
INFO:    -> SUCCESS
Oct 06, 2015 6:25:07 AM net.sf.jsqlparser.test.select.SpecialOracleTest testAllSqlsParseDeparse
INFO: testing cast_multiset35.sql
Oct 06, 2015 6:25:07 AM net.sf.jsqlparser.test.select.SpecialOracleTest testAllSqlsParseDeparse
INFO:    -> SUCCESS
Oct 06, 2015 6:25:07 AM net.sf.jsqlparser.test.select.SpecialOracleTest testAllSqlsParseDeparse
INFO: testing merge02.sql
Oct 06, 2015 6:25:07 AM net.sf.jsqlparser.test.select.SpecialOracleTest testAllSqlsParseDeparse
INFO:    -> PROBLEM net.sf.jsqlparser.JSQLParserException
Oct 06, 2015 6:25:07 AM net.sf.jsqlparser.test.select.SpecialOracleTest testAllSqlsParseDeparse
INFO: testing cast_multiset39.sql
Oct 06, 2015 6:25:07 AM net.sf.jsqlparser.test.select.SpecialOracleTest testAllSqlsParseDeparse
INFO:    -> PROBLEM net.sf.jsqlparser.JSQLParserException
Oct 06, 2015 6:25:07 AM net.sf.jsqlparser.test.select.SpecialOracleTest testAllSqlsParseDeparse
INFO: testing for_update04.sql
Oct 06, 2015 6:25:07 AM net.sf.jsqlparser.test.select.SpecialOracleTest testAllSqlsParseDeparse
INFO:    -> PROBLEM net.sf.jsqlparser.JSQLParserException
Oct 06, 2015 6:25:07 AM net.sf.jsqlparser.test.select.SpecialOracleTest testAllSqlsParseDeparse
INFO: testing groupby08.sql
Oct 06, 2015 6:25:07 AM net.sf.jsqlparser.test.select.SpecialOracleTest testAllSqlsParseDeparse
INFO:    -> SUCCESS
Oct 06, 2015 6:25:07 AM net.sf.jsqlparser.test.select.SpecialOracleTest testAllSqlsParseDeparse
INFO: testing bindvar03.sql
Oct 06, 2015 6:25:07 AM net.sf.jsqlparser.test.select.SpecialOracleTest testAllSqlsParseDeparse
INFO:    -> PROBLEM net.sf.jsqlparser.JSQLParserException
Oct 06, 2015 6:25:07 AM net.sf.jsqlparser.test.select.SpecialOracleTest testAllSqlsParseDeparse
INFO: testing simple03.sql
Oct 06, 2015 6:25:07 AM net.sf.jsqlparser.test.select.SpecialOracleTest testAllSqlsParseDeparse
INFO:    -> SUCCESS
Oct 06, 2015 6:25:07 AM net.sf.jsqlparser.test.select.SpecialOracleTest testAllSqlsParseDeparse
INFO: testing keywordasidentifier03.sql
Oct 06, 2015 6:25:07 AM net.sf.jsqlparser.test.select.SpecialOracleTest testAllSqlsParseDeparse
INFO:    -> SUCCESS
Oct 06, 2015 6:25:07 AM net.sf.jsqlparser.test.select.SpecialOracleTest testAllSqlsParseDeparse
INFO: testing simple12.sql
Oct 06, 2015 6:25:07 AM net.sf.jsqlparser.test.select.SpecialOracleTest testAllSqlsParseDeparse
INFO:    -> SUCCESS
Oct 06, 2015 6:25:07 AM net.sf.jsqlparser.test.select.SpecialOracleTest testAllSqlsParseDeparse
INFO: testing cast_multiset30.sql
Oct 06, 2015 6:25:07 AM net.sf.jsqlparser.test.select.SpecialOracleTest testAllSqlsParseDeparse
INFO:    -> SUCCESS
Oct 06, 2015 6:25:07 AM net.sf.jsqlparser.test.select.SpecialOracleTest testAllSqlsParseDeparse
INFO: testing simple09.sql
Oct 06, 2015 6:25:07 AM net.sf.jsqlparser.test.select.SpecialOracleTest testAllSqlsParseDeparse
INFO:    -> SUCCESS
Oct 06, 2015 6:25:07 AM net.sf.jsqlparser.test.select.SpecialOracleTest testAllSqlsParseDeparse
INFO: testing cast_multiset12.sql
Oct 06, 2015 6:25:07 AM net.sf.jsqlparser.test.select.SpecialOracleTest testAllSqlsParseDeparse
INFO:    -> PROBLEM net.sf.jsqlparser.JSQLParserException
Oct 06, 2015 6:25:07 AM net.sf.jsqlparser.test.select.SpecialOracleTest testAllSqlsParseDeparse
INFO: testing interval04.sql
Oct 06, 2015 6:25:07 AM net.sf.jsqlparser.test.select.SpecialOracleTest testAllSqlsParseDeparse
INFO:    -> SUCCESS
Oct 06, 2015 6:25:07 AM net.sf.jsqlparser.test.select.SpecialOracleTest testAllSqlsParseDeparse
INFO: testing function02.sql
Oct 06, 2015 6:25:07 AM net.sf.jsqlparser.test.select.SpecialOracleTest testAllSqlsParseDeparse
INFO:    -> SUCCESS
Oct 06, 2015 6:25:07 AM net.sf.jsqlparser.test.select.SpecialOracleTest testAllSqlsParseDeparse
INFO: testing groupby07.sql
Oct 06, 2015 6:25:07 AM net.sf.jsqlparser.test.select.SpecialOracleTest testAllSqlsParseDeparse
INFO:    -> PROBLEM net.sf.jsqlparser.JSQLParserException
Oct 06, 2015 6:25:07 AM net.sf.jsqlparser.test.select.SpecialOracleTest testAllSqlsParseDeparse
INFO: testing model_clause11.sql
Oct 06, 2015 6:25:07 AM net.sf.jsqlparser.test.select.SpecialOracleTest testAllSqlsParseDeparse
INFO:    -> PROBLEM net.sf.jsqlparser.JSQLParserException
Oct 06, 2015 6:25:07 AM net.sf.jsqlparser.test.select.SpecialOracleTest testAllSqlsParseDeparse
INFO: testing query_factoring11.sql
Oct 06, 2015 6:25:07 AM net.sf.jsqlparser.test.select.SpecialOracleTest testAllSqlsParseDeparse
INFO:    -> SUCCESS
Oct 06, 2015 6:25:07 AM net.sf.jsqlparser.test.select.SpecialOracleTest testAllSqlsParseDeparse
INFO: testing groupby21.sql
Oct 06, 2015 6:25:07 AM net.sf.jsqlparser.test.select.SpecialOracleTest testAllSqlsParseDeparse
INFO:    -> SUCCESS
Oct 06, 2015 6:25:07 AM net.sf.jsqlparser.test.select.SpecialOracleTest testAllSqlsParseDeparse
INFO: testing condition07.sql
Oct 06, 2015 6:25:07 AM net.sf.jsqlparser.test.select.SpecialOracleTest testAllSqlsParseDeparse
INFO:    -> PROBLEM net.sf.jsqlparser.JSQLParserException
Oct 06, 2015 6:25:07 AM net.sf.jsqlparser.test.select.SpecialOracleTest testAllSqlsParseDeparse
INFO: testing condition20.sql
Oct 06, 2015 6:25:07 AM net.sf.jsqlparser.test.select.SpecialOracleTest testAllSqlsParseDeparse
INFO:    -> SUCCESS
Oct 06, 2015 6:25:07 AM net.sf.jsqlparser.test.select.SpecialOracleTest testAllSqlsParseDeparse
INFO: testing analytic_query09.sql
Oct 06, 2015 6:25:07 AM net.sf.jsqlparser.test.select.SpecialOracleTest testAllSqlsParseDeparse
INFO:    -> PROBLEM net.sf.jsqlparser.JSQLParserException
Oct 06, 2015 6:25:07 AM net.sf.jsqlparser.test.select.SpecialOracleTest testAllSqlsParseDeparse
INFO: testing model_clause13.sql
Oct 06, 2015 6:25:07 AM net.sf.jsqlparser.test.select.SpecialOracleTest testAllSqlsParseDeparse
INFO:    -> PROBLEM net.sf.jsqlparser.JSQLParserException
Oct 06, 2015 6:25:07 AM net.sf.jsqlparser.test.select.SpecialOracleTest testAllSqlsParseDeparse
INFO: testing insert04.sql
Oct 06, 2015 6:25:07 AM net.sf.jsqlparser.test.select.SpecialOracleTest testAllSqlsParseDeparse
INFO:    -> PROBLEM net.sf.jsqlparser.JSQLParserException
Oct 06, 2015 6:25:07 AM net.sf.jsqlparser.test.select.SpecialOracleTest testAllSqlsParseDeparse
INFO: testing insert01.sql
Oct 06, 2015 6:25:07 AM net.sf.jsqlparser.test.select.SpecialOracleTest testAllSqlsParseDeparse
INFO:    -> PROBLEM net.sf.jsqlparser.JSQLParserException
Oct 06, 2015 6:25:07 AM net.sf.jsqlparser.test.select.SpecialOracleTest testAllSqlsParseDeparse
INFO: testing analytic_query06.sql
Oct 06, 2015 6:25:07 AM net.sf.jsqlparser.test.select.SpecialOracleTest testAllSqlsParseDeparse
INFO:    -> PROBLEM net.sf.jsqlparser.JSQLParserException
Oct 06, 2015 6:25:07 AM net.sf.jsqlparser.test.select.SpecialOracleTest testAllSqlsParseDeparse
INFO: testing cast_multiset05.sql
Oct 06, 2015 6:25:07 AM net.sf.jsqlparser.test.select.SpecialOracleTest testAllSqlsParseDeparse
INFO:    -> PROBLEM net.sf.jsqlparser.JSQLParserException
Oct 06, 2015 6:25:07 AM net.sf.jsqlparser.test.select.SpecialOracleTest testAllSqlsParseDeparse
INFO: testing cast_multiset01.sql
Oct 06, 2015 6:25:07 AM net.sf.jsqlparser.test.select.SpecialOracleTest testAllSqlsParseDeparse
INFO:    -> PROBLEM net.sf.jsqlparser.JSQLParserException
Oct 06, 2015 6:25:07 AM net.sf.jsqlparser.test.select.SpecialOracleTest testAllSqlsParseDeparse
INFO: testing insert06.sql
Oct 06, 2015 6:25:07 AM net.sf.jsqlparser.test.select.SpecialOracleTest testAllSqlsParseDeparse
INFO:    -> PROBLEM net.sf.jsqlparser.JSQLParserException
Oct 06, 2015 6:25:07 AM net.sf.jsqlparser.test.select.SpecialOracleTest testAllSqlsParseDeparse
INFO: testing insert08.sql
Oct 06, 2015 6:25:07 AM net.sf.jsqlparser.test.select.SpecialOracleTest testAllSqlsParseDeparse
INFO:    -> PROBLEM net.sf.jsqlparser.JSQLParserException
Oct 06, 2015 6:25:07 AM net.sf.jsqlparser.test.select.SpecialOracleTest testAllSqlsParseDeparse
INFO: testing keywordasidentifier02.sql
Oct 06, 2015 6:25:07 AM net.sf.jsqlparser.test.select.SpecialOracleTest testAllSqlsParseDeparse
INFO:    -> SUCCESS
Oct 06, 2015 6:25:07 AM net.sf.jsqlparser.test.select.SpecialOracleTest testAllSqlsParseDeparse
INFO: testing condition12.sql
Oct 06, 2015 6:25:07 AM net.sf.jsqlparser.test.select.SpecialOracleTest testAllSqlsParseDeparse
INFO:    -> SUCCESS
Oct 06, 2015 6:25:07 AM net.sf.jsqlparser.test.select.SpecialOracleTest testAllSqlsParseDeparse
INFO: testing pivot12.sql
Oct 06, 2015 6:25:07 AM net.sf.jsqlparser.test.select.SpecialOracleTest testAllSqlsParseDeparse
INFO:    -> PROBLEM net.sf.jsqlparser.JSQLParserException
Oct 06, 2015 6:25:07 AM net.sf.jsqlparser.test.select.SpecialOracleTest testAllSqlsParseDeparse
INFO: testing union03.sql
Oct 06, 2015 6:25:07 AM net.sf.jsqlparser.test.select.SpecialOracleTest testAllSqlsParseDeparse
INFO:    -> SUCCESS
Oct 06, 2015 6:25:07 AM net.sf.jsqlparser.test.select.SpecialOracleTest testAllSqlsParseDeparse
INFO: testing groupby17.sql
Oct 06, 2015 6:25:07 AM net.sf.jsqlparser.test.select.SpecialOracleTest testAllSqlsParseDeparse
INFO:    -> PROBLEM net.sf.jsqlparser.JSQLParserException
Oct 06, 2015 6:25:07 AM net.sf.jsqlparser.test.select.SpecialOracleTest testAllSqlsParseDeparse
INFO: testing condition14.sql
Oct 06, 2015 6:25:07 AM net.sf.jsqlparser.test.select.SpecialOracleTest testAllSqlsParseDeparse
INFO:    -> SUCCESS
Oct 06, 2015 6:25:07 AM net.sf.jsqlparser.test.select.SpecialOracleTest testAllSqlsParseDeparse
INFO: testing join20.sql
Oct 06, 2015 6:25:07 AM net.sf.jsqlparser.test.select.SpecialOracleTest testAllSqlsParseDeparse
INFO:    -> SUCCESS
Oct 06, 2015 6:25:07 AM net.sf.jsqlparser.test.select.SpecialOracleTest testAllSqlsParseDeparse
INFO: testing object_access01.sql
Oct 06, 2015 6:25:07 AM net.sf.jsqlparser.test.select.SpecialOracleTest testAllSqlsParseDeparse
INFO:    -> PROBLEM net.sf.jsqlparser.JSQLParserException
Oct 06, 2015 6:25:07 AM net.sf.jsqlparser.test.select.SpecialOracleTest testAllSqlsParseDeparse
INFO: testing groupby20.sql
Oct 06, 2015 6:25:07 AM net.sf.jsqlparser.test.select.SpecialOracleTest testAllSqlsParseDeparse
INFO:    -> SUCCESS
Oct 06, 2015 6:25:07 AM net.sf.jsqlparser.test.select.SpecialOracleTest testAllSqlsParseDeparse
INFO: testing join05.sql
Oct 06, 2015 6:25:07 AM net.sf.jsqlparser.test.select.SpecialOracleTest testAllSqlsParseDeparse
INFO:    -> PROBLEM net.sf.jsqlparser.JSQLParserException
Oct 06, 2015 6:25:07 AM net.sf.jsqlparser.test.select.SpecialOracleTest testAllSqlsParseDeparse
INFO: testing xmltable01.sql
Oct 06, 2015 6:25:07 AM net.sf.jsqlparser.test.select.SpecialOracleTest testAllSqlsParseDeparse
INFO:    -> PROBLEM net.sf.jsqlparser.JSQLParserException
Oct 06, 2015 6:25:07 AM net.sf.jsqlparser.test.select.SpecialOracleTest testAllSqlsParseDeparse
INFO: testing cast_multiset04.sql
Oct 06, 2015 6:25:07 AM net.sf.jsqlparser.test.select.SpecialOracleTest testAllSqlsParseDeparse
INFO:    -> PROBLEM net.sf.jsqlparser.JSQLParserException
Oct 06, 2015 6:25:07 AM net.sf.jsqlparser.test.select.SpecialOracleTest testAllSqlsParseDeparse
INFO: testing groupby18.sql
Oct 06, 2015 6:25:07 AM net.sf.jsqlparser.test.select.SpecialOracleTest testAllSqlsParseDeparse
INFO:    -> PROBLEM net.sf.jsqlparser.JSQLParserException
Oct 06, 2015 6:25:07 AM net.sf.jsqlparser.test.select.SpecialOracleTest testAllSqlsParseDeparse
INFO: testing cast_multiset31.sql
Oct 06, 2015 6:25:07 AM net.sf.jsqlparser.test.select.SpecialOracleTest testAllSqlsParseDeparse
INFO:    -> PROBLEM net.sf.jsqlparser.JSQLParserException
Oct 06, 2015 6:25:07 AM net.sf.jsqlparser.test.select.SpecialOracleTest testAllSqlsParseDeparse
INFO: testing groupby02.sql
Oct 06, 2015 6:25:07 AM net.sf.jsqlparser.test.select.SpecialOracleTest testAllSqlsParseDeparse
INFO:    -> PROBLEM net.sf.jsqlparser.JSQLParserException
Oct 06, 2015 6:25:07 AM net.sf.jsqlparser.test.select.SpecialOracleTest testAllSqlsParseDeparse
INFO: testing pivot07.sql
Oct 06, 2015 6:25:07 AM net.sf.jsqlparser.test.select.SpecialOracleTest testAllSqlsParseDeparse
INFO:    -> SUCCESS
Oct 06, 2015 6:25:07 AM net.sf.jsqlparser.test.select.SpecialOracleTest testAllSqlsParseDeparse
INFO: testing groupby23.sql
Oct 06, 2015 6:25:07 AM net.sf.jsqlparser.test.select.SpecialOracleTest testAllSqlsParseDeparse
INFO:    -> SUCCESS
Oct 06, 2015 6:25:07 AM net.sf.jsqlparser.test.select.SpecialOracleTest testAllSqlsParseDeparse
INFO: testing insert03.sql
Oct 06, 2015 6:25:07 AM net.sf.jsqlparser.test.select.SpecialOracleTest testAllSqlsParseDeparse
INFO:    -> PROBLEM net.sf.jsqlparser.JSQLParserException
Oct 06, 2015 6:25:07 AM net.sf.jsqlparser.test.select.SpecialOracleTest testAllSqlsParseDeparse
INFO: testing model_clause15.sql
Oct 06, 2015 6:25:07 AM net.sf.jsqlparser.test.select.SpecialOracleTest testAllSqlsParseDeparse
INFO:    -> PROBLEM net.sf.jsqlparser.JSQLParserException
Oct 06, 2015 6:25:07 AM net.sf.jsqlparser.test.select.SpecialOracleTest testAllSqlsParseDeparse
INFO: testing connect_by03.sql
Oct 06, 2015 6:25:07 AM net.sf.jsqlparser.test.select.SpecialOracleTest testAllSqlsParseDeparse
INFO:    -> SUCCESS
Oct 06, 2015 6:25:07 AM net.sf.jsqlparser.test.select.SpecialOracleTest testAllSqlsParseDeparse
INFO: testing cast_multiset07.sql
Oct 06, 2015 6:25:07 AM net.sf.jsqlparser.test.select.SpecialOracleTest testAllSqlsParseDeparse
INFO:    -> PROBLEM net.sf.jsqlparser.JSQLParserException
Oct 06, 2015 6:25:07 AM net.sf.jsqlparser.test.select.SpecialOracleTest testAllSqlsParseDeparse
INFO: testing simple08.sql
Oct 06, 2015 6:25:07 AM net.sf.jsqlparser.test.select.SpecialOracleTest testAllSqlsParseDeparse
INFO:    -> SUCCESS
Oct 06, 2015 6:25:07 AM net.sf.jsqlparser.test.select.SpecialOracleTest testAllSqlsParseDeparse
INFO: testing join08.sql
Oct 06, 2015 6:25:07 AM net.sf.jsqlparser.test.select.SpecialOracleTest testAllSqlsParseDeparse
INFO:    -> SUCCESS
Oct 06, 2015 6:25:07 AM net.sf.jsqlparser.test.select.SpecialOracleTest testAllSqlsParseDeparse
INFO: testing bindvar01.sql
Oct 06, 2015 6:25:07 AM net.sf.jsqlparser.test.select.SpecialOracleTest testAllSqlsParseDeparse
INFO:    -> SUCCESS
Oct 06, 2015 6:25:07 AM net.sf.jsqlparser.test.select.SpecialOracleTest testAllSqlsParseDeparse
INFO: testing insert09.sql
Oct 06, 2015 6:25:07 AM net.sf.jsqlparser.test.select.SpecialOracleTest testAllSqlsParseDeparse
INFO:    -> PROBLEM net.sf.jsqlparser.JSQLParserException
Oct 06, 2015 6:25:07 AM net.sf.jsqlparser.test.select.SpecialOracleTest testAllSqlsParseDeparse
INFO: testing numbers01.sql
Oct 06, 2015 6:25:07 AM net.sf.jsqlparser.test.select.SpecialOracleTest testAllSqlsParseDeparse
INFO:    -> PROBLEM net.sf.jsqlparser.JSQLParserException
Oct 06, 2015 6:25:07 AM net.sf.jsqlparser.test.select.SpecialOracleTest testAllSqlsParseDeparse
INFO: testing cast_multiset28.sql
Oct 06, 2015 6:25:07 AM net.sf.jsqlparser.test.select.SpecialOracleTest testAllSqlsParseDeparse
INFO:    -> SUCCESS
Oct 06, 2015 6:25:07 AM net.sf.jsqlparser.test.select.SpecialOracleTest testAllSqlsParseDeparse
INFO: testing bindvar05.sql
Oct 06, 2015 6:25:07 AM net.sf.jsqlparser.test.select.SpecialOracleTest testAllSqlsParseDeparse
INFO:    -> PROBLEM net.sf.jsqlparser.JSQLParserException
Oct 06, 2015 6:25:07 AM net.sf.jsqlparser.test.select.SpecialOracleTest testAllSqlsParseDeparse
INFO: testing cast_multiset32.sql
Oct 06, 2015 6:25:07 AM net.sf.jsqlparser.test.select.SpecialOracleTest testAllSqlsParseDeparse
INFO:    -> SUCCESS
Oct 06, 2015 6:25:07 AM net.sf.jsqlparser.test.select.SpecialOracleTest testAllSqlsParseDeparse
INFO: testing insert05.sql
Oct 06, 2015 6:25:07 AM net.sf.jsqlparser.test.select.SpecialOracleTest testAllSqlsParseDeparse
INFO:    -> PROBLEM net.sf.jsqlparser.JSQLParserException
Oct 06, 2015 6:25:07 AM net.sf.jsqlparser.test.select.SpecialOracleTest testAllSqlsParseDeparse
INFO: testing groupby03.sql
Oct 06, 2015 6:25:07 AM net.sf.jsqlparser.test.select.SpecialOracleTest testAllSqlsParseDeparse
INFO:    -> PROBLEM net.sf.jsqlparser.JSQLParserException
Oct 06, 2015 6:25:07 AM net.sf.jsqlparser.test.select.SpecialOracleTest testAllSqlsParseDeparse
INFO: testing groupby16.sql
Oct 06, 2015 6:25:07 AM net.sf.jsqlparser.test.select.SpecialOracleTest testAllSqlsParseDeparse
INFO:    -> PROBLEM net.sf.jsqlparser.JSQLParserException
Oct 06, 2015 6:25:07 AM net.sf.jsqlparser.test.select.SpecialOracleTest testAllSqlsParseDeparse
INFO: testing condition10.sql
Oct 06, 2015 6:25:07 AM net.sf.jsqlparser.test.select.SpecialOracleTest testAllSqlsParseDeparse
INFO:    -> SUCCESS
Oct 06, 2015 6:25:07 AM net.sf.jsqlparser.test.select.SpecialOracleTest testAllSqlsParseDeparse
INFO: testing query_factoring12.sql
Oct 06, 2015 6:25:07 AM net.sf.jsqlparser.test.select.SpecialOracleTest testAllSqlsParseDeparse
INFO:    -> SUCCESS
Oct 06, 2015 6:25:07 AM net.sf.jsqlparser.test.select.SpecialOracleTest testAllSqlsParseDeparse
INFO: testing model_clause09.sql
Oct 06, 2015 6:25:07 AM net.sf.jsqlparser.test.select.SpecialOracleTest testAllSqlsParseDeparse
INFO:    -> PROBLEM net.sf.jsqlparser.JSQLParserException
Oct 06, 2015 6:25:07 AM net.sf.jsqlparser.test.select.SpecialOracleTest testAllSqlsParseDeparse
INFO: testing insert12.sql
Oct 06, 2015 6:25:07 AM net.sf.jsqlparser.test.select.SpecialOracleTest testAllSqlsParseDeparse
INFO:    -> PROBLEM net.sf.jsqlparser.JSQLParserException
Oct 06, 2015 6:25:07 AM net.sf.jsqlparser.test.select.SpecialOracleTest testAllSqlsParseDeparse
INFO: testing explain01.sql
Oct 06, 2015 6:25:07 AM net.sf.jsqlparser.test.select.SpecialOracleTest testAllSqlsParseDeparse
INFO:    -> PROBLEM net.sf.jsqlparser.JSQLParserException
Oct 06, 2015 6:25:07 AM net.sf.jsqlparser.test.select.SpecialOracleTest testAllSqlsParseDeparse
INFO: testing model_clause12.sql
Oct 06, 2015 6:25:07 AM net.sf.jsqlparser.test.select.SpecialOracleTest testAllSqlsParseDeparse
INFO:    -> PROBLEM net.sf.jsqlparser.JSQLParserException
Oct 06, 2015 6:25:07 AM net.sf.jsqlparser.test.select.SpecialOracleTest testAllSqlsParseDeparse
INFO: testing condition05.sql
Oct 06, 2015 6:25:07 AM net.sf.jsqlparser.test.select.SpecialOracleTest testAllSqlsParseDeparse
INFO:    -> SUCCESS
Oct 06, 2015 6:25:07 AM net.sf.jsqlparser.test.select.SpecialOracleTest testAllSqlsParseDeparse
INFO: testing cast_multiset20.sql
Oct 06, 2015 6:25:07 AM net.sf.jsqlparser.test.select.SpecialOracleTest testAllSqlsParseDeparse
INFO:    -> SUCCESS
Oct 06, 2015 6:25:07 AM net.sf.jsqlparser.test.select.SpecialOracleTest testAllSqlsParseDeparse
INFO: testing groupby01.sql
Oct 06, 2015 6:25:07 AM net.sf.jsqlparser.test.select.SpecialOracleTest testAllSqlsParseDeparse
INFO:    -> PROBLEM net.sf.jsqlparser.JSQLParserException
Oct 06, 2015 6:25:07 AM net.sf.jsqlparser.test.select.SpecialOracleTest testAllSqlsParseDeparse
INFO: testing groupby06.sql
Oct 06, 2015 6:25:07 AM net.sf.jsqlparser.test.select.SpecialOracleTest testAllSqlsParseDeparse
INFO:    -> PROBLEM net.sf.jsqlparser.JSQLParserException
Oct 06, 2015 6:25:07 AM net.sf.jsqlparser.test.select.SpecialOracleTest testAllSqlsParseDeparse
INFO: testing bindvar02.sql
Oct 06, 2015 6:25:07 AM net.sf.jsqlparser.test.select.SpecialOracleTest testAllSqlsParseDeparse
INFO:    -> SUCCESS
Oct 06, 2015 6:25:07 AM net.sf.jsqlparser.test.select.SpecialOracleTest testAllSqlsParseDeparse
INFO: testing insert07.sql
Oct 06, 2015 6:25:07 AM net.sf.jsqlparser.test.select.SpecialOracleTest testAllSqlsParseDeparse
INFO:    -> PROBLEM net.sf.jsqlparser.JSQLParserException
Oct 06, 2015 6:25:07 AM net.sf.jsqlparser.test.select.SpecialOracleTest testAllSqlsParseDeparse
INFO: testing analytic_query07.sql
Oct 06, 2015 6:25:07 AM net.sf.jsqlparser.test.select.SpecialOracleTest testAllSqlsParseDeparse
INFO:    -> PROBLEM net.sf.jsqlparser.JSQLParserException
Oct 06, 2015 6:25:07 AM net.sf.jsqlparser.test.select.SpecialOracleTest testAllSqlsParseDeparse
INFO: testing for_update06.sql
Oct 06, 2015 6:25:07 AM net.sf.jsqlparser.test.select.SpecialOracleTest testAllSqlsParseDeparse
INFO:    -> PROBLEM net.sf.jsqlparser.JSQLParserException
Oct 06, 2015 6:25:07 AM net.sf.jsqlparser.test.select.SpecialOracleTest testAllSqlsParseDeparse
INFO: testing flashback01.sql
Oct 06, 2015 6:25:07 AM net.sf.jsqlparser.test.select.SpecialOracleTest testAllSqlsParseDeparse
INFO:    -> PROBLEM net.sf.jsqlparser.JSQLParserException
Oct 06, 2015 6:25:07 AM net.sf.jsqlparser.test.select.SpecialOracleTest testAllSqlsParseDeparse
INFO: testing condition09.sql
Oct 06, 2015 6:25:07 AM net.sf.jsqlparser.test.select.SpecialOracleTest testAllSqlsParseDeparse
INFO:    -> SUCCESS
Oct 06, 2015 6:25:07 AM net.sf.jsqlparser.test.select.SpecialOracleTest testAllSqlsParseDeparse
INFO: testing groupby11.sql
Oct 06, 2015 6:25:07 AM net.sf.jsqlparser.test.select.SpecialOracleTest testAllSqlsParseDeparse
INFO:    -> PROBLEM net.sf.jsqlparser.JSQLParserException
Oct 06, 2015 6:25:07 AM net.sf.jsqlparser.test.select.SpecialOracleTest testAllSqlsParseDeparse
INFO: testing groupby09.sql
Oct 06, 2015 6:25:07 AM net.sf.jsqlparser.test.select.SpecialOracleTest testAllSqlsParseDeparse
INFO:    -> SUCCESS
Oct 06, 2015 6:25:07 AM net.sf.jsqlparser.test.select.SpecialOracleTest testAllSqlsParseDeparse
INFO: testing lexer02.sql
Oct 06, 2015 6:25:07 AM net.sf.jsqlparser.test.select.SpecialOracleTest testAllSqlsParseDeparse
INFO:    -> PROBLEM net.sf.jsqlparser.JSQLParserException
Oct 06, 2015 6:25:07 AM net.sf.jsqlparser.test.select.SpecialOracleTest testAllSqlsParseDeparse
INFO: testing simple13.sql
Oct 06, 2015 6:25:07 AM net.sf.jsqlparser.test.select.SpecialOracleTest testAllSqlsParseDeparse
INFO:    -> PROBLEM net.sf.jsqlparser.JSQLParserException
Oct 06, 2015 6:25:07 AM net.sf.jsqlparser.test.select.SpecialOracleTest testAllSqlsParseDeparse
INFO: testing union10.sql
Oct 06, 2015 6:25:07 AM net.sf.jsqlparser.test.select.SpecialOracleTest testAllSqlsParseDeparse
INFO:    -> SUCCESS
Oct 06, 2015 6:25:07 AM net.sf.jsqlparser.test.select.SpecialOracleTest testAllSqlsParseDeparse
INFO: testing condition01.sql
Oct 06, 2015 6:25:07 AM net.sf.jsqlparser.test.select.SpecialOracleTest testAllSqlsParseDeparse
INFO:    -> SUCCESS
Oct 06, 2015 6:25:07 AM net.sf.jsqlparser.test.select.SpecialOracleTest testAllSqlsParseDeparse
INFO: testing connect_by01.sql
Oct 06, 2015 6:25:07 AM net.sf.jsqlparser.test.select.SpecialOracleTest testAllSqlsParseDeparse
INFO:    -> PROBLEM net.sf.jsqlparser.JSQLParserException
Oct 06, 2015 6:25:07 AM net.sf.jsqlparser.test.select.SpecialOracleTest testAllSqlsParseDeparse
INFO: testing for_update07.sql
Oct 06, 2015 6:25:07 AM net.sf.jsqlparser.test.select.SpecialOracleTest testAllSqlsParseDeparse
INFO:    -> PROBLEM net.sf.jsqlparser.JSQLParserException
Oct 06, 2015 6:25:07 AM net.sf.jsqlparser.test.select.SpecialOracleTest testAllSqlsParseDeparse
INFO: testing pivot03.sql
Oct 06, 2015 6:25:07 AM net.sf.jsqlparser.test.select.SpecialOracleTest testAllSqlsParseDeparse
INFO:    -> SUCCESS
Oct 06, 2015 6:25:07 AM net.sf.jsqlparser.test.select.SpecialOracleTest testAllSqlsParseDeparse
INFO: testing cast_multiset43.sql
Oct 06, 2015 6:25:07 AM net.sf.jsqlparser.test.select.SpecialOracleTest testAllSqlsParseDeparse
INFO:    -> SUCCESS
Oct 06, 2015 6:25:07 AM net.sf.jsqlparser.test.select.SpecialOracleTest testAllSqlsParseDeparse
INFO: testing function05.sql
Oct 06, 2015 6:25:07 AM net.sf.jsqlparser.test.select.SpecialOracleTest testAllSqlsParseDeparse
INFO:    -> PROBLEM net.sf.jsqlparser.JSQLParserException
Oct 06, 2015 6:25:07 AM net.sf.jsqlparser.test.select.SpecialOracleTest testAllSqlsParseDeparse
INFO: testing merge01.sql
Oct 06, 2015 6:25:07 AM net.sf.jsqlparser.test.select.SpecialOracleTest testAllSqlsParseDeparse
INFO:    -> PROBLEM net.sf.jsqlparser.JSQLParserException
Oct 06, 2015 6:25:07 AM net.sf.jsqlparser.test.select.SpecialOracleTest testAllSqlsParseDeparse
INFO: testing condition11.sql
Oct 06, 2015 6:25:07 AM net.sf.jsqlparser.test.select.SpecialOracleTest testAllSqlsParseDeparse
INFO:    -> PROBLEM net.sf.jsqlparser.JSQLParserException
Oct 06, 2015 6:25:07 AM net.sf.jsqlparser.test.select.SpecialOracleTest testAllSqlsParseDeparse
INFO: testing function06.sql
Oct 06, 2015 6:25:07 AM net.sf.jsqlparser.test.select.SpecialOracleTest testAllSqlsParseDeparse
INFO:    -> PROBLEM net.sf.jsqlparser.JSQLParserException
Oct 06, 2015 6:25:07 AM net.sf.jsqlparser.test.select.SpecialOracleTest testAllSqlsParseDeparse
INFO: testing union04.sql
Oct 06, 2015 6:25:07 AM net.sf.jsqlparser.test.select.SpecialOracleTest testAllSqlsParseDeparse
INFO:    -> PROBLEM net.sf.jsqlparser.JSQLParserException
Oct 06, 2015 6:25:07 AM net.sf.jsqlparser.test.select.SpecialOracleTest testAllSqlsParseDeparse
INFO: testing cast_multiset14.sql
Oct 06, 2015 6:25:07 AM net.sf.jsqlparser.test.select.SpecialOracleTest testAllSqlsParseDeparse
INFO:    -> PROBLEM net.sf.jsqlparser.JSQLParserException
Oct 06, 2015 6:25:07 AM net.sf.jsqlparser.test.select.SpecialOracleTest testAllSqlsParseDeparse
INFO: testing condition17.sql
Oct 06, 2015 6:25:07 AM net.sf.jsqlparser.test.select.SpecialOracleTest testAllSqlsParseDeparse
INFO:    -> PROBLEM net.sf.jsqlparser.JSQLParserException
Oct 06, 2015 6:25:07 AM net.sf.jsqlparser.test.select.SpecialOracleTest testAllSqlsParseDeparse
INFO: testing groupby15.sql
Oct 06, 2015 6:25:07 AM net.sf.jsqlparser.test.select.SpecialOracleTest testAllSqlsParseDeparse
INFO:    -> PROBLEM net.sf.jsqlparser.JSQLParserException
Oct 06, 2015 6:25:07 AM net.sf.jsqlparser.test.select.SpecialOracleTest testAllSqlsParseDeparse
INFO: testing model_clause06.sql
Oct 06, 2015 6:25:07 AM net.sf.jsqlparser.test.select.SpecialOracleTest testAllSqlsParseDeparse
INFO:    -> PROBLEM net.sf.jsqlparser.JSQLParserException
Oct 06, 2015 6:25:07 AM net.sf.jsqlparser.test.select.SpecialOracleTest testAllSqlsParseDeparse
INFO: testing interval03.sql
Oct 06, 2015 6:25:07 AM net.sf.jsqlparser.test.select.SpecialOracleTest testAllSqlsParseDeparse
INFO:    -> PROBLEM net.sf.jsqlparser.JSQLParserException
Oct 06, 2015 6:25:07 AM net.sf.jsqlparser.test.select.SpecialOracleTest testAllSqlsParseDeparse
INFO: testing pivot09.sql
Oct 06, 2015 6:25:07 AM net.sf.jsqlparser.test.select.SpecialOracleTest testAllSqlsParseDeparse
INFO:    -> SUCCESS
Oct 06, 2015 6:25:07 AM net.sf.jsqlparser.test.select.SpecialOracleTest testAllSqlsParseDeparse
INFO: testing query_factoring13.sql
Oct 06, 2015 6:25:07 AM net.sf.jsqlparser.test.select.SpecialOracleTest testAllSqlsParseDeparse
INFO:    -> PROBLEM net.sf.jsqlparser.JSQLParserException
Oct 06, 2015 6:25:07 AM net.sf.jsqlparser.test.select.SpecialOracleTest testAllSqlsParseDeparse
INFO: testing cast_multiset23.sql
Oct 06, 2015 6:25:07 AM net.sf.jsqlparser.test.select.SpecialOracleTest testAllSqlsParseDeparse
INFO:    -> SUCCESS
Oct 06, 2015 6:25:07 AM net.sf.jsqlparser.test.select.SpecialOracleTest testAllSqlsParseDeparse
INFO: testing join01.sql
Oct 06, 2015 6:25:07 AM net.sf.jsqlparser.test.select.SpecialOracleTest testAllSqlsParseDeparse
INFO:    -> SUCCESS
Oct 06, 2015 6:25:07 AM net.sf.jsqlparser.test.select.SpecialOracleTest testAllSqlsParseDeparse
INFO: testing cluster_set01.sql
Oct 06, 2015 6:25:07 AM net.sf.jsqlparser.test.select.SpecialOracleTest testAllSqlsParseDeparse
INFO:    -> PROBLEM net.sf.jsqlparser.JSQLParserException
Oct 06, 2015 6:25:07 AM net.sf.jsqlparser.test.select.SpecialOracleTest testAllSqlsParseDeparse
INFO: testing cast_multiset37.sql
Oct 06, 2015 6:25:07 AM net.sf.jsqlparser.test.select.SpecialOracleTest testAllSqlsParseDeparse
INFO:    -> PROBLEM net.sf.jsqlparser.JSQLParserException
Oct 06, 2015 6:25:07 AM net.sf.jsqlparser.test.select.SpecialOracleTest testAllSqlsParseDeparse
INFO: testing cast_multiset25.sql
Oct 06, 2015 6:25:07 AM net.sf.jsqlparser.test.select.SpecialOracleTest testAllSqlsParseDeparse
INFO:    -> SUCCESS
Oct 06, 2015 6:25:07 AM net.sf.jsqlparser.test.select.SpecialOracleTest testAllSqlsParseDeparse
INFO: testing function01.sql
Oct 06, 2015 6:25:07 AM net.sf.jsqlparser.test.select.SpecialOracleTest testAllSqlsParseDeparse
INFO:    -> SUCCESS
Oct 06, 2015 6:25:07 AM net.sf.jsqlparser.test.select.SpecialOracleTest testAllSqlsParseDeparse
INFO: testing condition18.sql
Oct 06, 2015 6:25:07 AM net.sf.jsqlparser.test.select.SpecialOracleTest testAllSqlsParseDeparse
INFO:    -> PROBLEM net.sf.jsqlparser.JSQLParserException
Oct 06, 2015 6:25:07 AM net.sf.jsqlparser.test.select.SpecialOracleTest testAllSqlsParseDeparse
INFO: testing join11.sql
Oct 06, 2015 6:25:07 AM net.sf.jsqlparser.test.select.SpecialOracleTest testAllSqlsParseDeparse
INFO:    -> SUCCESS
Oct 06, 2015 6:25:07 AM net.sf.jsqlparser.test.select.SpecialOracleTest testAllSqlsParseDeparse
INFO: testing model_clause14.sql
Oct 06, 2015 6:25:07 AM net.sf.jsqlparser.test.select.SpecialOracleTest testAllSqlsParseDeparse
INFO:    -> PROBLEM net.sf.jsqlparser.JSQLParserException
Oct 06, 2015 6:25:07 AM net.sf.jsqlparser.test.select.SpecialOracleTest testAllSqlsParseDeparse
INFO: testing join06.sql
Oct 06, 2015 6:25:07 AM net.sf.jsqlparser.test.select.SpecialOracleTest testAllSqlsParseDeparse
INFO:    -> SUCCESS
Oct 06, 2015 6:25:07 AM net.sf.jsqlparser.test.select.SpecialOracleTest testAllSqlsParseDeparse
INFO: testing groupby05.sql
Oct 06, 2015 6:25:07 AM net.sf.jsqlparser.test.select.SpecialOracleTest testAllSqlsParseDeparse
INFO:    -> PROBLEM net.sf.jsqlparser.JSQLParserException
Oct 06, 2015 6:25:07 AM net.sf.jsqlparser.test.select.SpecialOracleTest testAllSqlsParseDeparse
INFO: testing lexer05.sql
Oct 06, 2015 6:25:07 AM net.sf.jsqlparser.test.select.SpecialOracleTest testAllSqlsParseDeparse
INFO:    -> SUCCESS
Oct 06, 2015 6:25:07 AM net.sf.jsqlparser.test.select.SpecialOracleTest testAllSqlsParseDeparse
INFO: testing case_when04.sql
Oct 06, 2015 6:25:07 AM net.sf.jsqlparser.test.select.SpecialOracleTest testAllSqlsOnlyParse
INFO: testing comment02.sql
Oct 06, 2015 6:25:07 AM net.sf.jsqlparser.test.select.SpecialOracleTest testAllSqlsOnlyParse
INFO:    -> SUCCESS
Oct 06, 2015 6:25:07 AM net.sf.jsqlparser.test.select.SpecialOracleTest testAllSqlsOnlyParse
INFO: testing numbers02.sql
Oct 06, 2015 6:25:07 AM net.sf.jsqlparser.test.select.SpecialOracleTest testAllSqlsOnlyParse
INFO:    -> SUCCESS
Oct 06, 2015 6:25:07 AM net.sf.jsqlparser.test.select.SpecialOracleTest testAllSqlsOnlyParse
INFO: testing comment01.sql
Oct 06, 2015 6:25:07 AM net.sf.jsqlparser.test.select.SpecialOracleTest testAllSqlsOnlyParse
INFO:    -> SUCCESS
Tests run: 2, Failures: 1, Errors: 0, Skipped: 0, Time elapsed: 7.095 sec <<< FAILURE!
Running net.sf.jsqlparser.test.select.SelectTest
Tests run: 228, Failures: 14, Errors: 0, Skipped: 0, Time elapsed: 0.193 sec <<< FAILURE!
Running net.sf.jsqlparser.test.select.SpeedTest
42500 statements parsed in 7714 milliseconds
 (5509 statements per second,  0.0001815 seconds per statement )
38500 select scans for table name executed in 132 milliseconds
 (291666 select scans for table name per second,  0.0000034 seconds per select scans for table name)
Tests run: 1, Failures: 0, Errors: 0, Skipped: 0, Time elapsed: 7.849 sec
Running net.sf.jsqlparser.test.truncate.TruncateTest
Tests run: 1, Failures: 0, Errors: 0, Skipped: 0, Time elapsed: 0 sec
Running net.sf.jsqlparser.util.TablesNamesFinderTest
Tests run: 19, Failures: 0, Errors: 0, Skipped: 0, Time elapsed: 0.013 sec
Running net.sf.jsqlparser.util.ConnectExpressionsVisitorTest
Tests run: 2, Failures: 0, Errors: 0, Skipped: 0, Time elapsed: 0.004 sec
Running net.sf.jsqlparser.util.AddAliasesVisitorTest
Tests run: 4, Failures: 0, Errors: 0, Skipped: 0, Time elapsed: 0.002 sec
Running net.sf.jsqlparser.util.SelectUtilsTest
Tests run: 6, Failures: 0, Errors: 0, Skipped: 0, Time elapsed: 0.003 sec
Running net.sf.jsqlparser.expression.ExpressionVisitorAdapterTest
Tests run: 2, Failures: 0, Errors: 0, Skipped: 0, Time elapsed: 0.003 sec
Running net.sf.jsqlparser.expression.SignedExpressionTest
Tests run: 1, Failures: 0, Errors: 0, Skipped: 0, Time elapsed: 0.001 sec
Running net.sf.jsqlparser.schema.ServerTest
Tests run: 2, Failures: 0, Errors: 0, Skipped: 0, Time elapsed: 0.001 sec
Running net.sf.jsqlparser.parser.CCJSqlParserUtilTest
Tests run: 3, Failures: 0, Errors: 0, Skipped: 0, Time elapsed: 0.001 sec
Running net.sf.jsqlparser.statement.SetStatementTest
Tests run: 1, Failures: 0, Errors: 0, Skipped: 0, Time elapsed: 0.004 sec
Running net.sf.jsqlparser.statement.AdaptersTest
Tests run: 1, Failures: 0, Errors: 0, Skipped: 0, Time elapsed: 0.002 sec
Running net.sf.jsqlparser.statement.StatementsTest
Tests run: 1, Failures: 0, Errors: 0, Skipped: 0, Time elapsed: 0.001 sec
Running net.sf.jsqlparser.statement.execute.ExecuteTest
Tests run: 1, Failures: 0, Errors: 0, Skipped: 0, Time elapsed: 0.001 sec

Results :

Failed tests:   testAllSqlsParseDeparse(net.sf.jsqlparser.test.select.SpecialOracleTest): expected:<...tion by bo# order by[ staleness,osize,]obj#)=1 then 32 else...> but was:<...tion by bo# order by[,stalenessosize]obj#)=1 then 32 else...>
  testProblemSqlAnalytic(net.sf.jsqlparser.test.select.SelectTest): expected:<...er() OVER (ORDER BY []a) AS n FROM table1> but was:<...er() OVER (ORDER BY [, ]a) AS n FROM table1>
  testProblemSqlAnalytic10Lag(net.sf.jsqlparser.test.select.SelectTest): expected:<...ITION BY c ORDER BY [a, ]b) AS n FROM table1> but was:<...ITION BY c ORDER BY [, a]b) AS n FROM table1>
  testProblemSqlAnalytic11Lag(net.sf.jsqlparser.test.select.SelectTest): expected:<...ITION BY c ORDER BY [a, ]b) AS n FROM table1> but was:<...ITION BY c ORDER BY [, a]b) AS n FROM table1>
  testAnalyticFunctionProblem1(net.sf.jsqlparser.test.select.SelectTest): expected:<..._id, 'mm') ORDER BY []s.date_id) AS col FR...> but was:<..._id, 'mm') ORDER BY [, ]s.date_id) AS col FR...>
  testAnalyticFunction12(net.sf.jsqlparser.test.select.SelectTest): expected:<...ITION BY b ORDER BY []c) FROM tab1> but was:<...ITION BY b ORDER BY [, ]c) FROM tab1>
  testAnalyticFunction15(net.sf.jsqlparser.test.select.SelectTest): expected:<...M(a) OVER (ORDER BY []c) FROM tab1> but was:<...M(a) OVER (ORDER BY [, ]c) FROM tab1>
  testAnalyticFunction16(net.sf.jsqlparser.test.select.SelectTest): expected:<...M(a) OVER (ORDER BY []c NULLS FIRST) FROM ...> but was:<...M(a) OVER (ORDER BY [, ]c NULLS FIRST) FROM ...>
  testAnalyticFunction17(net.sf.jsqlparser.test.select.SelectTest): expected:<... BY deptno ORDER BY []sal ROWS BETWEEN 0 P...> but was:<... BY deptno ORDER BY [, ]sal ROWS BETWEEN 0 P...>
  testAnalyticFunction18(net.sf.jsqlparser.test.select.SelectTest): expected:<... BY deptno ORDER BY []sal RANGE CURRENT RO...> but was:<... BY deptno ORDER BY [, ]sal RANGE CURRENT RO...>
  testProblemSqlAnalytic6AggregateColumnValue(net.sf.jsqlparser.test.select.SelectTest): expected:<...+ 5) OVER (ORDER BY []a) AS n FROM table1> but was:<...+ 5) OVER (ORDER BY [, ]a) AS n FROM table1>
  testProblemSqlAnalytic2(net.sf.jsqlparser.test.select.SelectTest): expected:<...er() OVER (ORDER BY [a, ]b) AS n FROM table1> but was:<...er() OVER (ORDER BY [, a]b) AS n FROM table1>
  testProblemSqlAnalytic3(net.sf.jsqlparser.test.select.SelectTest): expected:<...ITION BY c ORDER BY [a, ]b) AS n FROM table1> but was:<...ITION BY c ORDER BY [, a]b) AS n FROM table1>
  testProblemSqlAnalytic9CommaListPartition(net.sf.jsqlparser.test.select.SelectTest): expected:<...ON BY c, d ORDER BY [a, ]b) AS n FROM table1> but was:<...ON BY c, d ORDER BY [, a]b) AS n FROM table1>
  testAnalyticFunctionProblem1b(net.sf.jsqlparser.test.select.SelectTest): expected:<..._id, 'mm') ORDER BY []s.date_id ROWS BETWE...> but was:<..._id, 'mm') ORDER BY [, ]s.date_id ROWS BETWE...>

Tests run: 353, Failures: 15, Errors: 0, Skipped: 0

[INFO] ------------------------------------------------------------------------
[INFO] BUILD FAILURE
[INFO] ------------------------------------------------------------------------
[INFO] Total time: 22.152s
[INFO] Finished at: Tue Oct 06 06:25:15 CEST 2015
[INFO] Final Memory: 23M/346M
[INFO] ------------------------------------------------------------------------
[ERROR] Failed to execute goal org.apache.maven.plugins:maven-surefire-plugin:2.10:test (default-test) on project jsqlparser: There are test failures.
[ERROR] 
[ERROR] Please refer to /home/perham/Study/Experiments/2015-10-23-ICST/LittleDarwin/Cases/JSqlParser-jsqlparser-0.9.4/target/surefire-reports for the individual test results.
[ERROR] -> [Help 1]
[ERROR] 
[ERROR] To see the full stack trace of the errors, re-run Maven with the -e switch.
[ERROR] Re-run Maven using the -X switch to enable full debug logging.
[ERROR] 
[ERROR] For more information about the errors and possible solutions, please read the following articles:
[ERROR] [Help 1] http://cwiki.apache.org/confluence/display/MAVEN/MojoFailureException
